{"text_format":"1","workbook":"xlsx","n_sheets":6,"sheets":["Form","Data Entry (contributions)","Data Entry (efficiencies)","ContDataSheet","EffDataSheet","Sheet1"],"not_rendered":{"charts":0,"images":1,"macros":1,"external_links":0,"defined_names":30,"comments":0,"pivot_tables":0},"unopened":[],"bounds":{"document_bytes":16777216,"sheet_cells":100000,"rows_first":2000,"rows_last":500,"rows_between":2000,"halvings":0,"cell_chars":16384,"cell_head_chars":4096},"cells_cut":0,"cells_raw":0,"read":"whole","date_system":"1900"}

{"sheet":"Form","index":0,"n_rows":141,"n_cols":38,"rows_kept":141,"cut":false,"hidden":false,"merged":[[83,25,83,26],[83,27,83,28],[83,29,83,30],[83,31,83,32],[83,33,83,34],[83,35,83,36],[83,37,83,38],[82,35,82,36],[82,37,82,38],[83,2,83,5],[83,6,83,13],[83,14,83,21],[75,23,75,24],[75,25,75,26],[75,27,75,28],[75,29,75,30],[75,31,75,32],[75,33,75,34],[81,23,81,24],[81,25,81,26],[81,27,81,28],[81,29,81,30],[82,2,82,5],[82,6,82,13],[82,14,82,21],[82,23,82,24],[82,25,82,26],[82,27,82,28],[82,29,82,30],[82,31,82,32],[82,33,82,34],[78,25,78,26],[78,27,78,28],[75,35,75,36],[75,37,75,38],[77,25,77,26],[77,27,77,28],[77,29,77,30],[77,31,77,32],[77,33,77,34],[77,35,77,36],[77,37,77,38],[78,29,78,30],[78,31,78,32],[78,33,78,34],[78,35,78,36],[78,37,78,38],[81,2,81,5],[81,6,81,13],[81,14,81,21],[81,31,81,32],[81,33,81,34],[81,35,81,36],[81,37,81,38],[78,23,78,24],[78,14,78,21],[78,6,78,13],[78,2,78,5],[80,6,80,13],[80,2,80,5],[79,37,79,38],[79,35,79,36],[79,33,79,34],[79,31,79,32],[79,29,79,30],[79,27,79,28],[74,25,74,26],[74,27,74,28],[74,29,74,30],[74,31,74,32],[74,33,74,34],[74,35,74,36],[74,37,74,38],[76,2,76,5],[76,6,76,13],[76,14,76,21],[76,23,76,24],[76,25,76,26],[76,27,76,28],[76,29,76,30],[76,31,76,32],[76,33,76,34],[76,35,76,36],[76,37,76,38],[74,2,74,5],[74,6,74,13],[74,14,74,21],[75,2,75,5],[75,6,75,13],[75,14,75,21],[79,25,79,26],[79,23,79,24],[79,14,79,21],[79,6,79,13],[79,2,79,5],[80,37,80,38],[80,35,80,36],[80,33,80,34],[80,31,80,32],[80,29,80,30],[80,27,80,28],[80,25,80,26],[80,23,80,24],[80,14,80,21],[107,2,107,5],[107,6,107,13],[107,14,107,21],[107,23,107,24],[107,25,107,26],[107,27,107,28],[107,29,107,30],[107,31,107,32],[107,33,107,34],[23,17,23,38],[53,23,53,24],[24,21,24,22],[24,23,24,24],[24,25,24,26],[24,27,24,28],[24,29,24,30],[24,31,24,32],[24,33,24,34],[28,25,28,26],[28,27,28,28],[28,29,28,30],[28,31,28,32],[28,33,28,34],[30,17,30,18],[31,17,31,18],[32,17,32,18],[33,17,33,18],[34,17,34,18],[35,17,35,18],[36,17,36,18],[27,17,27,38],[28,19,28,20],[48,17,48,18],[33,10,33,15],[34,10,34,15],[35,10,35,15],[36,10,36,15],[37,10,37,15],[38,10,38,15],[39,10,39,15],[40,10,40,15],[41,10,41,15],[54,23,54,24],[25,21,25,22],[25,23,25,24],[25,25,25,26],[25,27,25,28],[25,29,25,30],[25,31,25,32],[25,33,25,34],[25,36,25,38],[28,21,28,22],[28,23,28,24],[50,21,50,22],[51,17,52,26],[37,17,37,18],[38,17,38,18],[39,17,39,18],[40,17,40,18],[41,17,41,18],[42,17,42,18],[43,17,43,18],[44,17,44,18],[45,17,45,18],[46,17,46,18],[47,17,47,18],[29,10,29,15],[49,17,49,18],[29,33,29,34],[30,33,30,34],[31,33,31,34],[32,33,32,34],[33,33,33,34],[34,33,34,34],[35,33,35,34],[36,33,36,34],[37,33,37,34],[38,33,38,34],[39,33,39,34],[40,33,40,34],[41,33,41,34],[42,33,42,34],[43,33,43,34],[44,33,44,34],[45,33,45,34],[46,33,46,34],[47,33,47,34],[48,33,48,34],[49,33,49,34],[29,17,29,18],[30,10,30,15],[31,10,31,15],[32,10,32,15],[108,25,108,26],[108,27,108,28],[108,29,108,30],[84,25,84,26],[84,27,84,28],[84,29,84,30],[72,25,72,26],[72,27,72,28],[72,29,72,30],[70,25,70,26],[70,27,70,28],[70,29,70,30],[68,25,68,26],[68,27,68,28],[68,29,68,30],[66,25,66,26],[66,27,66,28],[66,29,66,30],[64,25,64,26],[64,27,64,28],[64,29,64,30],[108,31,108,32],[108,33,108,34],[108,35,108,36],[108,37,108,38],[86,25,86,26],[86,27,86,28],[86,29,86,30],[86,31,86,32],[86,33,86,34],[86,35,86,36],[86,37,86,38],[107,35,107,36],[107,37,107,38],[87,35,87,36],[87,37,87,38],[84,31,84,32],[84,33,84,34],[84,35,84,36],[84,37,84,38],[85,25,85,26],[85,27,85,28],[85,29,85,30],[85,31,85,32],[85,33,85,34],[85,35,85,36],[85,37,85,38],[72,31,72,32],[72,33,72,34],[72,35,72,36],[72,37,72,38],[73,25,73,26],[73,27,73,28],[73,29,73,30],[73,31,73,32],[73,33,73,34],[73,35,73,36],[73,37,73,38],[70,31,70,32],[70,33,70,34],[70,35,70,36],[70,37,70,38],[71,25,71,26],[71,27,71,28],[71,29,71,30],[71,31,71,32],[71,33,71,34],[71,35,71,36],[71,37,71,38],[68,31,68,32],[68,33,68,34],[68,35,68,36],[68,37,68,38],[69,25,69,26],[69,27,69,28],[69,29,69,30],[69,31,69,32],[69,33,69,34],[69,35,69,36],[69,37,69,38],[66,31,66,32],[66,33,66,34],[66,35,66,36],[66,37,66,38],[67,25,67,26],[67,27,67,28],[67,29,67,30],[67,31,67,32],[67,33,67,34],[67,35,67,36],[67,37,67,38],[64,31,64,32],[64,33,64,34],[64,35,64,36],[64,37,64,38],[65,25,65,26],[65,27,65,28],[65,29,65,30],[65,31,65,32],[65,33,65,34],[65,35,65,36],[65,37,65,38],[62,25,62,26],[62,27,62,28],[62,29,62,30],[62,31,62,32],[62,33,62,34],[62,35,62,36],[62,37,62,38],[63,25,63,26],[63,27,63,28],[63,29,63,30],[63,31,63,32],[63,33,63,34],[63,35,63,36],[63,37,63,38],[60,25,60,26],[60,27,60,28],[60,29,60,30],[60,31,60,32],[60,33,60,34],[60,35,60,36],[60,37,60,38],[61,25,61,26],[61,27,61,28],[61,29,61,30],[61,31,61,32],[61,33,61,34],[61,35,61,36],[61,37,61,38],[58,31,58,32],[58,33,58,34],[58,35,58,36],[58,37,58,38],[59,25,59,26],[59,27,59,28],[59,29,59,30],[59,31,59,32],[59,33,59,34],[59,35,59,36],[59,37,59,38],[86,14,86,21],[77,14,77,21],[58,23,58,24],[59,23,59,24],[60,23,60,24],[61,23,61,24],[62,23,62,24],[63,23,63,24],[64,23,64,24],[65,23,65,24],[66,23,66,24],[67,23,67,24],[68,23,68,24],[69,23,69,24],[70,23,70,24],[71,23,71,24],[72,23,72,24],[73,23,73,24],[84,23,84,24],[85,23,85,24],[86,23,86,24],[77,23,77,24],[83,23,83,24],[74,23,74,24],[65,2,65,5],[66,2,66,5],[58,6,58,13],[59,6,59,13],[60,6,60,13],[61,6,61,13],[62,6,62,13],[63,6,63,13],[64,6,64,13],[65,6,65,13],[58,2,58,5],[59,2,59,5],[60,2,60,5],[61,2,61,5],[62,2,62,5],[63,2,63,5],[64,2,64,5],[48,2,48,5],[48,6,48,9],[48,36,48,38],[48,19,48,20],[48,21,48,22],[48,23,48,24],[49,31,49,32],[57,29,57,30],[57,31,57,32],[57,33,57,34],[57,35,57,36],[57,37,57,38],[53,37,53,38],[53,35,53,36],[53,33,53,34],[53,31,53,32],[53,29,53,30],[53,27,53,28],[53,25,53,26],[55,13,55,22],[55,25,55,26],[55,27,55,28],[48,10,48,15],[55,29,55,30],[18,32,18,38],[18,2,18,14],[35,36,35,38],[37,6,37,9],[37,36,37,38],[36,2,36,5],[36,6,36,9],[41,2,41,5],[41,6,41,9],[41,36,41,38],[40,2,40,5],[40,6,40,9],[40,36,40,38],[31,19,31,20],[28,17,28,18],[34,25,34,26],[34,27,34,28],[34,29,34,30],[34,31,34,32],[35,19,35,20],[35,21,35,22],[35,23,35,24],[35,25,35,26],[35,27,35,28],[43,2,43,5],[43,6,43,9],[43,36,43,38],[10,2,10,8],[10,10,10,19],[30,36,30,38],[31,2,31,5],[31,6,31,9],[31,36,31,38],[32,6,32,9],[29,31,29,32],[29,29,29,30],[29,27,29,28],[29,25,29,26],[29,23,29,24],[29,21,29,22],[29,19,29,20],[30,19,30,20],[30,21,30,22],[30,23,30,24],[30,25,30,26],[30,27,30,28],[30,29,30,30],[30,31,30,32],[2,6,2,34],[32,36,32,38],[29,36,29,38],[30,6,30,9],[3,2,3,38],[18,16,18,22],[18,24,18,30],[33,2,33,5],[32,2,32,5],[31,25,31,26],[31,27,31,28],[31,29,31,30],[31,31,31,32],[32,25,32,26],[32,27,32,28],[32,29,32,30],[32,31,32,32],[33,25,33,26],[33,27,33,28],[33,29,33,30],[33,31,33,32],[21,13,21,22],[21,2,21,11],[21,24,21,30],[109,7,110,30],[5,2,6,38],[7,2,7,38],[14,2,14,11],[14,13,14,22],[29,2,29,5],[30,2,30,5],[29,6,29,9],[33,6,33,9],[33,36,33,38],[35,2,35,5],[35,6,35,9],[34,2,34,5],[34,6,34,9],[34,36,34,38],[37,2,37,5],[36,36,36,38],[39,2,39,5],[39,6,39,9],[39,36,39,38],[38,2,38,5],[38,6,38,9],[38,36,38,38],[42,2,42,5],[42,6,42,9],[42,36,42,38],[45,2,45,5],[45,6,45,9],[45,36,45,38],[44,2,44,5],[44,6,44,9],[44,36,44,38],[42,10,42,15],[43,10,43,15],[44,10,44,15],[45,10,45,15],[44,19,44,20],[44,21,44,22],[44,23,44,24],[44,25,44,26],[44,27,44,28],[44,29,44,30],[45,19,45,20],[45,21,45,22],[45,23,45,24],[45,25,45,26],[45,27,45,28],[45,29,45,30],[47,2,47,5],[47,6,47,9],[47,36,47,38],[46,2,46,5],[46,6,46,9],[46,36,46,38],[46,10,46,15],[47,10,47,15],[67,2,67,5],[47,31,47,32],[48,31,48,32],[56,23,56,38],[54,25,54,26],[54,27,54,28],[54,29,54,30],[54,31,54,32],[54,33,54,34],[54,35,54,36],[54,37,54,38],[54,13,54,22],[57,25,57,26],[57,27,57,28],[65,14,65,21],[49,36,49,38],[68,2,68,5],[69,2,69,5],[70,2,70,5],[71,2,71,5],[72,2,72,5],[68,6,68,13],[69,6,69,13],[70,6,70,13],[71,6,71,13],[72,6,72,13],[73,2,73,5],[84,2,84,5],[85,2,85,5],[86,2,86,5],[77,2,77,5],[66,6,66,13],[67,6,67,13],[31,21,31,22],[31,23,31,24],[32,19,32,20],[32,21,32,22],[32,23,32,24],[33,19,33,20],[33,21,33,22],[33,23,33,24],[34,19,34,20],[34,21,34,22],[34,23,34,24],[36,19,36,20],[36,21,36,22],[36,23,36,24],[38,19,38,20],[38,21,38,22],[38,23,38,24],[35,29,35,30],[35,31,35,32],[36,25,36,26],[36,27,36,28],[36,29,36,30],[36,31,36,32],[37,19,37,20],[37,21,37,22],[37,23,37,24],[37,25,37,26],[37,27,37,28],[37,29,37,30],[37,31,37,32],[38,25,38,26],[38,27,38,28],[38,29,38,30],[38,31,38,32],[39,19,39,20],[39,21,39,22],[39,23,39,24],[39,25,39,26],[39,27,39,28],[39,29,39,30],[39,31,39,32],[40,19,40,20],[40,21,40,22],[40,23,40,24],[40,25,40,26],[40,27,40,28],[40,29,40,30],[40,31,40,32],[44,31,44,32],[41,19,41,20],[41,21,41,22],[41,23,41,24],[41,25,41,26],[41,27,41,28],[41,29,41,30],[41,31,41,32],[42,19,42,20],[42,21,42,22],[42,23,42,24],[42,25,42,26],[42,27,42,28],[42,29,42,30],[42,31,42,32],[43,19,43,20],[43,31,43,32],[45,31,45,32],[46,19,46,20],[46,21,46,22],[46,23,46,24],[46,25,46,26],[46,27,46,28],[46,29,46,30],[46,31,46,32],[47,19,47,20],[47,21,47,22],[86,6,86,13],[77,6,77,13],[43,23,43,24],[43,25,43,26],[43,27,43,28],[43,29,43,30],[47,23,47,24],[47,25,47,26],[47,27,47,28],[47,29,47,30],[43,21,43,22],[48,25,48,26],[48,27,48,28],[48,29,48,30],[49,19,49,20],[49,21,49,22],[49,23,49,24],[49,25,49,26],[49,27,49,28],[49,29,49,30],[58,14,58,21],[59,14,59,21],[60,14,60,21],[61,14,61,21],[55,31,55,32],[55,33,55,34],[55,35,55,36],[55,37,55,38],[55,23,55,24],[73,6,73,13],[84,6,84,13],[85,6,85,13],[62,14,62,21],[63,14,63,21],[64,14,64,21],[66,14,66,21],[67,14,67,21],[68,14,68,21],[69,14,69,21],[70,14,70,21],[71,14,71,21],[72,14,72,21],[73,14,73,21],[84,14,84,21],[85,14,85,21],[58,25,58,26],[58,27,58,28],[58,29,58,30],[87,6,87,13],[87,2,87,5],[87,14,87,21],[87,23,87,24],[87,25,87,26],[87,27,87,28],[87,29,87,30],[87,31,87,32],[87,33,87,34],[88,23,88,24],[88,25,88,26],[88,27,88,28],[88,29,88,30],[88,31,88,32],[88,33,88,34],[88,35,88,36],[88,37,88,38],[89,23,89,24],[89,25,89,26],[89,27,89,28],[89,29,89,30],[89,31,89,32],[89,33,89,34],[89,35,89,36],[89,37,89,38],[90,23,90,24],[90,25,90,26],[90,27,90,28],[90,29,90,30],[90,31,90,32],[90,33,90,34],[90,35,90,36],[90,37,90,38],[91,23,91,24],[91,25,91,26],[91,27,91,28],[91,29,91,30],[91,31,91,32],[91,33,91,34],[91,35,91,36],[91,37,91,38],[92,23,92,24],[92,25,92,26],[92,27,92,28],[92,29,92,30],[92,31,92,32],[92,33,92,34],[92,35,92,36],[92,37,92,38],[93,23,93,24],[93,25,93,26],[93,27,93,28],[93,29,93,30],[93,31,93,32],[93,33,93,34],[93,35,93,36],[93,37,93,38],[94,23,94,24],[94,25,94,26],[94,27,94,28],[94,29,94,30],[94,31,94,32],[94,33,94,34],[94,35,94,36],[94,37,94,38],[95,23,95,24],[95,25,95,26],[95,27,95,28],[95,29,95,30],[95,31,95,32],[95,33,95,34],[95,35,95,36],[95,37,95,38],[96,23,96,24],[96,25,96,26],[96,27,96,28],[96,29,96,30],[96,31,96,32],[96,33,96,34],[96,35,96,36],[96,37,96,38],[97,23,97,24],[97,25,97,26],[97,27,97,28],[97,29,97,30],[97,31,97,32],[97,33,97,34],[97,35,97,36],[97,37,97,38],[98,23,98,24],[98,25,98,26],[98,27,98,28],[98,29,98,30],[98,31,98,32],[98,33,98,34],[98,35,98,36],[98,37,98,38],[99,23,99,24],[99,25,99,26],[99,27,99,28],[99,29,99,30],[99,31,99,32],[99,33,99,34],[99,35,99,36],[99,37,99,38],[100,23,100,24],[100,25,100,26],[100,27,100,28],[100,29,100,30],[100,31,100,32],[100,33,100,34],[100,35,100,36],[100,37,100,38],[101,23,101,24],[101,25,101,26],[101,27,101,28],[101,29,101,30],[101,31,101,32],[101,33,101,34],[101,35,101,36],[101,37,101,38],[102,23,102,24],[102,25,102,26],[102,27,102,28],[102,29,102,30],[102,31,102,32],[102,33,102,34],[102,35,102,36],[102,37,102,38],[103,23,103,24],[103,25,103,26],[103,27,103,28],[103,29,103,30],[103,31,103,32],[103,33,103,34],[103,35,103,36],[103,37,103,38],[104,23,104,24],[104,25,104,26],[104,27,104,28],[104,29,104,30],[104,31,104,32],[104,33,104,34],[104,35,104,36],[104,37,104,38],[105,23,105,24],[105,25,105,26],[105,27,105,28],[105,29,105,30],[105,31,105,32],[105,33,105,34],[105,35,105,36],[105,37,105,38],[106,23,106,24],[106,25,106,26],[106,27,106,28],[106,29,106,30],[106,31,106,32],[106,33,106,34],[106,35,106,36],[106,37,106,38],[88,2,88,5],[88,6,88,13],[88,14,88,21],[89,2,89,5],[89,6,89,13],[89,14,89,21],[90,2,90,5],[90,6,90,13],[90,14,90,21],[91,2,91,5],[91,6,91,13],[91,14,91,21],[92,2,92,5],[92,6,92,13],[92,14,92,21],[93,2,93,5],[93,6,93,13],[93,14,93,21],[94,2,94,5],[94,6,94,13],[94,14,94,21],[95,2,95,5],[95,6,95,13],[95,14,95,21],[96,2,96,5],[96,6,96,13],[96,14,96,21],[97,2,97,5],[97,6,97,13],[97,14,97,21],[98,2,98,5],[98,6,98,13],[98,14,98,21],[99,2,99,5],[99,6,99,13],[99,14,99,21],[100,2,100,5],[100,6,100,13],[100,14,100,21],[101,2,101,5],[101,6,101,13],[101,14,101,21],[102,2,102,5],[102,6,102,13],[102,14,102,21],[106,2,106,5],[106,6,106,13],[106,14,106,21],[103,2,103,5],[103,6,103,13],[103,14,103,21],[104,2,104,5],[104,6,104,13],[104,14,104,21],[105,2,105,5],[105,6,105,13],[105,14,105,21]]}
[]
[]
[null,null,"EA",null,"V2",null,"FCERM Efficiencies Reporting Tool"]
[null,null,"Project level"]
[]
[null,null,"The tool is designed to allow EA project managers, area AP team leaders and national teams to record FCERM capital and revenue efficiencies in one place. It removes the requirement to seperately fill out multiple forms and enables collation and reporting from a single data source. The form should be completed monthly and then submitted using the button below – it will then be collated nationally. Please ensure the form is completed accurately and to the fullest extent possible. The data you provide will help collegues in areas to do their jobs and provide information we report to government to demonstrate that the Environment Agency is meeting its agreed targets."]
[]
[null,null,"*  Please ensure you enable MACROS before using this tool - it won't work properly unless you do.\n*  Please enter the NPN in the yellow NPN cell - this will pull any information that we currently have and autopopulate these cells for you.\n\u0096\u0096*  Please fill out relevant white boxes on this page then use the data entry tab to provide further information. Note that grey boxes autopopulate.\n*  Please only submit your finished version using the button below - this ensures the correct format for our systems.\n*  Note that the 'save and email' button saves a copy of this tool to your desktop and emails a copy to eadatasubmission@mail.asite.com\n"]
[]
[null,null,"Date sheet amended",null,null,null,null,null,null,null,"Completed by (role)"]
[null,null,"2016-10-07",null,null,null,null,null,null,null,"Heather Taylor (EA PM)"]
[]
[null,null,"Section 1 - Project management"]
[null,null,"Project manager",null,null,null,null,null,null,null,null,null,null,"Project executive"]
[null,null,"Note: ppmt will pre-populate",null,null,null,null,null,null,null,null,null,null,"Note: ppmt will pre-populate"]
[]
[null,null,"Section 2 - Project Details"]
[null,null,"Project name",null,null,null,null,null,null,null,null,null,null,null,null,null,"National project number",null,null,null,null,null,null,null,"1B1S number",null,null,null,null,null,null,null,"AIMS/NFCDD Reference"]
[null,null,"Oxford Flood Alleviation Scheme",null,null,null,null,null,null,null,null,null,null,null,null,null,"THC040E/001A/007A",null,null,null,null,null,null,null,"Note: ppmt will pre-populate",null,null,null,null,null,null,null,"Note: ppmt will pre-populate"]
[]
[null,null,"Primary RFCC",null,null,null,null,null,null,null,null,null,null,"Primary area",null,null,null,null,null,null,null,null,null,null,"Delivery team"]
[null,null,"Thames",null,null,null,null,null,null,null,null,null,null,"West Thames",null,null,null,null,null,null,null,null,null,null,"NCPMS"]
[]
[null,null,"Section 3 - Scheme funding and contributions",null,null,null,null,null,null,null,null,null,null,null,null,null,null,"------------------------------------------------ Annual project expenditure profile ----------------------------------------------------"]
[null,null,null,null,null,null,null,null,null,null,null,null,null,null,null,null,null,null,null,null,null,"15/16",null,"16/17",null,"17/18",null,"18/19",null,"19/20",null,"20/21",null,"Post 20/21",null,null,"Total value"]
[null,null,null,null,null,null,null,null,null,null,null,null,null,null,null,null,null,null,null,null,null,null,null,null,null,null,null,null,null,null,null,null,null,null,null,null,{"$f":"IF(SUM(R26:AI26)=0,\"\",SUM(R26:AI26))","v":""}]
[]
[null,null,null,null,null,null,null,null,null,null,null,null,null,null,null,null,null,"-------------------------------------------------------- Annual funding profile ------------------------------------------------------------"]
[null,null,"Funding source",null,null,null,"Type",null,null,null,"Legal status",null,null,null,null,null,null,"Pre 14/15",null,"14/15",null,"15/16",null,"16/17",null,"17/18",null,"18/19",null,"19/20",null,"20/21",null,"Post 20/21",null,null,"Total value"]
[null,"A",null,null,null,null,null,null,null,null,null,null,null,null,null,null,null,null,null,null,null,null,null,null,null,null,null,null,null,null,null,null,null,null,null,null,{"$f":"IF(SUM(R30:AI30)=0,\"\",SUM(R30:AI30))","v":""}]
[null,"A",null,null,null,null,null,null,null,null,null,null,null,null,null,null,null,null,null,null,null,null,null,null,null,null,null,null,null,null,null,null,null,null,null,null,{"$f":"IF(SUM(R31:AI31)=0,\"\",SUM(R31:AI31))","v":""}]
[null,"A",null,null,null,null,null,null,null,null,null,null,null,null,null,null,null,null,null,null,null,null,null,null,null,null,null,null,null,null,null,null,null,null,null,null,""]
[null,"A",null,null,null,null,null,null,null,null,null,null,null,null,null,null,null,null,null,null,null,null,null,null,null,null,null,null,null,null,null,null,null,null,null,null,""]
[null,"A",null,null,null,null,null,null,null,null,null,null,null,null,null,null,null,null,null,null,null,null,null,null,null,null,null,null,null,null,null,null,null,null,null,null,""]
[null,"A",null,null,null,null,null,null,null,null,null,null,null,null,null,null,null,null,null,null,null,null,null,null,null,null,null,null,null,null,null,null,null,null,null,null,""]
[null,"A",null,null,null,null,null,null,null,null,null,null,null,null,null,null,null,null,null,null,null,null,null,null,null,null,null,null,null,null,null,null,null,null,null,null,""]
[null,"A",null,null,null,null,null,null,null,null,null,null,null,null,null,null,null,null,null,null,null,null,null,null,null,null,null,null,null,null,null,null,null,null,null,null,""]
[null,"A",null,null,null,null,null,null,null,null,null,null,null,null,null,null,null,null,null,null,null,null,null,null,null,null,null,null,null,null,null,null,null,null,null,null,""]
[null,"A",null,null,null,null,null,null,null,null,null,null,null,null,null,null,null,null,null,null,null,null,null,null,null,null,null,null,null,null,null,null,null,null,null,null,""]
[null,"A",null,null,null,null,null,null,null,null,null,null,null,null,null,null,null,null,null,null,null,null,null,null,null,null,null,null,null,null,null,null,null,null,null,null,""]
[null,"A",null,null,null,null,null,null,null,null,null,null,null,null,null,null,null,null,null,null,null,null,null,null,null,null,null,null,null,null,null,null,null,null,null,null,""]
[null,"A",null,null,null,null,null,null,null,null,null,null,null,null,null,null,null,null,null,null,null,null,null,null,null,null,null,null,null,null,null,null,null,null,null,null,""]
[null,"A",null,null,null,null,null,null,null,null,null,null,null,null,null,null,null,null,null,null,null,null,null,null,null,null,null,null,null,null,null,null,null,null,null,null,""]
[null,"A",null,null,null,null,null,null,null,null,null,null,null,null,null,null,null,null,null,null,null,null,null,null,null,null,null,null,null,null,null,null,null,null,null,null,""]
[null,"A",null,null,null,null,null,null,null,null,null,null,null,null,null,null,null,null,null,null,null,null,null,null,null,null,null,null,null,null,null,null,null,null,null,null,""]
[null,"A",null,null,null,null,null,null,null,null,null,null,null,null,null,null,null,null,null,null,null,null,null,null,null,null,null,null,null,null,null,null,null,null,null,null,""]
[null,"A",null,null,null,null,null,null,null,null,null,null,null,null,null,null,null,null,null,null,null,null,null,null,null,null,null,null,null,null,null,null,null,null,null,null,""]
[null,"A",null,null,null,null,null,null,null,null,null,null,null,null,null,null,null,null,null,null,null,null,null,null,null,null,null,null,null,null,null,null,null,null,null,null,""]
[null,"A",null,null,null,null,null,null,null,null,null,null,null,null,null,null,null,null,null,null,null,null,null,null,null,null,null,null,null,null,null,null,null,null,null,null,""]
[null,null,null,null,null,null,null,null,null,null,null,null,null,null,null,null,null,{"$f":"IF(SUM(R30:R49)=0,\"\",SUM(R30:R49))","v":""},null,{"$f":"IF(SUM(T30:T49)=0,\"\",SUM(T30:T49))","v":""},null,{"$f":"IF(SUM(V30:V49)=0,\"\",SUM(V30:V49))","v":""},null,{"$f":"IF(SUM(X30:X49)=0,\"\",SUM(X30:X49))","v":""},null,{"$f":"IF(SUM(Z30:Z49)=0,\"\",SUM(Z30:Z49))","v":""},null,{"$f":"IF(SUM(AB30:AB49)=0,\"\",SUM(AB30:AB49))","v":""},null,{"$f":"IF(SUM(AD30:AD49)=0,\"\",SUM(AD30:AD49))","v":""},null,{"$f":"IF(SUM(AF30:AF49)=0,\"\",SUM(AF30:AF49))","v":""},null,{"$f":"IF(SUM(AH30:AH49)=0,\"\",SUM(AH30:AH49))","v":""},null,null,{"$f":"IF(SUM(AK30:AM49)=0,\"\",SUM(AK30:AM49))","v":""}]
[null,null,null,null,null,null,null,null,null,null,null,null,null,null,null,null,null,null,null,null,null,{"$f":"IF(SUM(V30:V49)=0,\"\",\"é\")","v":""}]
[null,null,null,null,null,null,null,null,null,null,null,null,null,null,null,null,null,{"$f":"IF(SUM(V30:V49)=0,\"\",\"You will need to add a quarterly expenditure profile for 2015/16 in the data entry tab\")","v":""}]
[]
[null,null,"Section 3 - Efficiencies",null,null,null,null,null,null,null,null,null,null,null,null,null,null,null,null,null,null,null,null,"Pre 15/16",null,"14/15",null,"15/16",null,"16/17",null,"17/18",null,"18/19",null,"19/20",null,"Beyond"]
[null,null,null,null,null,null,null,null,null,null,null,null,null,"Actual/Forecast FCERM GiA Funding",null,null,null,null,null,null,null,null,null,2236581,null,null,null,null,null,3353900,null,4275288,null,64613]
[null,null,null,null,null,null,null,null,null,null,null,null,null,"Actual/Forecast Other Funding"]
[null,null,null,null,null,null,null,null,null,null,null,null,null,null,null,null,null,null,null,null,null,null,null,"------------------ Expected value and timing (quarter and year) -----------------"]
[null,null,"Capital/Revenue",null,null,null,"Original plan (baseline)",null,null,null,null,null,null,null,"Description",null,null,null,null,null,null,null,null,"Quarter",null,"14/15",null,"15/16",null,"16/17",null,"17/18",null,"18/19",null,"19/20",null,"Beyond"]
[null,"A","Capital",null,null,null,"2Nr full time ecologists survey 70 ponds to identify if there is a presence of great crested newts",null,null,null,null,null,null,null,"Environmental DNA (eDNA) is a new technique which can detect great crested newt DNA in a water body. A water sample is collected in May from the target pond, which is then tested in a lab for the presence of the GCN DNA.",null,null,null,null,null,null,null,null,"Q2",null,{"$f":"VLOOKUP(Q19,Sheet1!A2:DF3217,66,FALSE)","v":0},null,null,null,60000]
[null,"A","Capital",null,null,null,"Utilise Lot 4 to construct culverts under railway",null,null,null,null,null,null,null,"Network Rail constructed culverts on their flood relief project. See briefing note",null,null,null,null,null,null,null,null,"Q2",null,{"$f":"VLOOKUP(Q19,Sheet1!A2:DF3217,67,FALSE)","v":0},null,null,null,3000000]
[null,"A","Capital",null,null,null,"600,000- 700,000m3 to be taken to landfill",null,null,null,null,null,null,null,"400,000m3 now to be taken to tip",null,null,null,null,null,null,null,null,"Q3",null,{"$f":"VLOOKUP(Q19,Sheet1!A2:DF3217,68,FALSE)","v":0},null,null,null,5000000]
[null,"A","Capital",null,null,null,"Hydrological and hydraulic modelling using standard industry practices",null,null,null,null,null,null,null,"Utilise CH2M's unique global flood modelling software ",null,null,null,null,null,null,null,null,"Q2",null,{"$f":"VLOOKUP(Q19,Sheet1!A2:DF3217,69,FALSE)","v":0},null,null,null,{"$f":"8000+(8*15000)","v":128000}]
[null,"A","Capital",null,null,null,"A Form E was required for 3 team members to secure authorisation to negotiate for third party contributions (FCRM capital projects) and to evidence the approval of third party contributions to projects for 12 investors",null,null,null,null,null,null,null,"The project sought an agreement to submit one Form E covering all three project team members and the twelve investors. This saved the Operations Director and Area Manager needing to review and sign off 36 different documents. ",null,null,null,null,null,null,null,null,"Q2",null,{"$f":"VLOOKUP(Q19,Sheet1!A2:DF3217,70,FALSE)","v":0},null,null,null,1000]
[null,"A","Capital",null,null,null,"OBC sign off- shorten assurance process",null,null,null,null,null,null,null,"Original timeline for assurance process would have been adopted",null,null,null,null,null,null,null,null,null,null,{"$f":"VLOOKUP(Q19,Sheet1!A2:DF3217,71,FALSE)","v":0}]
[null,"A","Capital",null,null,null,"Planning application to be submitted to the three planning authorities ",null,null,null,null,null,null,null,"In principal agreement that there wil be a single application and single determination by the Oxford County Council",null,null,null,null,null,null,null,null,null,null,{"$f":"VLOOKUP(Q19,Sheet1!A2:DF3217,72,FALSE)","v":0}]
[null,"A","Capital",null,null,null,"Materials management solution",null,null,null,null,null,null,null,{"$f":"VLOOKUP(Q19,Sheet1!A2:DF3217,43,FALSE)","v":0},null,null,null,null,null,null,null,null,null,null,{"$f":"VLOOKUP(Q19,Sheet1!A2:DF3217,73,FALSE)","v":0}]
[null,"A",null,null,null,null,{"$f":"VLOOKUP(Q19,Sheet1!A2:DF3217,14,FALSE)","v":0},null,null,null,null,null,null,null,{"$f":"VLOOKUP(Q19,Sheet1!A2:DF3217,44,FALSE)","v":0},null,null,null,null,null,null,null,null,null,null,{"$f":"VLOOKUP(Q19,Sheet1!A2:DF3217,74,FALSE)","v":0}]
[null,"A",null,null,null,null,{"$f":"VLOOKUP(Q19,Sheet1!A2:DF3217,15,FALSE)","v":0},null,null,null,null,null,null,null,{"$f":"VLOOKUP(Q19,Sheet1!A2:DF3217,45,FALSE)","v":0},null,null,null,null,null,null,null,null,null,null,{"$f":"VLOOKUP(Q19,Sheet1!A2:DF3217,75,FALSE)","v":0}]
[null,"A",null,null,null,null,{"$f":"VLOOKUP(Q19,Sheet1!A2:DF3217,16,FALSE)","v":0},null,null,null,null,null,null,null,{"$f":"VLOOKUP(Q19,Sheet1!A2:DF3217,46,FALSE)","v":0},null,null,null,null,null,null,null,null,null,null,{"$f":"VLOOKUP(Q19,Sheet1!A2:DF3217,76,FALSE)","v":0}]
[null,"A",null,null,null,null,{"$f":"VLOOKUP(Q19,Sheet1!A2:DF3217,17,FALSE)","v":0},null,null,null,null,null,null,null,{"$f":"VLOOKUP(Q19,Sheet1!A2:DF3217,47,FALSE)","v":0},null,null,null,null,null,null,null,null,null,null,{"$f":"VLOOKUP(Q19,Sheet1!A2:DF3217,77,FALSE)","v":0}]
[null,"A",null,null,null,null,{"$f":"VLOOKUP(Q19,Sheet1!A2:DF3217,18,FALSE)","v":0},null,null,null,null,null,null,null,{"$f":"VLOOKUP(Q19,Sheet1!A2:DF3217,48,FALSE)","v":0},null,null,null,null,null,null,null,null,null,null,{"$f":"VLOOKUP(Q19,Sheet1!A2:DF3217,78,FALSE)","v":0}]
[null,"A",null,null,null,null,{"$f":"VLOOKUP(Q19,Sheet1!A2:DF3217,19,FALSE)","v":0},null,null,null,null,null,null,null,{"$f":"VLOOKUP(Q19,Sheet1!A2:DF3217,49,FALSE)","v":0},null,null,null,null,null,null,null,null,null,null,{"$f":"VLOOKUP(Q19,Sheet1!A2:DF3217,79,FALSE)","v":0}]
[null,"A",null,null,null,null,{"$f":"VLOOKUP(Q19,Sheet1!A2:DF3217,20,FALSE)","v":0},null,null,null,null,null,null,null,{"$f":"VLOOKUP(Q19,Sheet1!A2:DF3217,50,FALSE)","v":0},null,null,null,null,null,null,null,null,null,null,{"$f":"VLOOKUP(Q19,Sheet1!A2:DF3217,80,FALSE)","v":0}]
[null,"A",null,null,null,null,{"$f":"VLOOKUP(Q19,Sheet1!A2:DF3217,21,FALSE)","v":0},null,null,null,null,null,null,null,{"$f":"VLOOKUP(Q19,Sheet1!A2:DF3217,51,FALSE)","v":0},null,null,null,null,null,null,null,null,null,null,{"$f":"VLOOKUP(Q19,Sheet1!A2:DF3217,81,FALSE)","v":0}]
[null,null,null,null,null,null,{"$f":"VLOOKUP(Q19,Sheet1!A2:DF3217,22,FALSE)","v":0},null,null,null,null,null,null,null,{"$f":"VLOOKUP(Q19,Sheet1!A2:DF3217,52,FALSE)","v":0},null,null,null,null,null,null,null,null,null,null,{"$f":"VLOOKUP(Q19,Sheet1!A2:DF3217,82,FALSE)","v":0}]
[null,null,null,null,null,null,{"$f":"VLOOKUP(Q19,Sheet1!A2:DF3217,23,FALSE)","v":0},null,null,null,null,null,null,null,{"$f":"VLOOKUP(Q19,Sheet1!A2:DF3217,53,FALSE)","v":0},null,null,null,null,null,null,null,null,null,null,{"$f":"VLOOKUP(Q19,Sheet1!A2:DF3217,83,FALSE)","v":0}]
[null,null,null,null,null,null,{"$f":"VLOOKUP(Q19,Sheet1!A2:DF3217,24,FALSE)","v":0},null,null,null,null,null,null,null,{"$f":"VLOOKUP(Q19,Sheet1!A2:DF3217,54,FALSE)","v":0},null,null,null,null,null,null,null,null,null,null,{"$f":"VLOOKUP(Q19,Sheet1!A2:DF3217,84,FALSE)","v":0}]
[null,null,null,null,null,null,{"$f":"VLOOKUP(Q19,Sheet1!A2:DF3217,25,FALSE)","v":0},null,null,null,null,null,null,null,{"$f":"VLOOKUP(Q19,Sheet1!A2:DF3217,55,FALSE)","v":0},null,null,null,null,null,null,null,null,null,null,{"$f":"VLOOKUP(Q19,Sheet1!A2:DF3217,85,FALSE)","v":0}]
[null,null,null,null,null,null,{"$f":"VLOOKUP(Q19,Sheet1!A2:DF3217,26,FALSE)","v":0},null,null,null,null,null,null,null,{"$f":"VLOOKUP(Q19,Sheet1!A2:DF3217,56,FALSE)","v":0},null,null,null,null,null,null,null,null,null,null,{"$f":"VLOOKUP(Q19,Sheet1!A2:DF3217,86,FALSE)","v":0}]
[null,null,null,null,null,null,{"$f":"VLOOKUP(Q19,Sheet1!A2:DF3217,27,FALSE)","v":0},null,null,null,null,null,null,null,{"$f":"VLOOKUP(Q19,Sheet1!A2:DF3217,57,FALSE)","v":0},null,null,null,null,null,null,null,null,null,null,{"$f":"VLOOKUP(Q19,Sheet1!A2:DF3217,87,FALSE)","v":0}]
[null,null,null,null,null,null,{"$f":"VLOOKUP(Q19,Sheet1!A2:DF3217,28,FALSE)","v":0},null,null,null,null,null,null,null,{"$f":"VLOOKUP(Q19,Sheet1!A2:DF3217,58,FALSE)","v":0},null,null,null,null,null,null,null,null,null,null,{"$f":"VLOOKUP(Q19,Sheet1!A2:DF3217,88,FALSE)","v":0}]
[null,null,null,null,null,null,{"$f":"VLOOKUP(Q19,Sheet1!A2:DF3217,29,FALSE)","v":0},null,null,null,null,null,null,null,{"$f":"VLOOKUP(Q19,Sheet1!A2:DF3217,59,FALSE)","v":0},null,null,null,null,null,null,null,null,null,null,{"$f":"VLOOKUP(Q19,Sheet1!A2:DF3235,89,FALSE)","v":0}]
[null,null,null,null,null,null,{"$f":"VLOOKUP(Q19,Sheet1!A2:DF3217,30,FALSE)","v":0},null,null,null,null,null,null,null,{"$f":"VLOOKUP(Q19,Sheet1!A2:DF3217,60,FALSE)","v":0},null,null,null,null,null,null,null,null,null,null,{"$f":"VLOOKUP(Q19,Sheet1!A2:DF3217,90,FALSE)","v":0}]
[null,null,null,null,null,null,{"$f":"VLOOKUP(Q19,Sheet1!A2:DF3217,31,FALSE)","v":0},null,null,null,null,null,null,null,{"$f":"VLOOKUP(Q19,Sheet1!A2:DF3217,61,FALSE)","v":0},null,null,null,null,null,null,null,null,null,null,{"$f":"VLOOKUP(Q19,Sheet1!A2:DF3217,91,FALSE)","v":0}]
[null,"A",null,null,null,null,{"$f":"VLOOKUP(Q19,Sheet1!A2:DF3217,32,FALSE)","v":0},null,null,null,null,null,null,null,{"$f":"VLOOKUP(Q19,Sheet1!A2:DF3217,62,FALSE)","v":0},null,null,null,null,null,null,null,null,null,null,{"$f":"VLOOKUP(Q19,Sheet1!A2:DF3217,92,FALSE)","v":0}]
[null,"A",null,null,null,null,{"$f":"VLOOKUP(Q19,Sheet1!A2:DF3217,33,FALSE)","v":0},null,null,null,null,null,null,null,{"$f":"VLOOKUP(Q19,Sheet1!A2:DF3217,63,FALSE)","v":0},null,null,null,null,null,null,null,null,null,null,{"$f":"VLOOKUP(Q19,Sheet1!A2:DF3217,93,FALSE)","v":0}]
[null,"A",null,null,null,null,{"$f":"VLOOKUP(Q19,Sheet1!A2:DF3217,34,FALSE)","v":0},null,null,null,null,null,null,null,{"$f":"VLOOKUP(Q19,Sheet1!A2:DF3217,64,FALSE)","v":0},null,null,null,null,null,null,null,null,null,null,{"$f":"VLOOKUP(Q19,Sheet1!A2:DF3217,94,FALSE)","v":0}]
[null,null,null,null,null,null,{"$f":"VLOOKUP(Q19,Sheet1!A2:DF3217,35,FALSE)","v":0},null,null,null,null,null,null,null,{"$f":"VLOOKUP(Q19,Sheet1!A2:DF3217,65,FALSE)","v":0},null,null,null,null,null,null,null,null,null,null,{"$f":"VLOOKUP(Q19,Sheet1!A2:DF3217,95,FALSE)","v":0}]
[]
[]
[]
[]
[]
[]
[]
[]
[]
[]
[]
[]
[]
[]
[]
[]
[]
[]
[]
[null,"A"]
[null,null,null,null,null,null,null,null,null,null,null,null,null,null,null,null,null,null,null,null,null,null,null,null,null,{"$f":"SUM(Z59:AA108)","v":0},null,{"$f":"SUM(AB59:AC108)","v":0},null,{"$f":"SUM(AD59:AE108)","v":8189000},null,{"$f":"SUM(AF59:AG108)","v":0},null,{"$f":"SUM(AH59:AI108)","v":0},null,{"$f":"SUM(AJ59:AK108)","v":0},null,{"$f":"SUM(AL59:AM108)","v":0}]
[null,null,null,null,null,null,null,{"$f":"IF(G59=\"\",\"\",\"* Please remember to go to the data entry tab and provide additional details for each efficiency\")","v":"* Please remember to go to the data entry tab and provide additional details for each efficiency"}]
[]
[]
[]
[]
[null,1,"Northumberland Durham and Tees",null,null,null,null,null,null,null,null,null,null,null,null,"Anglian Central"]
[null,2,"Cumbria and Lancashire",null,null,null,null,null,null,null,null,null,null,null,null,"Anglian Eastern"]
[null,3,"Yorkshire",null,null,null,null,null,null,null,null,null,null,null,null,"Anglian Northern"]
[null,4,"Derbys Notts and Leics",null,null,null,null,null,null,null,null,null,null,null,null,"North West"]
[null,5,"Lincs and Northants",null,null,null,null,null,null,null,null,null,null,null,null,"Northumbria"]
[null,6,"Gtr Mancs Mersey and Ches",null,null,null,null,null,null,null,null,null,null,null,null,"Severn and Wye"]
[null,7,"Staffs Warks and West Mids",null,null,null,null,null,null,null,null,null,null,null,null,"South West"]
[null,8,"Shrops Heref Worcs and Glos",null,null,null,null,null,null,null,null,null,null,null,null,"Southern"]
[null,9,"Wessex",null,null,null,null,null,null,null,null,null,null,null,null,"Thames"]
[null,10,"Devon and Cornwall",null,null,null,null,null,null,null,null,null,null,null,null,"Trent"]
[null,11,"Cambs and Bedfordshire",null,null,null,null,null,null,null,null,null,null,null,null,"Wessex"]
[null,12,"Essex Norfolk and Suffolk",null,null,null,null,null,null,null,null,null,null,null,null,"Yorkshire"]
[null,13,"Herts and North London"]
[null,14,"West Thames"]
[null,15,"Solent and South Downs"]
[null,16,"Kent and South London"]
[]
[null,"AnglianCentral",null,null,"AnglianEastern",null,null,"AnglianNorthern",null,null,"NorthWest",null,null,"Northumbria",null,null,"SevernandWye",null,null,"SouthWest",null,null,"Southern",null,null,"Thames",null,null,"Trent",null,null,"Wessex",null,null,"Yorkshire"]
[null,"Lincs and Northants",null,null,"Cambs and Bedfordshire",null,null,"Yorkshire",null,null,"Northumberland Durham and Tees",null,null,"Northumberland Durham and Tees",null,null,"Gtr Mancs Mersey and Ches",null,null,"Wessex",null,null,"Wessex",null,null,"Staffs Warks and West Mids",null,null,"Yorkshire",null,null,"Shrops Heref Worcs and Glos",null,null,"Northumberland Durham and Tees"]
[null,"Cambs and Bedfordshire",null,null,"Essex Norfolk and Suffolk",null,null,"Derbys Notts and Leics",null,null,"Cumbria and Lancashire",null,null,"Cumbria and Lancashire",null,null,"Staffs Warks and West Mids",null,null,"Devon and Cornwall",null,null,"Herts and North London",null,null,"Shrops Heref Worcs and Glos",null,null,"Derbys Notts and Leics",null,null,"Wessex",null,null,"Cumbria and Lancashire"]
[null,"Essex Norfolk and Suffolk",null,null,"Herts and North London",null,null,"Lincs and Northants",null,null,"Yorkshire",null,null,"Yorkshire",null,null,"Shrops Heref Worcs and Glos",null,null,null,null,null,"West Thames",null,null,"Wessex",null,null,"Lincs and Northants",null,null,"Devon and Cornwall",null,null,"Yorkshire"]
[null,"Herts and North London",null,null,null,null,null,"Cambs and Bedfordshire",null,null,"Gtr Mancs Mersey and Ches",null,null,"Derbys Notts and Leics",null,null,"Wessex",null,null,null,null,null,"Solent and South Downs",null,null,"Cambs and Bedfordshire",null,null,"Gtr Mancs Mersey and Ches",null,null,"West Thames",null,null,"Derbys Notts and Leics"]
[null,null,null,null,null,null,null,null,null,null,null,null,null,"Lincs and Northants",null,null,null,null,null,null,null,null,"Kent and South London",null,null,"Essex Norfolk and Suffolk",null,null,"Staffs Warks and West Mids",null,null,"Solent and South Downs",null,null,"Lincs and Northants"]
[null,null,null,null,null,null,null,null,null,null,null,null,null,"Gtr Mancs Mersey and Ches",null,null,null,null,null,null,null,null,null,null,null,"Herts and North London",null,null,null,null,null,null,null,null,"Gtr Mancs Mersey and Ches"]
[null,null,null,null,null,null,null,null,null,null,null,null,null,null,null,null,null,null,null,null,null,null,null,null,null,"West Thames"]
[null,null,null,null,null,null,null,null,null,null,null,null,null,null,null,null,null,null,null,null,null,null,null,null,null,"Solent and South Downs"]
[null,null,null,null,null,null,null,null,null,null,null,null,null,null,null,null,null,null,null,null,null,null,null,null,null,"Kent and South London"]

{"sheet":"Data Entry (contributions)","index":1,"n_rows":151,"n_cols":40,"rows_kept":151,"cut":false,"hidden":true,"merged":[[7,5,7,7],[2,15,2,39],[7,15,7,39],[3,9,4,10],[7,9,7,11],[4,2,4,7]]}
[]
[]
[null,null,null,null,null,null,null,null,null,null,null,null,null,null,null,"------------------------------------------------------------------------------------------------- Project expenditure profile ----------------------------------------------------------------------------------------------------"]
[null,null,"Data entry sheet",null,null,null,null,null,null,{"$f":"IF(SUM(V30:V49)=0,\"\",\"Remember to add a quarterly expenditure profile for 2015/16 in the cells to the right\")","v":""},null,"Risk/Contigency Check",null,null,null,"Pre\n14/15","14/15","15/16",null,"15/16\n(Q1)","15/16\n(Q2)","15/16\n(Q3)","15/16\n(Q4)","15/16\nTotal",null,null,null,null,null,null,"16/17","17/18","18/19","19/20","20/21",null,null,"Post\n20/21",null,"Total Spend"]
[null,null,{"$f":"\"Partnership funding contributions for \" & TEXT(Form!C19,\" \")","v":"Partnership funding contributions for Oxford Flood Alleviation Scheme"},null,null,null,null,null,null,null,null,{"$f":"IF(AN5=\"\",\"\",AN30-AN5)","v":""},{"$f":"IF(AN5=\"\",\"\",IF(SUM(P5:AI5,AL5)=AN5,\"\",\"N\"))","v":""},null,null,{"$f":"IF(Form!#REF!=\"\",\"\",Form!#REF!)","v":{"$error":"#REF!"}},{"$f":"IF(Form!X55=\"\",\"\",Form!X55)","v":2236581},null,null,null,null,null,null,{"$f":"IF(Form!V26=\"\",\"\",Form!V26)","v":""},null,null,null,null,null,null,{"$f":"IF(Form!X26=\"\",\"\",Form!X26)","v":""},{"$f":"IF(Form!Z26=\"\",\"\",Form!Z26)","v":""},{"$f":"IF(Form!AB26=\"\",\"\",Form!AB26)","v":""},{"$f":"IF(Form!AD26=\"\",\"\",Form!AD26)","v":""},{"$f":"IF(Form!AF26=\"\",\"\",Form!AF26)","v":""},null,null,{"$f":"IF(Form!AH26=\"\",\"\",Form!AH26)","v":""},null,{"$f":"IF(AN30=\"\",\"\",SUM(P5:Q5,X5,AE5:AI5,AL5))","v":""}]
[]
[]
[null,null,null,null,null,"------------------------------------------ Further contribution details ----------------------------------------",null,null,null,"--------------------- Contributor contact details ----------------------",null,null,null,null,null,"--------------------------------------------------------------- Pro-rata'd expenditure profile for each funding type (autocalculated)---------------------------------------------------------------------"]
[null,null,"Funding source","Type","Legal status","Payment terms","Date","Other details (description)",null,"Contact name","Organisation & address","Phone",null,null,null,"Pre\n14/15","14/15",null,null,"15/16\n(Q1)","15/16\n(Q2)","15/16\n(Q3)","15/16\n(Q4)","15/16\nTotal",null,null,null,null,null,null,"16/17","17/18","18/19","19/20","20/21",null,null,"Post\n20/21",null,"Total funding"]
[null,"A",{"$f":"IF(Form!C30=\"\",\"\",Form!C30)","v":""},{"$f":"IF(Form!G30=\"\",\"\",Form!G30)","v":""},{"$f":"IF(Form!K30=\"\",\"\",Form!K30)","v":""},null,null,null,null,null,null,null,null,{"$f":"IF(Form!R30=\"\",\"\",Form!R30/SUM(Form!$R$30:$R$49))","v":""},{"$f":"IF(Form!T30=\"\",\"\",Form!T30/SUM(Form!$T$30:$T$49))","v":""},{"$f":"IF($N10=\"\",\"\",IF(P$5=0,\"\",($N10/SUM($N$10:$N$29))*P$5))","v":""},{"$f":"IF($O10=\"\",\"\",IF(Q$5=0,\"\",($O10/SUM($O$10:$O$29))*Q$5))","v":""},null,{"$f":"IF(Form!V30=\"\",\"\",Form!V30/(SUM(Form!$V$30:$V$49)))","v":""},{"$f":"IF($S10=\"\",\"\",($S10/SUM($S$10:$S$29))*T$5)","v":""},{"$f":"IF($S10=\"\",\"\",($S10/SUM($S$10:$S$29))*U$5)","v":""},"","",{"$f":"IF($S10=\"\",\"\",IF(X$5=0,\"\",($S10/SUM($S$10:$S$29))*X$5))","v":""},null,{"$f":"IF(Form!X30=\"\",\"\",Form!X30/(SUM(Form!$X$30:$X$49)))","v":""},{"$f":"IF(Form!Z30=\"\",\"\",Form!Z30/(SUM(Form!$Z$30:$Z$49)))","v":""},{"$f":"IF(Form!AB30=\"\",\"\",Form!AB30/(SUM(Form!AB30:AB49)))","v":""},{"$f":"IF(Form!AD30=\"\",\"\",Form!AD30/(SUM(Form!$AD$30:$AD$49)))","v":""},{"$f":"IF(Form!AF30=\"\",\"\",Form!AF30/(SUM(Form!$AF$30:$AF$49)))","v":""},{"$f":"IF($Y10=\"\",\"\",($Y10/SUM($Y$10:$Y$29))*AE$5)","v":""},{"$f":"IF($Z10=\"\",\"\",($Z10/SUM($Z$10:$Z$29))*AF$5)","v":""},{"$f":"IF($AB10=\"\",\"\",($AB10/SUM($AB$10:$AB$29))*AG$5)","v":""},{"$f":"IF($AC10=\"\",\"\",($AC10/SUM($AC$10:$AC$29))*AH$5)","v":""},{"$f":"IF($AD10=\"\",\"\",($AD10/SUM($AD$10:$AD$29))*AI$5)","v":""},null,{"$f":"IF(Form!AH30=\"\",\"\",Form!AH30/(SUM(Form!$AH$30:$AH$49)))","v":""},{"$f":"IF($AK10=\"\",\"\",($AK10/SUM($AK$10:$AK$29))*AL$5)","v":""},null,{"$f":"IF(Form!AK30=\"\",\"\",Form!AK30)","v":""}]
[null,"A",{"$f":"IF(Form!C31=\"\",\"\",Form!C31)","v":""},{"$f":"IF(Form!G31=\"\",\"\",Form!G31)","v":""},{"$f":"IF(Form!K31=\"\",\"\",Form!K31)","v":""},null,null,null,null,null,null,null,null,{"$f":"IF(Form!R31=\"\",\"\",Form!R31/SUM(Form!$R$30:$R$49))","v":""},{"$f":"IF(Form!T31=\"\",\"\",Form!T31/SUM(Form!$T$30:$T$49))","v":""},{"$f":"IF($N11=\"\",\"\",IF(P$5=0,\"\",($N11/SUM($N$10:$N$29))*P$5))","v":""},{"$f":"IF($O11=\"\",\"\",IF(Q$5=0,\"\",($O11/SUM($O$10:$O$29))*Q$5))","v":""},null,{"$f":"IF(Form!V31=\"\",\"\",Form!V31/(SUM(Form!$V$30:$V$49)))","v":""},{"$f":"IF($S11=\"\",\"\",($S11/SUM($S$10:$S$29))*T$5)","v":""},"","","",{"$f":"IF($S11=\"\",\"\",IF(X$5=0,\"\",($S11/SUM($S$10:$S$29))*X$5))","v":""},null,{"$f":"IF(Form!X31=\"\",\"\",Form!X31/(SUM(Form!$X$30:$X$49)))","v":""},{"$f":"IF(Form!Z31=\"\",\"\",Form!Z31/(SUM(Form!$Z$30:$Z$49)))","v":""},{"$f":"IF(Form!AB31=\"\",\"\",Form!AB31/(SUM(Form!AB31:AB50)))","v":""},{"$f":"IF(Form!AD31=\"\",\"\",Form!AD31/(SUM(Form!$AD$30:$AD$49)))","v":""},{"$f":"IF(Form!AF31=\"\",\"\",Form!AF31/(SUM(Form!$AF$30:$AF$49)))","v":""},"",{"$f":"IF($Z11=\"\",\"\",($Z11/SUM($Z$10:$Z$29))*AF$5)","v":""},{"$f":"IF($AB11=\"\",\"\",($AB11/SUM($AB$10:$AB$29))*AG$5)","v":""},{"$f":"IF($AC11=\"\",\"\",($AC11/SUM($AC$10:$AC$29))*AH$5)","v":""},{"$f":"IF($AD11=\"\",\"\",($AD11/SUM($AD$10:$AD$29))*AI$5)","v":""},null,{"$f":"IF(Form!AH31=\"\",\"\",Form!AH31/(SUM(Form!$AH$30:$AH$49)))","v":""},{"$f":"IF($AK11=\"\",\"\",($AK11/SUM($AK$10:$AK$29))*AL$5)","v":""},null,{"$f":"IF(Form!AK31=\"\",\"\",Form!AK31)","v":""}]
[null,"A",{"$f":"IF(Form!C32=\"\",\"\",Form!C32)","v":""},{"$f":"IF(Form!G32=\"\",\"\",Form!G32)","v":""},{"$f":"IF(Form!K32=\"\",\"\",Form!K32)","v":""},null,null,null,null,null,null,null,null,{"$f":"IF(Form!R32=\"\",\"\",Form!R32/SUM(Form!$R$30:$R$49))","v":""},{"$f":"IF(Form!T32=\"\",\"\",Form!T32/SUM(Form!$T$30:$T$49))","v":""},"","",null,{"$f":"IF(Form!V32=\"\",\"\",Form!V32/(SUM(Form!$V$30:$V$49)))","v":""},"","","","","",null,{"$f":"IF(Form!X32=\"\",\"\",Form!X32/(SUM(Form!$X$30:$X$49)))","v":""},{"$f":"IF(Form!Z32=\"\",\"\",Form!Z32/(SUM(Form!$Z$30:$Z$49)))","v":""},{"$f":"IF(Form!AB32=\"\",\"\",Form!AB32/(SUM(Form!AB32:AB51)))","v":""},{"$f":"IF(Form!AD32=\"\",\"\",Form!AD32/(SUM(Form!$AD$30:$AD$49)))","v":""},{"$f":"IF(Form!AF32=\"\",\"\",Form!AF32/(SUM(Form!$AF$30:$AF$49)))","v":""},"","","","","",null,{"$f":"IF(Form!AH32=\"\",\"\",Form!AH32/(SUM(Form!$AH$30:$AH$49)))","v":""},"",null,{"$f":"IF(Form!AK32=\"\",\"\",Form!AK32)","v":""}]
[null,"A",{"$f":"IF(Form!C33=\"\",\"\",Form!C33)","v":""},{"$f":"IF(Form!G33=\"\",\"\",Form!G33)","v":""},{"$f":"IF(Form!K33=\"\",\"\",Form!K33)","v":""},null,null,null,null,null,null,null,null,{"$f":"IF(Form!R33=\"\",\"\",Form!R33/SUM(Form!$R$30:$R$49))","v":""},{"$f":"IF(Form!T33=\"\",\"\",Form!T33/SUM(Form!$T$30:$T$49))","v":""},"","",null,{"$f":"IF(Form!V33=\"\",\"\",Form!V33/(SUM(Form!$V$30:$V$49)))","v":""},"","","","","",null,{"$f":"IF(Form!X33=\"\",\"\",Form!X33/(SUM(Form!$X$30:$X$49)))","v":""},{"$f":"IF(Form!Z33=\"\",\"\",Form!Z33/(SUM(Form!$Z$30:$Z$49)))","v":""},{"$f":"IF(Form!AB33=\"\",\"\",Form!AB33/(SUM(Form!AB33:AB52)))","v":""},{"$f":"IF(Form!AD33=\"\",\"\",Form!AD33/(SUM(Form!$AD$30:$AD$49)))","v":""},{"$f":"IF(Form!AF33=\"\",\"\",Form!AF33/(SUM(Form!$AF$30:$AF$49)))","v":""},"","","","","",null,{"$f":"IF(Form!AH33=\"\",\"\",Form!AH33/(SUM(Form!$AH$30:$AH$49)))","v":""},"",null,{"$f":"IF(Form!AK33=\"\",\"\",Form!AK33)","v":""}]
[null,"A",{"$f":"IF(Form!C34=\"\",\"\",Form!C34)","v":""},{"$f":"IF(Form!G34=\"\",\"\",Form!G34)","v":""},{"$f":"IF(Form!K34=\"\",\"\",Form!K34)","v":""},null,null,null,null,null,null,null,null,{"$f":"IF(Form!R34=\"\",\"\",Form!R34/SUM(Form!$R$30:$R$49))","v":""},{"$f":"IF(Form!T34=\"\",\"\",Form!T34/SUM(Form!$T$30:$T$49))","v":""},"","",null,{"$f":"IF(Form!V34=\"\",\"\",Form!V34/(SUM(Form!$V$30:$V$49)))","v":""},"","","","","",null,{"$f":"IF(Form!X34=\"\",\"\",Form!X34/(SUM(Form!$X$30:$X$49)))","v":""},{"$f":"IF(Form!Z34=\"\",\"\",Form!Z34/(SUM(Form!$Z$30:$Z$49)))","v":""},{"$f":"IF(Form!AB34=\"\",\"\",Form!AB34/(SUM(Form!AB34:AB53)))","v":""},{"$f":"IF(Form!AD34=\"\",\"\",Form!AD34/(SUM(Form!$AD$30:$AD$49)))","v":""},{"$f":"IF(Form!AF34=\"\",\"\",Form!AF34/(SUM(Form!$AF$30:$AF$49)))","v":""},"","","","","",null,{"$f":"IF(Form!AH34=\"\",\"\",Form!AH34/(SUM(Form!$AH$30:$AH$49)))","v":""},"",null,{"$f":"IF(Form!AK34=\"\",\"\",Form!AK34)","v":""}]
[null,"A",{"$f":"IF(Form!C35=\"\",\"\",Form!C35)","v":""},{"$f":"IF(Form!G35=\"\",\"\",Form!G35)","v":""},{"$f":"IF(Form!K35=\"\",\"\",Form!K35)","v":""},null,null,null,null,null,null,null,null,{"$f":"IF(Form!R35=\"\",\"\",Form!R35/SUM(Form!$R$30:$R$49))","v":""},{"$f":"IF(Form!T35=\"\",\"\",Form!T35/SUM(Form!$T$30:$T$49))","v":""},"","",null,{"$f":"IF(Form!V35=\"\",\"\",Form!V35/(SUM(Form!$V$30:$V$49)))","v":""},"","","","","",null,{"$f":"IF(Form!X35=\"\",\"\",Form!X35/(SUM(Form!$X$30:$X$49)))","v":""},{"$f":"IF(Form!Z35=\"\",\"\",Form!Z35/(SUM(Form!$Z$30:$Z$49)))","v":""},{"$f":"IF(Form!AB35=\"\",\"\",Form!AB35/(SUM(Form!AB35:AB54)))","v":""},{"$f":"IF(Form!AD35=\"\",\"\",Form!AD35/(SUM(Form!$AD$30:$AD$49)))","v":""},{"$f":"IF(Form!AF35=\"\",\"\",Form!AF35/(SUM(Form!$AF$30:$AF$49)))","v":""},"","","","","",null,{"$f":"IF(Form!AH35=\"\",\"\",Form!AH35/(SUM(Form!$AH$30:$AH$49)))","v":""},"",null,{"$f":"IF(Form!AK35=\"\",\"\",Form!AK35)","v":""}]
[null,"A",{"$f":"IF(Form!C36=\"\",\"\",Form!C36)","v":""},{"$f":"IF(Form!G36=\"\",\"\",Form!G36)","v":""},{"$f":"IF(Form!K36=\"\",\"\",Form!K36)","v":""},null,null,null,null,null,null,null,null,{"$f":"IF(Form!R36=\"\",\"\",Form!R36/SUM(Form!$R$30:$R$49))","v":""},{"$f":"IF(Form!T36=\"\",\"\",Form!T36/SUM(Form!$T$30:$T$49))","v":""},"","",null,{"$f":"IF(Form!V36=\"\",\"\",Form!V36/(SUM(Form!$V$30:$V$49)))","v":""},"","","","","",null,{"$f":"IF(Form!X36=\"\",\"\",Form!X36/(SUM(Form!$X$30:$X$49)))","v":""},{"$f":"IF(Form!Z36=\"\",\"\",Form!Z36/(SUM(Form!$Z$30:$Z$49)))","v":""},{"$f":"IF(Form!AB36=\"\",\"\",Form!AB36/(SUM(Form!AB36:AB58)))","v":""},{"$f":"IF(Form!AD36=\"\",\"\",Form!AD36/(SUM(Form!$AD$30:$AD$49)))","v":""},{"$f":"IF(Form!AF36=\"\",\"\",Form!AF36/(SUM(Form!$AF$30:$AF$49)))","v":""},"","","","","",null,{"$f":"IF(Form!AH36=\"\",\"\",Form!AH36/(SUM(Form!$AH$30:$AH$49)))","v":""},"",null,{"$f":"IF(Form!AK36=\"\",\"\",Form!AK36)","v":""}]
[null,"A",{"$f":"IF(Form!C37=\"\",\"\",Form!C37)","v":""},{"$f":"IF(Form!G37=\"\",\"\",Form!G37)","v":""},{"$f":"IF(Form!K37=\"\",\"\",Form!K37)","v":""},null,null,null,null,null,null,null,null,{"$f":"IF(Form!R37=\"\",\"\",Form!R37/SUM(Form!$R$30:$R$49))","v":""},{"$f":"IF(Form!T37=\"\",\"\",Form!T37/SUM(Form!$T$30:$T$49))","v":""},"","",null,{"$f":"IF(Form!V37=\"\",\"\",Form!V37/(SUM(Form!$V$30:$V$49)))","v":""},"","","","","",null,{"$f":"IF(Form!X37=\"\",\"\",Form!X37/(SUM(Form!$X$30:$X$49)))","v":""},{"$f":"IF(Form!Z37=\"\",\"\",Form!Z37/(SUM(Form!$Z$30:$Z$49)))","v":""},{"$f":"IF(Form!AB37=\"\",\"\",Form!AB37/(SUM(Form!AB37:AB59)))","v":""},{"$f":"IF(Form!AD37=\"\",\"\",Form!AD37/(SUM(Form!$AD$30:$AD$49)))","v":""},{"$f":"IF(Form!AF37=\"\",\"\",Form!AF37/(SUM(Form!$AF$30:$AF$49)))","v":""},"","","","","",null,{"$f":"IF(Form!AH37=\"\",\"\",Form!AH37/(SUM(Form!$AH$30:$AH$49)))","v":""},"",null,{"$f":"IF(Form!AK37=\"\",\"\",Form!AK37)","v":""}]
[null,"A",{"$f":"IF(Form!C38=\"\",\"\",Form!C38)","v":""},{"$f":"IF(Form!G38=\"\",\"\",Form!G38)","v":""},{"$f":"IF(Form!K38=\"\",\"\",Form!K38)","v":""},null,null,null,null,null,null,null,null,{"$f":"IF(Form!R38=\"\",\"\",Form!R38/SUM(Form!$R$30:$R$49))","v":""},{"$f":"IF(Form!T38=\"\",\"\",Form!T38/SUM(Form!$T$30:$T$49))","v":""},"","",null,{"$f":"IF(Form!V38=\"\",\"\",Form!V38/(SUM(Form!$V$30:$V$49)))","v":""},"","","","","",null,{"$f":"IF(Form!X38=\"\",\"\",Form!X38/(SUM(Form!$X$30:$X$49)))","v":""},{"$f":"IF(Form!Z38=\"\",\"\",Form!Z38/(SUM(Form!$Z$30:$Z$49)))","v":""},{"$f":"IF(Form!AB38=\"\",\"\",Form!AB38/(SUM(Form!AB38:AB60)))","v":""},{"$f":"IF(Form!AD38=\"\",\"\",Form!AD38/(SUM(Form!$AD$30:$AD$49)))","v":""},{"$f":"IF(Form!AF38=\"\",\"\",Form!AF38/(SUM(Form!$AF$30:$AF$49)))","v":""},"","","","","",null,{"$f":"IF(Form!AH38=\"\",\"\",Form!AH38/(SUM(Form!$AH$30:$AH$49)))","v":""},"",null,{"$f":"IF(Form!AK38=\"\",\"\",Form!AK38)","v":""}]
[null,"A",{"$f":"IF(Form!C39=\"\",\"\",Form!C39)","v":""},{"$f":"IF(Form!G39=\"\",\"\",Form!G39)","v":""},{"$f":"IF(Form!K39=\"\",\"\",Form!K39)","v":""},null,null,null,null,null,null,null,null,{"$f":"IF(Form!R39=\"\",\"\",Form!R39/SUM(Form!$R$30:$R$49))","v":""},{"$f":"IF(Form!T39=\"\",\"\",Form!T39/SUM(Form!$T$30:$T$49))","v":""},"","",null,{"$f":"IF(Form!V39=\"\",\"\",Form!V39/(SUM(Form!$V$30:$V$49)))","v":""},"","","","","",null,{"$f":"IF(Form!X39=\"\",\"\",Form!X39/(SUM(Form!$X$30:$X$49)))","v":""},{"$f":"IF(Form!Z39=\"\",\"\",Form!Z39/(SUM(Form!$Z$30:$Z$49)))","v":""},{"$f":"IF(Form!AB39=\"\",\"\",Form!AB39/(SUM(Form!AB39:AB61)))","v":""},{"$f":"IF(Form!AD39=\"\",\"\",Form!AD39/(SUM(Form!$AD$30:$AD$49)))","v":""},{"$f":"IF(Form!AF39=\"\",\"\",Form!AF39/(SUM(Form!$AF$30:$AF$49)))","v":""},"","","","","",null,{"$f":"IF(Form!AH39=\"\",\"\",Form!AH39/(SUM(Form!$AH$30:$AH$49)))","v":""},"",null,{"$f":"IF(Form!AK39=\"\",\"\",Form!AK39)","v":""}]
[null,"A",{"$f":"IF(Form!C40=\"\",\"\",Form!C40)","v":""},{"$f":"IF(Form!G40=\"\",\"\",Form!G40)","v":""},{"$f":"IF(Form!K40=\"\",\"\",Form!K40)","v":""},null,null,null,null,null,null,null,null,{"$f":"IF(Form!R40=\"\",\"\",Form!R40/SUM(Form!$R$30:$R$49))","v":""},{"$f":"IF(Form!T40=\"\",\"\",Form!T40/SUM(Form!$T$30:$T$49))","v":""},"","",null,{"$f":"IF(Form!V40=\"\",\"\",Form!V40/(SUM(Form!$V$30:$V$49)))","v":""},"","","","","",null,{"$f":"IF(Form!X40=\"\",\"\",Form!X40/(SUM(Form!$X$30:$X$49)))","v":""},{"$f":"IF(Form!Z40=\"\",\"\",Form!Z40/(SUM(Form!$Z$30:$Z$49)))","v":""},{"$f":"IF(Form!AB40=\"\",\"\",Form!AB40/(SUM(Form!AB40:AB62)))","v":""},{"$f":"IF(Form!AD40=\"\",\"\",Form!AD40/(SUM(Form!$AD$30:$AD$49)))","v":""},{"$f":"IF(Form!AF40=\"\",\"\",Form!AF40/(SUM(Form!$AF$30:$AF$49)))","v":""},"","","","","",null,{"$f":"IF(Form!AH40=\"\",\"\",Form!AH40/(SUM(Form!$AH$30:$AH$49)))","v":""},"",null,{"$f":"IF(Form!AK40=\"\",\"\",Form!AK40)","v":""}]
[null,"A",{"$f":"IF(Form!C41=\"\",\"\",Form!C41)","v":""},{"$f":"IF(Form!G41=\"\",\"\",Form!G41)","v":""},{"$f":"IF(Form!K41=\"\",\"\",Form!K41)","v":""},null,null,null,null,null,null,null,null,{"$f":"IF(Form!R41=\"\",\"\",Form!R41/SUM(Form!$R$30:$R$49))","v":""},{"$f":"IF(Form!T41=\"\",\"\",Form!T41/SUM(Form!$T$30:$T$49))","v":""},"","",null,{"$f":"IF(Form!V41=\"\",\"\",Form!V41/(SUM(Form!$V$30:$V$49)))","v":""},"","","","","",null,{"$f":"IF(Form!X41=\"\",\"\",Form!X41/(SUM(Form!$X$30:$X$49)))","v":""},{"$f":"IF(Form!Z41=\"\",\"\",Form!Z41/(SUM(Form!$Z$30:$Z$49)))","v":""},{"$f":"IF(Form!AB41=\"\",\"\",Form!AB41/(SUM(Form!AB41:AB63)))","v":""},{"$f":"IF(Form!AD41=\"\",\"\",Form!AD41/(SUM(Form!$AD$30:$AD$49)))","v":""},{"$f":"IF(Form!AF41=\"\",\"\",Form!AF41/(SUM(Form!$AF$30:$AF$49)))","v":""},"","","","","",null,{"$f":"IF(Form!AH41=\"\",\"\",Form!AH41/(SUM(Form!$AH$30:$AH$49)))","v":""},"",null,{"$f":"IF(Form!AK41=\"\",\"\",Form!AK41)","v":""}]
[null,"A",{"$f":"IF(Form!C42=\"\",\"\",Form!C42)","v":""},{"$f":"IF(Form!G42=\"\",\"\",Form!G42)","v":""},{"$f":"IF(Form!K42=\"\",\"\",Form!K42)","v":""},null,null,null,null,null,null,null,null,{"$f":"IF(Form!R42=\"\",\"\",Form!R42/SUM(Form!$R$30:$R$49))","v":""},{"$f":"IF(Form!T42=\"\",\"\",Form!T42/SUM(Form!$T$30:$T$49))","v":""},"","",null,{"$f":"IF(Form!V42=\"\",\"\",Form!V42/(SUM(Form!$V$30:$V$49)))","v":""},"","","","","",null,{"$f":"IF(Form!X42=\"\",\"\",Form!X42/(SUM(Form!$X$30:$X$49)))","v":""},{"$f":"IF(Form!Z42=\"\",\"\",Form!Z42/(SUM(Form!$Z$30:$Z$49)))","v":""},{"$f":"IF(Form!AB42=\"\",\"\",Form!AB42/(SUM(Form!AB42:AB64)))","v":""},{"$f":"IF(Form!AD42=\"\",\"\",Form!AD42/(SUM(Form!$AD$30:$AD$49)))","v":""},{"$f":"IF(Form!AF42=\"\",\"\",Form!AF42/(SUM(Form!$AF$30:$AF$49)))","v":""},"","","","","",null,{"$f":"IF(Form!AH42=\"\",\"\",Form!AH42/(SUM(Form!$AH$30:$AH$49)))","v":""},"",null,{"$f":"IF(Form!AK42=\"\",\"\",Form!AK42)","v":""}]
[null,"A",{"$f":"IF(Form!C43=\"\",\"\",Form!C43)","v":""},{"$f":"IF(Form!G43=\"\",\"\",Form!G43)","v":""},{"$f":"IF(Form!K43=\"\",\"\",Form!K43)","v":""},null,null,null,null,null,null,null,null,{"$f":"IF(Form!R43=\"\",\"\",Form!R43/SUM(Form!$R$30:$R$49))","v":""},{"$f":"IF(Form!T43=\"\",\"\",Form!T43/SUM(Form!$T$30:$T$49))","v":""},"","",null,{"$f":"IF(Form!V43=\"\",\"\",Form!V43/(SUM(Form!$V$30:$V$49)))","v":""},"","","","","",null,{"$f":"IF(Form!X43=\"\",\"\",Form!X43/(SUM(Form!$X$30:$X$49)))","v":""},{"$f":"IF(Form!Z43=\"\",\"\",Form!Z43/(SUM(Form!$Z$30:$Z$49)))","v":""},{"$f":"IF(Form!AB43=\"\",\"\",Form!AB43/(SUM(Form!AB43:AB65)))","v":""},{"$f":"IF(Form!AD43=\"\",\"\",Form!AD43/(SUM(Form!$AD$30:$AD$49)))","v":""},{"$f":"IF(Form!AF43=\"\",\"\",Form!AF43/(SUM(Form!$AF$30:$AF$49)))","v":""},"","","","","",null,{"$f":"IF(Form!AH43=\"\",\"\",Form!AH43/(SUM(Form!$AH$30:$AH$49)))","v":""},"",null,{"$f":"IF(Form!AK43=\"\",\"\",Form!AK43)","v":""}]
[null,"A",{"$f":"IF(Form!C44=\"\",\"\",Form!C44)","v":""},{"$f":"IF(Form!G44=\"\",\"\",Form!G44)","v":""},{"$f":"IF(Form!K44=\"\",\"\",Form!K44)","v":""},null,null,null,null,null,null,null,null,{"$f":"IF(Form!R44=\"\",\"\",Form!R44/SUM(Form!$R$30:$R$49))","v":""},{"$f":"IF(Form!T44=\"\",\"\",Form!T44/SUM(Form!$T$30:$T$49))","v":""},"","",null,{"$f":"IF(Form!V44=\"\",\"\",Form!V44/(SUM(Form!$V$30:$V$49)))","v":""},"","","","","",null,{"$f":"IF(Form!X44=\"\",\"\",Form!X44/(SUM(Form!$X$30:$X$49)))","v":""},{"$f":"IF(Form!Z44=\"\",\"\",Form!Z44/(SUM(Form!$Z$30:$Z$49)))","v":""},{"$f":"IF(Form!AB44=\"\",\"\",Form!AB44/(SUM(Form!AB44:AB66)))","v":""},{"$f":"IF(Form!AD44=\"\",\"\",Form!AD44/(SUM(Form!$AD$30:$AD$49)))","v":""},{"$f":"IF(Form!AF44=\"\",\"\",Form!AF44/(SUM(Form!$AF$30:$AF$49)))","v":""},"","","","","",null,{"$f":"IF(Form!AH44=\"\",\"\",Form!AH44/(SUM(Form!$AH$30:$AH$49)))","v":""},"",null,{"$f":"IF(Form!AK44=\"\",\"\",Form!AK44)","v":""}]
[null,"A",{"$f":"IF(Form!C45=\"\",\"\",Form!C45)","v":""},{"$f":"IF(Form!G45=\"\",\"\",Form!G45)","v":""},{"$f":"IF(Form!K45=\"\",\"\",Form!K45)","v":""},null,null,null,null,null,null,null,null,{"$f":"IF(Form!R45=\"\",\"\",Form!R45/SUM(Form!$R$30:$R$49))","v":""},{"$f":"IF(Form!T45=\"\",\"\",Form!T45/SUM(Form!$T$30:$T$49))","v":""},"","",null,{"$f":"IF(Form!V45=\"\",\"\",Form!V45/(SUM(Form!$V$30:$V$49)))","v":""},"","","","","",null,{"$f":"IF(Form!X45=\"\",\"\",Form!X45/(SUM(Form!$X$30:$X$49)))","v":""},{"$f":"IF(Form!Z45=\"\",\"\",Form!Z45/(SUM(Form!$Z$30:$Z$49)))","v":""},{"$f":"IF(Form!AB45=\"\",\"\",Form!AB45/(SUM(Form!AB45:AB67)))","v":""},{"$f":"IF(Form!AD45=\"\",\"\",Form!AD45/(SUM(Form!$AD$30:$AD$49)))","v":""},{"$f":"IF(Form!AF45=\"\",\"\",Form!AF45/(SUM(Form!$AF$30:$AF$49)))","v":""},"","","","","",null,{"$f":"IF(Form!AH45=\"\",\"\",Form!AH45/(SUM(Form!$AH$30:$AH$49)))","v":""},"",null,{"$f":"IF(Form!AK45=\"\",\"\",Form!AK45)","v":""}]
[null,"A",{"$f":"IF(Form!C46=\"\",\"\",Form!C46)","v":""},{"$f":"IF(Form!G46=\"\",\"\",Form!G46)","v":""},{"$f":"IF(Form!K46=\"\",\"\",Form!K46)","v":""},null,null,null,null,null,null,null,null,{"$f":"IF(Form!R46=\"\",\"\",Form!R46/SUM(Form!$R$30:$R$49))","v":""},{"$f":"IF(Form!T46=\"\",\"\",Form!T46/SUM(Form!$T$30:$T$49))","v":""},"","",null,{"$f":"IF(Form!V46=\"\",\"\",Form!V46/(SUM(Form!$V$30:$V$49)))","v":""},"","","","","",null,{"$f":"IF(Form!X46=\"\",\"\",Form!X46/(SUM(Form!$X$30:$X$49)))","v":""},{"$f":"IF(Form!Z46=\"\",\"\",Form!Z46/(SUM(Form!$Z$30:$Z$49)))","v":""},{"$f":"IF(Form!AB46=\"\",\"\",Form!AB46/(SUM(Form!AB46:AB68)))","v":""},{"$f":"IF(Form!AD46=\"\",\"\",Form!AD46/(SUM(Form!$AD$30:$AD$49)))","v":""},{"$f":"IF(Form!AF46=\"\",\"\",Form!AF46/(SUM(Form!$AF$30:$AF$49)))","v":""},"","","","","",null,{"$f":"IF(Form!AH46=\"\",\"\",Form!AH46/(SUM(Form!$AH$30:$AH$49)))","v":""},"",null,{"$f":"IF(Form!AK46=\"\",\"\",Form!AK46)","v":""}]
[null,"A",{"$f":"IF(Form!C47=\"\",\"\",Form!C47)","v":""},{"$f":"IF(Form!G47=\"\",\"\",Form!G47)","v":""},{"$f":"IF(Form!K47=\"\",\"\",Form!K47)","v":""},null,null,null,null,null,null,null,null,{"$f":"IF(Form!R47=\"\",\"\",Form!R47/SUM(Form!$R$30:$R$49))","v":""},{"$f":"IF(Form!T47=\"\",\"\",Form!T47/SUM(Form!$T$30:$T$49))","v":""},"","",null,{"$f":"IF(Form!V47=\"\",\"\",Form!V47/(SUM(Form!$V$30:$V$49)))","v":""},"","","","","",null,{"$f":"IF(Form!X47=\"\",\"\",Form!X47/(SUM(Form!$X$30:$X$49)))","v":""},{"$f":"IF(Form!Z47=\"\",\"\",Form!Z47/(SUM(Form!$Z$30:$Z$49)))","v":""},{"$f":"IF(Form!AB47=\"\",\"\",Form!AB47/(SUM(Form!AB47:AB69)))","v":""},{"$f":"IF(Form!AD47=\"\",\"\",Form!AD47/(SUM(Form!$AD$30:$AD$49)))","v":""},{"$f":"IF(Form!AF47=\"\",\"\",Form!AF47/(SUM(Form!$AF$30:$AF$49)))","v":""},"","","","","",null,{"$f":"IF(Form!AH47=\"\",\"\",Form!AH47/(SUM(Form!$AH$30:$AH$49)))","v":""},"",null,{"$f":"IF(Form!AK47=\"\",\"\",Form!AK47)","v":""}]
[null,"A",{"$f":"IF(Form!C48=\"\",\"\",Form!C48)","v":""},{"$f":"IF(Form!G48=\"\",\"\",Form!G48)","v":""},{"$f":"IF(Form!K48=\"\",\"\",Form!K48)","v":""},null,null,null,null,null,null,null,null,{"$f":"IF(Form!R48=\"\",\"\",Form!R48/SUM(Form!$R$30:$R$49))","v":""},{"$f":"IF(Form!T48=\"\",\"\",Form!T48/SUM(Form!$T$30:$T$49))","v":""},"","",null,{"$f":"IF(Form!V48=\"\",\"\",Form!V48/(SUM(Form!$V$30:$V$49)))","v":""},"","","","","",null,{"$f":"IF(Form!X48=\"\",\"\",Form!X48/(SUM(Form!$X$30:$X$49)))","v":""},{"$f":"IF(Form!Z48=\"\",\"\",Form!Z48/(SUM(Form!$Z$30:$Z$49)))","v":""},{"$f":"IF(Form!AB48=\"\",\"\",Form!AB48/(SUM(Form!AB48:AB70)))","v":""},{"$f":"IF(Form!AD48=\"\",\"\",Form!AD48/(SUM(Form!$AD$30:$AD$49)))","v":""},{"$f":"IF(Form!AF48=\"\",\"\",Form!AF48/(SUM(Form!$AF$30:$AF$49)))","v":""},"","","","","",null,{"$f":"IF(Form!AH48=\"\",\"\",Form!AH48/(SUM(Form!$AH$30:$AH$49)))","v":""},"",null,{"$f":"IF(Form!AK48=\"\",\"\",Form!AK48)","v":""}]
[null,"A",{"$f":"IF(Form!C49=\"\",\"\",Form!C49)","v":""},{"$f":"IF(Form!G49=\"\",\"\",Form!G49)","v":""},{"$f":"IF(Form!K49=\"\",\"\",Form!K49)","v":""},null,null,null,null,null,null,null,null,{"$f":"IF(Form!R49=\"\",\"\",Form!R49/SUM(Form!$R$30:$R$49))","v":""},{"$f":"IF(Form!T49=\"\",\"\",Form!T49/SUM(Form!$T$30:$T$49))","v":""},"","",null,{"$f":"IF(Form!V49=\"\",\"\",Form!V49/(SUM(Form!$V$30:$V$49)))","v":""},"","","","","",null,{"$f":"IF(Form!X49=\"\",\"\",Form!X49/(SUM(Form!$X$30:$X$49)))","v":""},{"$f":"IF(Form!Z49=\"\",\"\",Form!Z49/(SUM(Form!$Z$30:$Z$49)))","v":""},{"$f":"IF(Form!AB49=\"\",\"\",Form!AB49/(SUM(Form!AB49:AB71)))","v":""},{"$f":"IF(Form!AD49=\"\",\"\",Form!AD49/(SUM(Form!$AD$30:$AD$49)))","v":""},{"$f":"IF(Form!AF49=\"\",\"\",Form!AF49/(SUM(Form!$AF$30:$AF$49)))","v":""},"","","","","",null,{"$f":"IF(Form!AH49=\"\",\"\",Form!AH49/(SUM(Form!$AH$30:$AH$49)))","v":""},"",null,{"$f":"IF(Form!AK49=\"\",\"\",Form!AK49)","v":""}]
[null,null,null,null,null,null,null,null,null,null,null,null,{"$f":"IF(AN30=\"\",\"\",IF(SUM(P30:AI30,AL30)=AN30,\"\",\"N\"))","v":""},null,null,{"$f":"IF(SUM(P10:P29)=0,\"\",SUM(P10:P29))","v":""},{"$f":"IF(SUM(Q10:Q29)=0,\"\",SUM(Q10:Q29))","v":""},null,null,{"$f":"IF(SUM(T10:T29)=0,\"\",SUM(T10:T29))","v":""},{"$f":"IF(SUM(U10:U29)=0,\"\",SUM(U10:U29))","v":""},{"$f":"IF(SUM(V10:V29)=0,\"\",SUM(V10:V29))","v":""},{"$f":"IF(SUM(W10:W29)=0,\"\",SUM(W10:W29))","v":""},{"$f":"IF(SUM(X10:X29)=0,\"\",SUM(X10:X29))","v":""},null,null,null,null,null,null,{"$f":"IF(SUM(AE10:AE29)=0,\"\",SUM(AE10:AE29))","v":""},{"$f":"IF(SUM(AF10:AF29)=0,\"\",SUM(AF10:AF29))","v":""},{"$f":"IF(SUM(AG10:AG29)=0,\"\",SUM(AG10:AG29))","v":""},{"$f":"IF(SUM(AH10:AH29)=0,\"\",SUM(AH10:AH29))","v":""},{"$f":"IF(SUM(AI10:AI29)=0,\"\",SUM(AI10:AI29))","v":""},null,null,{"$f":"IF(SUM(AL10:AL29)=0,\"\",SUM(AL10:AL29))","v":""},null,{"$f":"IF(AN10=\"\",\"\",SUM(AN10:AN29))","v":""}]
[]
[]
[]
[]
[]
[]
[]
[]
[]
[]
[]
[]
[]
[]
[]
[]
[]
[]
[]
[]
[]
[]
[]
[]
[]
[]
[]
[]
[]
[]
[]
[]
[]
[]
[]
[]
[]
[]
[]
[]
[]
[]
[]
[]
[]
[]
[]
[]
[]
[]
[]
[]
[]
[]
[]
[]
[]
[]
[]
[]
[]
[]
[]
[]
[]
[]
[]
[]
[]
[]
[]
[]
[]
[]
[]
[]
[]
[]
[]
[]
[]
[]
[]
[]
[]
[]
[]
[]
[]
[]
[]
[]
[]
[]
[]
[]
[]
[]
[]
[]
[]
[]
[]
[]
[]
[]
[]
[]
[]
[]
[]
[]
[]
[]
[]
[]
[]
[null,null,null,"Public"]
[null,null,null,"Private"]
[null,null,null,"Local Levy"]
[null,null,null,"Other"]

{"sheet":"Data Entry (efficiencies)","index":2,"n_rows":181,"n_cols":38,"rows_kept":181,"cut":false,"hidden":false,"merged":[[7,20,7,21],[6,8,6,15],[3,4,3,10],[4,4,4,10],[6,30,6,34],[5,18,5,28],[6,22,6,24],[6,25,6,27]]}
[]
[]
[]
[null,null,null,null,"Data entry sheet"]
[null,null,null,null,{"$f":"\"Efficiencies for \" & TEXT(Form!C19,\" \")","v":"Efficiencies for Oxford Flood Alleviation Scheme"}]
[null,null,null,null,null,null,null,null,null,null,null,null,null,null,null,null,null,null,"------------------------------------------------------------------------------------------------------------------------------------------ Claimed efficiency -----------------------------------------------------------------------------------------------------------------------------------------------"]
[null,null,"NPN","Area","Original plan (baseline)","Description","Category",null,"------------------------------------- Forecast efficiency --------------------------------------",null,null,null,null,null,null,null,null,null,null,null,null,null,"-------------- Efficiency reinvested -------------",null,null,"-------------- Efficiency handed back -------------",null,null,null,null,"------------------------------------------------------------------------- Commercial information ---------------------------------------------------------------------------"]
[null,null,null,null,null,null,null,null,"Quarter","14/15","15/16","16/17","17/18","18/19","19/20","Beyond","Total",null,"Outcome","Actual value","Date realised",null,"Value","Description","Comment","Value","Description","Comment","How was efficiency value calculated?",null,"Lead consultant","Lead constructor","Lead cost management","Saving identifed by","Project team agreement",null,"Total GIA","Total Other"]
[]
[null,"A",{"$f":"Form!$Q$19","v":"THC040E/001A/007A"},{"$f":"Form!#REF!","v":{"$error":"#REF!"}},{"$f":"IF(Form!G59=\"\",\"\",Form!G59)","v":"2Nr full time ecologists survey 70 ponds to identify if there is a presence of great crested newts"},{"$f":"IF(Form!O59=\"\",\"\",Form!O59)","v":"Environmental DNA (eDNA) is a new technique which can detect great crested newt DNA in a water body. A water sample is collected in May from the target pond, which is then tested in a lab for the presence of the GCN DNA."},"Innovation and value engineering",null,{"$f":"IF(Form!X59=\"\",\"\",Form!X59)","v":"Q2"},{"$f":"IF(Form!Z59=\"\",\"\",Form!Z59)","v":0},{"$f":"IF(Form!AB59=\"\",\"\",Form!AB59)","v":""},{"$f":"IF(Form!AD59=\"\",\"\",Form!AD59)","v":60000},{"$f":"IF(Form!AF59=\"\",\"\",Form!AF59)","v":""},{"$f":"IF(Form!AH59=\"\",\"\",Form!AH59)","v":""},{"$f":"IF(Form!AJ59=\"\",\"\",Form!AJ59)","v":""},{"$f":"IF(Form!AL59=\"\",\"\",Form!AL59)","v":""},{"$f":"IF(SUM(J10:P10)=0,\"\",SUM(J10:P10))","v":60000},null,"Same outcome but more cost effective",60000,"Q2","2016-08-02",60000,"Risk realised within budget","Jo Larmour",null,null,null,"Cost of staff time and lab costs valued against original technique of mulitple ecologists visits on site",null,"Halcrow group Ltd","Halcrow group Ltd","EC Harris","Penny Burt","Agreed",null,{"$f":"SUM(Form!$X$55:$AM$55)","v":9930382},{"$f":"SUM(Form!$X$55:$AM$56)","v":9930382}]
[null,"A",{"$f":"Form!$Q$19","v":"THC040E/001A/007A"},{"$f":"Form!#REF!","v":{"$error":"#REF!"}},{"$f":"IF(Form!G60=\"\",\"\",Form!G60)","v":"Utilise Lot 4 to construct culverts under railway"},{"$f":"IF(Form!O60=\"\",\"\",Form!O60)","v":"Network Rail constructed culverts on their flood relief project. See briefing note"},"Contracting approach",null,{"$f":"IF(Form!X60=\"\",\"\",Form!X60)","v":"Q2"},{"$f":"IF(Form!Z60=\"\",\"\",Form!Z60)","v":0},{"$f":"IF(Form!AB60=\"\",\"\",Form!AB60)","v":""},{"$f":"IF(Form!AD60=\"\",\"\",Form!AD60)","v":3000000},{"$f":"IF(Form!AF60=\"\",\"\",Form!AF60)","v":""},{"$f":"IF(Form!AH60=\"\",\"\",Form!AH60)","v":""},{"$f":"IF(Form!AJ60=\"\",\"\",Form!AJ60)","v":""},{"$f":"IF(Form!AL60=\"\",\"\",Form!AL60)","v":""},{"$f":"IF(SUM(J11:P11)=0,\"\",SUM(J11:P11))","v":3000000},null,"Allowed the project to progress. It is highly unlikely that the project would have been able to progress as we wont have go the line closure.  In addition, this is a significant cost saving for the project.  See briefing note",3000000,"Q2","2016-08-01",3000000,"Risk realised within budget","Jo Larmour aware",null,null,null,"See Briefing note",null,"Halcrow group Ltd","Halcrow group Ltd","EC Harris","Richard Harding","Agreed",null,{"$f":"SUM(Form!$X$55:$AM$55)","v":9930382},{"$f":"SUM(Form!$X$55:$AM$56)","v":9930382}]
[null,"A",null,null,{"$f":"IF(Form!G61=\"\",\"\",Form!G61)","v":"600,000- 700,000m3 to be taken to landfill"},{"$f":"IF(Form!O61=\"\",\"\",Form!O61)","v":"400,000m3 now to be taken to tip"},"Streamlining",null,{"$f":"IF(Form!X61=\"\",\"\",Form!X61)","v":"Q3"},{"$f":"IF(Form!Z61=\"\",\"\",Form!Z61)","v":0},{"$f":"IF(Form!AB61=\"\",\"\",Form!AB61)","v":""},{"$f":"IF(Form!AD61=\"\",\"\",Form!AD61)","v":5000000},{"$f":"IF(Form!AF61=\"\",\"\",Form!AF61)","v":""},{"$f":"IF(Form!AH61=\"\",\"\",Form!AH61)","v":""},{"$f":"IF(Form!AJ61=\"\",\"\",Form!AJ61)","v":""},{"$f":"IF(Form!AL61=\"\",\"\",Form!AL61)","v":""},5000000,null,"Reduction in costs and therefore reducing our funding gap and programme ",5000000,"Q3","1905-07-08",5000000,"Risk realised within budget","Jo Larmour aware",null,null,null,"Calculated value saved of volumn of material not being excavation and disposal of material to landfill.  This value has been calculated between the costs in the SOC and the costs in OBC",null,"Halcrow group Ltd","Halcrow group Ltd","EC Harris","Richard Harding","Agreed",null,{"$f":"SUM(Form!$X$55:$AM$55)","v":9930382},{"$f":"SUM(Form!$X$55:$AM$56)","v":9930382}]
[null,"A",null,null,{"$f":"IF(Form!G62=\"\",\"\",Form!G62)","v":"Hydrological and hydraulic modelling using standard industry practices"},{"$f":"IF(Form!O62=\"\",\"\",Form!O62)","v":"Utilise CH2M's unique global flood modelling software "},"Innovation and value engineering",null,{"$f":"IF(Form!X62=\"\",\"\",Form!X62)","v":"Q2"},{"$f":"IF(Form!Z62=\"\",\"\",Form!Z62)","v":0},{"$f":"IF(Form!AB62=\"\",\"\",Form!AB62)","v":""},{"$f":"IF(Form!AD62=\"\",\"\",Form!AD62)","v":128000},{"$f":"IF(Form!AF62=\"\",\"\",Form!AF62)","v":""},{"$f":"IF(Form!AH62=\"\",\"\",Form!AH62)","v":""},{"$f":"IF(Form!AJ62=\"\",\"\",Form!AJ62)","v":""},{"$f":"IF(Form!AL62=\"\",\"\",Form!AL62)","v":""},128000,null,"Allowed the project to get to the design solution quickier by running different options in parallel.  Softwarre want available at time of the bid and a unique piece of software to CH2M",{"$f":"10000","v":10000},"Q2","1905-07-08",{"$f":"10000","v":10000},"Risk realised within budget","Jo Larmour aware",null,null,null,"The saving on programme also equates to a saving in cost – 8 weeks of additional PM time, so conservatively £4,800. Setting everything up in Global Flood Modeller, also reduces the cost of setting up each simulation, equating to at least 15 minutes saved for each simulation run. So, we have run well over 200 simulations, saving at least another £3,000. In total, GFM has saved 8 weeks of programme time and at least £10k in costs. ",null,"Halcrow group Ltd","Halcrow group Ltd","EC Harris","Heather Taylor","Agreed",null,{"$f":"SUM(Form!$X$55:$AM$55)","v":9930382},{"$f":"SUM(Form!$X$55:$AM$56)","v":9930382}]
[null,"A",null,null,{"$f":"IF(Form!G63=\"\",\"\",Form!G63)","v":"A Form E was required for 3 team members to secure authorisation to negotiate for third party contributions (FCRM capital projects) and to evidence the approval of third party contributions to projects for 12 investors"},{"$f":"IF(Form!O63=\"\",\"\",Form!O63)","v":"The project sought an agreement to submit one Form E covering all three project team members and the twelve investors. This saved the Operations Director and Area Manager needing to review and sign off 36 different documents. "},"Streamlining",null,{"$f":"IF(Form!X63=\"\",\"\",Form!X63)","v":"Q2"},{"$f":"IF(Form!Z63=\"\",\"\",Form!Z63)","v":0},{"$f":"IF(Form!AB63=\"\",\"\",Form!AB63)","v":""},{"$f":"IF(Form!AD63=\"\",\"\",Form!AD63)","v":1000},{"$f":"IF(Form!AF63=\"\",\"\",Form!AF63)","v":""},{"$f":"IF(Form!AH63=\"\",\"\",Form!AH63)","v":""},{"$f":"IF(Form!AJ63=\"\",\"\",Form!AJ63)","v":""},{"$f":"IF(Form!AL63=\"\",\"\",Form!AL63)","v":""},1000,null,"2 persons time over 2 days",1000,"Q2","2016-08-01",null,"Risk realised within budget","Jo Larmour aware",null,null,null,"Calculated as a staff rate, time saved",null,"Halcrow group Ltd","Halcrow group Ltd","EC Harris","Emma Formoy","Agreed",null,{"$f":"SUM(Form!$X$55:$AM$55)","v":9930382},{"$f":"SUM(Form!$X$55:$AM$56)","v":9930382}]
[null,"A",null,null,{"$f":"IF(Form!G64=\"\",\"\",Form!G64)","v":"OBC sign off- shorten assurance process"},{"$f":"IF(Form!O64=\"\",\"\",Form!O64)","v":"Original timeline for assurance process would have been adopted"},"Streamlining",null,{"$f":"IF(Form!X64=\"\",\"\",Form!X64)","v":""},{"$f":"IF(Form!Z64=\"\",\"\",Form!Z64)","v":0},{"$f":"IF(Form!AB64=\"\",\"\",Form!AB64)","v":""},{"$f":"IF(Form!AD64=\"\",\"\",Form!AD64)","v":""},{"$f":"IF(Form!AF64=\"\",\"\",Form!AF64)","v":""},{"$f":"IF(Form!AH64=\"\",\"\",Form!AH64)","v":""},{"$f":"IF(Form!AJ64=\"\",\"\",Form!AJ64)","v":""},{"$f":"IF(Form!AL64=\"\",\"\",Form!AL64)","v":""},"",null,null,null,null,null,null,null,null,null,null,null,null,null,null,null,null,null,null,null,{"$f":"SUM(Form!$X$55:$AM$55)","v":9930382},{"$f":"SUM(Form!$X$55:$AM$56)","v":9930382}]
[null,"A",null,null,{"$f":"IF(Form!G65=\"\",\"\",Form!G65)","v":"Planning application to be submitted to the three planning authorities "},{"$f":"IF(Form!O65=\"\",\"\",Form!O65)","v":"In principal agreement that there wil be a single application and single determination by the Oxford County Council"},"Streamlining",null,{"$f":"IF(Form!X65=\"\",\"\",Form!X65)","v":""},{"$f":"IF(Form!Z65=\"\",\"\",Form!Z65)","v":0},{"$f":"IF(Form!AB65=\"\",\"\",Form!AB65)","v":""},{"$f":"IF(Form!AD65=\"\",\"\",Form!AD65)","v":""},{"$f":"IF(Form!AF65=\"\",\"\",Form!AF65)","v":""},{"$f":"IF(Form!AH65=\"\",\"\",Form!AH65)","v":""},{"$f":"IF(Form!AJ65=\"\",\"\",Form!AJ65)","v":""},{"$f":"IF(Form!AL65=\"\",\"\",Form!AL65)","v":""},"",null,null,null,null,null,null,null,null,null,null,null,null,null,null,null,null,null,null,null,{"$f":"SUM(Form!$X$55:$AM$55)","v":9930382},{"$f":"SUM(Form!$X$55:$AM$56)","v":9930382}]
[null,"A",null,null,{"$f":"IF(Form!G66=\"\",\"\",Form!G66)","v":"Materials management solution"},{"$f":"IF(Form!O66=\"\",\"\",Form!O66)","v":0},"Innovation and value engineering",null,{"$f":"IF(Form!X66=\"\",\"\",Form!X66)","v":""},{"$f":"IF(Form!Z66=\"\",\"\",Form!Z66)","v":0},{"$f":"IF(Form!AB66=\"\",\"\",Form!AB66)","v":""},{"$f":"IF(Form!AD66=\"\",\"\",Form!AD66)","v":""},{"$f":"IF(Form!AF66=\"\",\"\",Form!AF66)","v":""},{"$f":"IF(Form!AH66=\"\",\"\",Form!AH66)","v":""},{"$f":"IF(Form!AJ66=\"\",\"\",Form!AJ66)","v":""},{"$f":"IF(Form!AL66=\"\",\"\",Form!AL66)","v":""},"",null,null,null,null,null,null,null,null,null,null,null,null,null,null,null,null,null,null,null,{"$f":"SUM(Form!$X$55:$AM$55)","v":9930382},{"$f":"SUM(Form!$X$55:$AM$56)","v":9930382}]
[null,"A",null,null,{"$f":"IF(Form!G67=\"\",\"\",Form!G67)","v":0},{"$f":"IF(Form!O67=\"\",\"\",Form!O67)","v":0},null,null,{"$f":"IF(Form!X67=\"\",\"\",Form!X67)","v":""},{"$f":"IF(Form!Z67=\"\",\"\",Form!Z67)","v":0},{"$f":"IF(Form!AB67=\"\",\"\",Form!AB67)","v":""},{"$f":"IF(Form!AD67=\"\",\"\",Form!AD67)","v":""},{"$f":"IF(Form!AF67=\"\",\"\",Form!AF67)","v":""},{"$f":"IF(Form!AH67=\"\",\"\",Form!AH67)","v":""},{"$f":"IF(Form!AJ67=\"\",\"\",Form!AJ67)","v":""},{"$f":"IF(Form!AL67=\"\",\"\",Form!AL67)","v":""},"",null,null,null,null,null,null,null,null,null,null,null,null,null,null,null,null,null,null,null,{"$f":"SUM(Form!$X$55:$AM$55)","v":9930382},{"$f":"SUM(Form!$X$55:$AM$56)","v":9930382}]
[null,"A",null,null,{"$f":"IF(Form!G68=\"\",\"\",Form!G68)","v":0},{"$f":"IF(Form!O68=\"\",\"\",Form!O68)","v":0},null,null,{"$f":"IF(Form!X68=\"\",\"\",Form!X68)","v":""},{"$f":"IF(Form!Z68=\"\",\"\",Form!Z68)","v":0},{"$f":"IF(Form!AB68=\"\",\"\",Form!AB68)","v":""},{"$f":"IF(Form!AD68=\"\",\"\",Form!AD68)","v":""},{"$f":"IF(Form!AF68=\"\",\"\",Form!AF68)","v":""},{"$f":"IF(Form!AH68=\"\",\"\",Form!AH68)","v":""},{"$f":"IF(Form!AJ68=\"\",\"\",Form!AJ68)","v":""},{"$f":"IF(Form!AL68=\"\",\"\",Form!AL68)","v":""},"",null,null,null,null,null,null,null,null,null,null,null,null,null,null,null,null,null,null,null,{"$f":"SUM(Form!$X$55:$AM$55)","v":9930382},{"$f":"SUM(Form!$X$55:$AM$56)","v":9930382}]
[null,"A",null,null,{"$f":"IF(Form!G69=\"\",\"\",Form!G69)","v":0},{"$f":"IF(Form!O69=\"\",\"\",Form!O69)","v":0},null,null,{"$f":"IF(Form!X69=\"\",\"\",Form!X69)","v":""},{"$f":"IF(Form!Z69=\"\",\"\",Form!Z69)","v":0},{"$f":"IF(Form!AB69=\"\",\"\",Form!AB69)","v":""},{"$f":"IF(Form!AD69=\"\",\"\",Form!AD69)","v":""},{"$f":"IF(Form!AF69=\"\",\"\",Form!AF69)","v":""},{"$f":"IF(Form!AH69=\"\",\"\",Form!AH69)","v":""},{"$f":"IF(Form!AJ69=\"\",\"\",Form!AJ69)","v":""},{"$f":"IF(Form!AL69=\"\",\"\",Form!AL69)","v":""},"",null,null,null,null,null,null,null,null,null,null,null,null,null,null,null,null,null,null,null,{"$f":"SUM(Form!$X$55:$AM$55)","v":9930382},{"$f":"SUM(Form!$X$55:$AM$56)","v":9930382}]
[null,"A",null,null,{"$f":"IF(Form!G70=\"\",\"\",Form!G70)","v":0},{"$f":"IF(Form!O70=\"\",\"\",Form!O70)","v":0},null,null,{"$f":"IF(Form!X70=\"\",\"\",Form!X70)","v":""},{"$f":"IF(Form!Z70=\"\",\"\",Form!Z70)","v":0},{"$f":"IF(Form!AB70=\"\",\"\",Form!AB70)","v":""},{"$f":"IF(Form!AD70=\"\",\"\",Form!AD70)","v":""},{"$f":"IF(Form!AF70=\"\",\"\",Form!AF70)","v":""},{"$f":"IF(Form!AH70=\"\",\"\",Form!AH70)","v":""},{"$f":"IF(Form!AJ70=\"\",\"\",Form!AJ70)","v":""},{"$f":"IF(Form!AL70=\"\",\"\",Form!AL70)","v":""},"",null,null,null,null,null,null,null,null,null,null,null,null,null,null,null,null,null,null,null,{"$f":"SUM(Form!$X$55:$AM$55)","v":9930382},{"$f":"SUM(Form!$X$55:$AM$56)","v":9930382}]
[null,"A",null,null,{"$f":"IF(Form!G71=\"\",\"\",Form!G71)","v":0},{"$f":"IF(Form!O71=\"\",\"\",Form!O71)","v":0},null,null,{"$f":"IF(Form!X71=\"\",\"\",Form!X71)","v":""},{"$f":"IF(Form!Z71=\"\",\"\",Form!Z71)","v":0},{"$f":"IF(Form!AB71=\"\",\"\",Form!AB71)","v":""},{"$f":"IF(Form!AD71=\"\",\"\",Form!AD71)","v":""},{"$f":"IF(Form!AF71=\"\",\"\",Form!AF71)","v":""},{"$f":"IF(Form!AH71=\"\",\"\",Form!AH71)","v":""},{"$f":"IF(Form!AJ71=\"\",\"\",Form!AJ71)","v":""},{"$f":"IF(Form!AL71=\"\",\"\",Form!AL71)","v":""},"",null,null,null,null,null,null,null,null,null,null,null,null,null,null,null,null,null,null,null,{"$f":"SUM(Form!$X$55:$AM$55)","v":9930382},{"$f":"SUM(Form!$X$55:$AM$56)","v":9930382}]
[null,"A",null,null,{"$f":"IF(Form!G72=\"\",\"\",Form!G72)","v":0},{"$f":"IF(Form!O72=\"\",\"\",Form!O72)","v":0},null,null,{"$f":"IF(Form!X72=\"\",\"\",Form!X72)","v":""},{"$f":"IF(Form!Z72=\"\",\"\",Form!Z72)","v":0},{"$f":"IF(Form!AB72=\"\",\"\",Form!AB72)","v":""},{"$f":"IF(Form!AD72=\"\",\"\",Form!AD72)","v":""},{"$f":"IF(Form!AF72=\"\",\"\",Form!AF72)","v":""},{"$f":"IF(Form!AH72=\"\",\"\",Form!AH72)","v":""},{"$f":"IF(Form!AJ72=\"\",\"\",Form!AJ72)","v":""},{"$f":"IF(Form!AL72=\"\",\"\",Form!AL72)","v":""},"",null,null,null,null,null,null,null,null,null,null,null,null,null,null,null,null,null,null,null,{"$f":"SUM(Form!$X$55:$AM$55)","v":9930382},{"$f":"SUM(Form!$X$55:$AM$56)","v":9930382}]
[null,"A",null,null,{"$f":"IF(Form!G73=\"\",\"\",Form!G73)","v":0},{"$f":"IF(Form!O73=\"\",\"\",Form!O73)","v":0},null,null,{"$f":"IF(Form!X73=\"\",\"\",Form!X73)","v":""},{"$f":"IF(Form!Z73=\"\",\"\",Form!Z73)","v":0},{"$f":"IF(Form!AB73=\"\",\"\",Form!AB73)","v":""},{"$f":"IF(Form!AD73=\"\",\"\",Form!AD73)","v":""},{"$f":"IF(Form!AF73=\"\",\"\",Form!AF73)","v":""},{"$f":"IF(Form!AH73=\"\",\"\",Form!AH73)","v":""},{"$f":"IF(Form!AJ73=\"\",\"\",Form!AJ73)","v":""},{"$f":"IF(Form!AL73=\"\",\"\",Form!AL73)","v":""},"",null,null,null,null,null,null,null,null,null,null,null,null,null,null,null,null,null,null,null,{"$f":"SUM(Form!$X$55:$AM$55)","v":9930382},{"$f":"SUM(Form!$X$55:$AM$56)","v":9930382}]
[null,"A",null,null,{"$f":"IF(Form!G74=\"\",\"\",Form!G74)","v":0},{"$f":"IF(Form!O74=\"\",\"\",Form!O74)","v":0},null,null,{"$f":"IF(Form!X74=\"\",\"\",Form!X74)","v":""},{"$f":"IF(Form!Z74=\"\",\"\",Form!Z74)","v":0},{"$f":"IF(Form!AB74=\"\",\"\",Form!AB74)","v":""},{"$f":"IF(Form!AD74=\"\",\"\",Form!AD74)","v":""},{"$f":"IF(Form!AF74=\"\",\"\",Form!AF74)","v":""},{"$f":"IF(Form!AH74=\"\",\"\",Form!AH74)","v":""},{"$f":"IF(Form!AJ74=\"\",\"\",Form!AJ74)","v":""},{"$f":"IF(Form!AL74=\"\",\"\",Form!AL74)","v":""},"",null,null,null,null,null,null,null,null,null,null,null,null,null,null,null,null,null,null,null,{"$f":"SUM(Form!$X$55:$AM$55)","v":9930382},{"$f":"SUM(Form!$X$55:$AM$56)","v":9930382}]
[null,null,null,null,{"$f":"IF(Form!G75=\"\",\"\",Form!G75)","v":0},{"$f":"IF(Form!O75=\"\",\"\",Form!O75)","v":0},null,null,{"$f":"IF(Form!X75=\"\",\"\",Form!X75)","v":""},{"$f":"IF(Form!Z75=\"\",\"\",Form!Z75)","v":0},{"$f":"IF(Form!AB75=\"\",\"\",Form!AB75)","v":""},{"$f":"IF(Form!AD75=\"\",\"\",Form!AD75)","v":""},{"$f":"IF(Form!AF75=\"\",\"\",Form!AF75)","v":""},{"$f":"IF(Form!AH75=\"\",\"\",Form!AH75)","v":""},{"$f":"IF(Form!AJ75=\"\",\"\",Form!AJ75)","v":""},{"$f":"IF(Form!AL75=\"\",\"\",Form!AL75)","v":""},{"$f":"IF(SUM(J26:P26)=0,\"\",SUM(J26:P26))","v":""},null,null,null,null,null,null,null,null,null,null,null,null,null,null,null,null,null,null,null,{"$f":"SUM(Form!$X$55:$AM$55)","v":9930382},{"$f":"SUM(Form!$X$55:$AM$56)","v":9930382}]
[null,null,null,null,{"$f":"IF(Form!G76=\"\",\"\",Form!G76)","v":0},{"$f":"IF(Form!O76=\"\",\"\",Form!O76)","v":0},null,null,{"$f":"IF(Form!X76=\"\",\"\",Form!X76)","v":""},{"$f":"IF(Form!Z76=\"\",\"\",Form!Z76)","v":0},{"$f":"IF(Form!AB76=\"\",\"\",Form!AB76)","v":""},{"$f":"IF(Form!AD76=\"\",\"\",Form!AD76)","v":""},{"$f":"IF(Form!AF76=\"\",\"\",Form!AF76)","v":""},{"$f":"IF(Form!AH76=\"\",\"\",Form!AH76)","v":""},{"$f":"IF(Form!AJ76=\"\",\"\",Form!AJ76)","v":""},{"$f":"IF(Form!AL76=\"\",\"\",Form!AL76)","v":""},"",null,null,null,null,null,null,null,null,null,null,null,null,null,null,null,null,null,null,null,{"$f":"SUM(Form!$X$55:$AM$55)","v":9930382},{"$f":"SUM(Form!$X$55:$AM$56)","v":9930382}]
[null,null,null,null,{"$f":"IF(Form!G77=\"\",\"\",Form!G77)","v":0},{"$f":"IF(Form!O77=\"\",\"\",Form!O77)","v":0},null,null,{"$f":"IF(Form!X77=\"\",\"\",Form!X77)","v":""},{"$f":"IF(Form!Z77=\"\",\"\",Form!Z77)","v":0},{"$f":"IF(Form!AB77=\"\",\"\",Form!AB77)","v":""},{"$f":"IF(Form!AD77=\"\",\"\",Form!AD77)","v":""},{"$f":"IF(Form!AF77=\"\",\"\",Form!AF77)","v":""},{"$f":"IF(Form!AH77=\"\",\"\",Form!AH77)","v":""},{"$f":"IF(Form!AJ77=\"\",\"\",Form!AJ77)","v":""},{"$f":"IF(Form!AL77=\"\",\"\",Form!AL77)","v":""},"",null,null,null,null,null,null,null,null,null,null,null,null,null,null,null,null,null,null,null,{"$f":"SUM(Form!$X$55:$AM$55)","v":9930382},{"$f":"SUM(Form!$X$55:$AM$56)","v":9930382}]
[null,null,null,null,{"$f":"IF(Form!G78=\"\",\"\",Form!G78)","v":0},{"$f":"IF(Form!O78=\"\",\"\",Form!O78)","v":0},null,null,{"$f":"IF(Form!X78=\"\",\"\",Form!X78)","v":""},{"$f":"IF(Form!Z78=\"\",\"\",Form!Z78)","v":0},{"$f":"IF(Form!AB78=\"\",\"\",Form!AB78)","v":""},{"$f":"IF(Form!AD78=\"\",\"\",Form!AD78)","v":""},{"$f":"IF(Form!AF78=\"\",\"\",Form!AF78)","v":""},{"$f":"IF(Form!AH78=\"\",\"\",Form!AH78)","v":""},{"$f":"IF(Form!AJ78=\"\",\"\",Form!AJ78)","v":""},{"$f":"IF(Form!AL78=\"\",\"\",Form!AL78)","v":""},"",null,null,null,null,null,null,null,null,null,null,null,null,null,null,null,null,null,null,null,{"$f":"SUM(Form!$X$55:$AM$55)","v":9930382},{"$f":"SUM(Form!$X$55:$AM$56)","v":9930382}]
[null,null,null,null,{"$f":"IF(Form!G79=\"\",\"\",Form!G79)","v":0},{"$f":"IF(Form!O79=\"\",\"\",Form!O79)","v":0},null,null,{"$f":"IF(Form!X79=\"\",\"\",Form!X79)","v":""},{"$f":"IF(Form!Z79=\"\",\"\",Form!Z79)","v":0},{"$f":"IF(Form!AB79=\"\",\"\",Form!AB79)","v":""},{"$f":"IF(Form!AD79=\"\",\"\",Form!AD79)","v":""},{"$f":"IF(Form!AF79=\"\",\"\",Form!AF79)","v":""},{"$f":"IF(Form!AH79=\"\",\"\",Form!AH79)","v":""},{"$f":"IF(Form!AJ79=\"\",\"\",Form!AJ79)","v":""},{"$f":"IF(Form!AL79=\"\",\"\",Form!AL79)","v":""},"",null,null,null,null,null,null,null,null,null,null,null,null,null,null,null,null,null,null,null,{"$f":"SUM(Form!$X$55:$AM$55)","v":9930382},{"$f":"SUM(Form!$X$55:$AM$56)","v":9930382}]
[null,null,null,null,{"$f":"IF(Form!G80=\"\",\"\",Form!G80)","v":0},{"$f":"IF(Form!O80=\"\",\"\",Form!O80)","v":0},null,null,{"$f":"IF(Form!X80=\"\",\"\",Form!X80)","v":""},{"$f":"IF(Form!Z80=\"\",\"\",Form!Z80)","v":0},{"$f":"IF(Form!AB80=\"\",\"\",Form!AB80)","v":""},{"$f":"IF(Form!AD80=\"\",\"\",Form!AD80)","v":""},{"$f":"IF(Form!AF80=\"\",\"\",Form!AF80)","v":""},{"$f":"IF(Form!AH80=\"\",\"\",Form!AH80)","v":""},{"$f":"IF(Form!AJ80=\"\",\"\",Form!AJ80)","v":""},{"$f":"IF(Form!AL80=\"\",\"\",Form!AL80)","v":""},"",null,null,null,null,null,null,null,null,null,null,null,null,null,null,null,null,null,null,null,{"$f":"SUM(Form!$X$55:$AM$55)","v":9930382},{"$f":"SUM(Form!$X$55:$AM$56)","v":9930382}]
[null,null,null,null,{"$f":"IF(Form!G81=\"\",\"\",Form!G81)","v":0},{"$f":"IF(Form!O81=\"\",\"\",Form!O81)","v":0},null,null,{"$f":"IF(Form!X81=\"\",\"\",Form!X81)","v":""},{"$f":"IF(Form!Z81=\"\",\"\",Form!Z81)","v":0},{"$f":"IF(Form!AB81=\"\",\"\",Form!AB81)","v":""},{"$f":"IF(Form!AD81=\"\",\"\",Form!AD81)","v":""},{"$f":"IF(Form!AF81=\"\",\"\",Form!AF81)","v":""},{"$f":"IF(Form!AH81=\"\",\"\",Form!AH81)","v":""},{"$f":"IF(Form!AJ81=\"\",\"\",Form!AJ81)","v":""},{"$f":"IF(Form!AL81=\"\",\"\",Form!AL81)","v":""},"",null,null,null,null,null,null,null,null,null,null,null,null,null,null,null,null,null,null,null,{"$f":"SUM(Form!$X$55:$AM$55)","v":9930382},{"$f":"SUM(Form!$X$55:$AM$56)","v":9930382}]
[null,null,null,null,{"$f":"IF(Form!G82=\"\",\"\",Form!G82)","v":0},{"$f":"IF(Form!O82=\"\",\"\",Form!O82)","v":0},null,null,{"$f":"IF(Form!X82=\"\",\"\",Form!X82)","v":""},{"$f":"IF(Form!Z82=\"\",\"\",Form!Z82)","v":0},{"$f":"IF(Form!AB82=\"\",\"\",Form!AB82)","v":""},{"$f":"IF(Form!AD82=\"\",\"\",Form!AD82)","v":""},{"$f":"IF(Form!AF82=\"\",\"\",Form!AF82)","v":""},{"$f":"IF(Form!AH82=\"\",\"\",Form!AH82)","v":""},{"$f":"IF(Form!AJ82=\"\",\"\",Form!AJ82)","v":""},{"$f":"IF(Form!AL82=\"\",\"\",Form!AL82)","v":""},"",null,null,null,null,null,null,null,null,null,null,null,null,null,null,null,null,null,null,null,{"$f":"SUM(Form!$X$55:$AM$55)","v":9930382},{"$f":"SUM(Form!$X$55:$AM$56)","v":9930382}]
[null,null,null,null,{"$f":"IF(Form!G83=\"\",\"\",Form!G83)","v":0},{"$f":"IF(Form!O83=\"\",\"\",Form!O83)","v":0},null,null,{"$f":"IF(Form!X83=\"\",\"\",Form!X83)","v":""},{"$f":"IF(Form!Z83=\"\",\"\",Form!Z83)","v":0},{"$f":"IF(Form!AB83=\"\",\"\",Form!AB83)","v":""},{"$f":"IF(Form!AD83=\"\",\"\",Form!AD83)","v":""},{"$f":"IF(Form!AF83=\"\",\"\",Form!AF83)","v":""},{"$f":"IF(Form!AH83=\"\",\"\",Form!AH83)","v":""},{"$f":"IF(Form!AJ83=\"\",\"\",Form!AJ83)","v":""},{"$f":"IF(Form!AL83=\"\",\"\",Form!AL83)","v":""},"",null,null,null,null,null,null,null,null,null,null,null,null,null,null,null,null,null,null,null,{"$f":"SUM(Form!$X$55:$AM$55)","v":9930382},{"$f":"SUM(Form!$X$55:$AM$56)","v":9930382}]
[null,null,null,null,{"$f":"IF(Form!G84=\"\",\"\",Form!G84)","v":0},{"$f":"IF(Form!O84=\"\",\"\",Form!O84)","v":0},null,null,{"$f":"IF(Form!X84=\"\",\"\",Form!X84)","v":""},{"$f":"IF(Form!Z84=\"\",\"\",Form!Z84)","v":0},{"$f":"IF(Form!AB84=\"\",\"\",Form!AB84)","v":""},{"$f":"IF(Form!AD84=\"\",\"\",Form!AD84)","v":""},{"$f":"IF(Form!AF84=\"\",\"\",Form!AF84)","v":""},{"$f":"IF(Form!AH84=\"\",\"\",Form!AH84)","v":""},{"$f":"IF(Form!AJ84=\"\",\"\",Form!AJ84)","v":""},{"$f":"IF(Form!AL84=\"\",\"\",Form!AL84)","v":""},{"$f":"IF(SUM(J35:P35)=0,\"\",SUM(J35:P35))","v":""},null,null,null,null,null,null,null,null,null,null,null,null,null,null,null,null,null,null,null,{"$f":"SUM(Form!$X$55:$AM$55)","v":9930382},{"$f":"SUM(Form!$X$55:$AM$56)","v":9930382}]
[null,"A",null,null,{"$f":"IF(Form!G85=\"\",\"\",Form!G85)","v":0},{"$f":"IF(Form!O85=\"\",\"\",Form!O85)","v":0},null,null,{"$f":"IF(Form!X85=\"\",\"\",Form!X85)","v":""},{"$f":"IF(Form!Z85=\"\",\"\",Form!Z85)","v":0},{"$f":"IF(Form!AB85=\"\",\"\",Form!AB85)","v":""},{"$f":"IF(Form!AD85=\"\",\"\",Form!AD85)","v":""},{"$f":"IF(Form!AF85=\"\",\"\",Form!AF85)","v":""},{"$f":"IF(Form!AH85=\"\",\"\",Form!AH85)","v":""},{"$f":"IF(Form!AJ85=\"\",\"\",Form!AJ85)","v":""},{"$f":"IF(Form!AL85=\"\",\"\",Form!AL85)","v":""},"",null,null,null,null,null,null,null,null,null,null,null,null,null,null,null,null,null,null,null,{"$f":"SUM(Form!$X$55:$AM$55)","v":9930382},{"$f":"SUM(Form!$X$55:$AM$56)","v":9930382}]
[null,"A",{"$f":"Form!$Q$19","v":"THC040E/001A/007A"},{"$f":"Form!#REF!","v":{"$error":"#REF!"}},{"$f":"IF(Form!G86=\"\",\"\",Form!G86)","v":0},{"$f":"IF(Form!O86=\"\",\"\",Form!O86)","v":0},null,null,{"$f":"IF(Form!X86=\"\",\"\",Form!X86)","v":""},{"$f":"IF(Form!Z86=\"\",\"\",Form!Z86)","v":0},{"$f":"IF(Form!AB86=\"\",\"\",Form!AB86)","v":""},{"$f":"IF(Form!AD86=\"\",\"\",Form!AD86)","v":""},{"$f":"IF(Form!AF86=\"\",\"\",Form!AF86)","v":""},{"$f":"IF(Form!AH86=\"\",\"\",Form!AH86)","v":""},{"$f":"IF(Form!AJ86=\"\",\"\",Form!AJ86)","v":""},{"$f":"IF(Form!AL86=\"\",\"\",Form!AL86)","v":""},"",null,null,null,null,null,null,null,null,null,null,null,null,null,null,null,null,null,null,null,{"$f":"SUM(Form!$X$55:$AM$55)","v":9930382},{"$f":"SUM(Form!$X$55:$AM$56)","v":9930382}]
[null,"A",{"$f":"Form!$Q$19","v":"THC040E/001A/007A"},{"$f":"Form!#REF!","v":{"$error":"#REF!"}},{"$f":"IF(Form!G87=\"\",\"\",Form!G87)","v":0},{"$f":"IF(Form!O87=\"\",\"\",Form!O87)","v":0},null,null,{"$f":"IF(Form!X87=\"\",\"\",Form!X87)","v":""},{"$f":"IF(Form!Z87=\"\",\"\",Form!Z87)","v":0},{"$f":"IF(Form!AB87=\"\",\"\",Form!AB87)","v":""},{"$f":"IF(Form!AD87=\"\",\"\",Form!AD87)","v":""},{"$f":"IF(Form!AF87=\"\",\"\",Form!AF87)","v":""},{"$f":"IF(Form!AH87=\"\",\"\",Form!AH87)","v":""},{"$f":"IF(Form!AJ87=\"\",\"\",Form!AJ87)","v":""},{"$f":"IF(Form!AL87=\"\",\"\",Form!AL87)","v":""},"",null,null,null,null,null,null,null,null,null,null,null,null,null,null,null,null,null,null,null,{"$f":"SUM(Form!$X$55:$AM$55)","v":9930382},{"$f":"SUM(Form!$X$55:$AM$56)","v":9930382}]
[null,null,null,null,{"$f":"IF(Form!G88=\"\",\"\",Form!G88)","v":0},{"$f":"IF(Form!O88=\"\",\"\",Form!O88)","v":0},null,null,{"$f":"IF(Form!X88=\"\",\"\",Form!X88)","v":""},{"$f":"IF(Form!Z88=\"\",\"\",Form!Z88)","v":0},{"$f":"IF(Form!AB88=\"\",\"\",Form!AB88)","v":""},{"$f":"IF(Form!AD88=\"\",\"\",Form!AD88)","v":""},{"$f":"IF(Form!AF88=\"\",\"\",Form!AF88)","v":""},{"$f":"IF(Form!AH88=\"\",\"\",Form!AH88)","v":""},{"$f":"IF(Form!AJ88=\"\",\"\",Form!AJ88)","v":""},{"$f":"IF(Form!AL88=\"\",\"\",Form!AL88)","v":""},"",null,null,null,null,null,null,null,null,null,null,null,null,null,null,null,null,null,null,null,{"$f":"SUM(Form!$X$55:$AM$55)","v":9930382},{"$f":"SUM(Form!$X$55:$AM$56)","v":9930382}]
[null,null,null,null,{"$f":"IF(Form!G89=\"\",\"\",Form!G89)","v":""},{"$f":"IF(Form!O89=\"\",\"\",Form!O89)","v":""},null,null,{"$f":"IF(Form!X89=\"\",\"\",Form!X89)","v":""},{"$f":"IF(Form!Z89=\"\",\"\",Form!Z89)","v":""},{"$f":"IF(Form!AB89=\"\",\"\",Form!AB89)","v":""},{"$f":"IF(Form!AD89=\"\",\"\",Form!AD89)","v":""},{"$f":"IF(Form!AF89=\"\",\"\",Form!AF89)","v":""},{"$f":"IF(Form!AH89=\"\",\"\",Form!AH89)","v":""},{"$f":"IF(Form!AJ89=\"\",\"\",Form!AJ89)","v":""},{"$f":"IF(Form!AL89=\"\",\"\",Form!AL89)","v":""},"",null,null,null,null,null,null,null,null,null,null,null,null,null,null,null,null,null,null,null,{"$f":"SUM(Form!$X$55:$AM$55)","v":9930382},{"$f":"SUM(Form!$X$55:$AM$56)","v":9930382}]
[null,null,null,null,{"$f":"IF(Form!G90=\"\",\"\",Form!G90)","v":""},{"$f":"IF(Form!O90=\"\",\"\",Form!O90)","v":""},null,null,{"$f":"IF(Form!X90=\"\",\"\",Form!X90)","v":""},{"$f":"IF(Form!Z90=\"\",\"\",Form!Z90)","v":""},{"$f":"IF(Form!AB90=\"\",\"\",Form!AB90)","v":""},{"$f":"IF(Form!AD90=\"\",\"\",Form!AD90)","v":""},{"$f":"IF(Form!AF90=\"\",\"\",Form!AF90)","v":""},{"$f":"IF(Form!AH90=\"\",\"\",Form!AH90)","v":""},{"$f":"IF(Form!AJ90=\"\",\"\",Form!AJ90)","v":""},{"$f":"IF(Form!AL90=\"\",\"\",Form!AL90)","v":""},"",null,null,null,null,null,null,null,null,null,null,null,null,null,null,null,null,null,null,null,{"$f":"SUM(Form!$X$55:$AM$55)","v":9930382},{"$f":"SUM(Form!$X$55:$AM$56)","v":9930382}]
[null,null,null,null,{"$f":"IF(Form!G91=\"\",\"\",Form!G91)","v":""},{"$f":"IF(Form!O91=\"\",\"\",Form!O91)","v":""},null,null,{"$f":"IF(Form!X91=\"\",\"\",Form!X91)","v":""},{"$f":"IF(Form!Z91=\"\",\"\",Form!Z91)","v":""},{"$f":"IF(Form!AB91=\"\",\"\",Form!AB91)","v":""},{"$f":"IF(Form!AD91=\"\",\"\",Form!AD91)","v":""},{"$f":"IF(Form!AF91=\"\",\"\",Form!AF91)","v":""},{"$f":"IF(Form!AH91=\"\",\"\",Form!AH91)","v":""},{"$f":"IF(Form!AJ91=\"\",\"\",Form!AJ91)","v":""},{"$f":"IF(Form!AL91=\"\",\"\",Form!AL91)","v":""},"",null,null,null,null,null,null,null,null,null,null,null,null,null,null,null,null,null,null,null,{"$f":"SUM(Form!$X$55:$AM$55)","v":9930382},{"$f":"SUM(Form!$X$55:$AM$56)","v":9930382}]
[null,null,null,null,{"$f":"IF(Form!G92=\"\",\"\",Form!G92)","v":""},{"$f":"IF(Form!O92=\"\",\"\",Form!O92)","v":""},null,null,{"$f":"IF(Form!X92=\"\",\"\",Form!X92)","v":""},{"$f":"IF(Form!Z92=\"\",\"\",Form!Z92)","v":""},{"$f":"IF(Form!AB92=\"\",\"\",Form!AB92)","v":""},{"$f":"IF(Form!AD92=\"\",\"\",Form!AD92)","v":""},{"$f":"IF(Form!AF92=\"\",\"\",Form!AF92)","v":""},{"$f":"IF(Form!AH92=\"\",\"\",Form!AH92)","v":""},{"$f":"IF(Form!AJ92=\"\",\"\",Form!AJ92)","v":""},{"$f":"IF(Form!AL92=\"\",\"\",Form!AL92)","v":""},"",null,null,null,null,null,null,null,null,null,null,null,null,null,null,null,null,null,null,null,{"$f":"SUM(Form!$X$55:$AM$55)","v":9930382},{"$f":"SUM(Form!$X$55:$AM$56)","v":9930382}]
[null,null,null,null,{"$f":"IF(Form!G93=\"\",\"\",Form!G93)","v":""},{"$f":"IF(Form!O93=\"\",\"\",Form!O93)","v":""},null,null,{"$f":"IF(Form!X93=\"\",\"\",Form!X93)","v":""},{"$f":"IF(Form!Z93=\"\",\"\",Form!Z93)","v":""},{"$f":"IF(Form!AB93=\"\",\"\",Form!AB93)","v":""},{"$f":"IF(Form!AD93=\"\",\"\",Form!AD93)","v":""},{"$f":"IF(Form!AF93=\"\",\"\",Form!AF93)","v":""},{"$f":"IF(Form!AH93=\"\",\"\",Form!AH93)","v":""},{"$f":"IF(Form!AJ93=\"\",\"\",Form!AJ93)","v":""},{"$f":"IF(Form!AL93=\"\",\"\",Form!AL93)","v":""},"",null,null,null,null,null,null,null,null,null,null,null,null,null,null,null,null,null,null,null,{"$f":"SUM(Form!$X$55:$AM$55)","v":9930382},{"$f":"SUM(Form!$X$55:$AM$56)","v":9930382}]
[null,null,null,null,{"$f":"IF(Form!G94=\"\",\"\",Form!G94)","v":""},{"$f":"IF(Form!O94=\"\",\"\",Form!O94)","v":""},null,null,{"$f":"IF(Form!X94=\"\",\"\",Form!X94)","v":""},{"$f":"IF(Form!Z94=\"\",\"\",Form!Z94)","v":""},{"$f":"IF(Form!AB94=\"\",\"\",Form!AB94)","v":""},{"$f":"IF(Form!AD94=\"\",\"\",Form!AD94)","v":""},{"$f":"IF(Form!AF94=\"\",\"\",Form!AF94)","v":""},{"$f":"IF(Form!AH94=\"\",\"\",Form!AH94)","v":""},{"$f":"IF(Form!AJ94=\"\",\"\",Form!AJ94)","v":""},{"$f":"IF(Form!AL94=\"\",\"\",Form!AL94)","v":""},"",null,null,null,null,null,null,null,null,null,null,null,null,null,null,null,null,null,null,null,{"$f":"SUM(Form!$X$55:$AM$55)","v":9930382},{"$f":"SUM(Form!$X$55:$AM$56)","v":9930382}]
[null,null,null,null,{"$f":"IF(Form!G95=\"\",\"\",Form!G95)","v":""},{"$f":"IF(Form!O95=\"\",\"\",Form!O95)","v":""},null,null,{"$f":"IF(Form!X95=\"\",\"\",Form!X95)","v":""},{"$f":"IF(Form!Z95=\"\",\"\",Form!Z95)","v":""},{"$f":"IF(Form!AB95=\"\",\"\",Form!AB95)","v":""},{"$f":"IF(Form!AD95=\"\",\"\",Form!AD95)","v":""},{"$f":"IF(Form!AF95=\"\",\"\",Form!AF95)","v":""},{"$f":"IF(Form!AH95=\"\",\"\",Form!AH95)","v":""},{"$f":"IF(Form!AJ95=\"\",\"\",Form!AJ95)","v":""},{"$f":"IF(Form!AL95=\"\",\"\",Form!AL95)","v":""},"",null,null,null,null,null,null,null,null,null,null,null,null,null,null,null,null,null,null,null,{"$f":"SUM(Form!$X$55:$AM$55)","v":9930382},{"$f":"SUM(Form!$X$55:$AM$56)","v":9930382}]
[null,null,null,null,{"$f":"IF(Form!G96=\"\",\"\",Form!G96)","v":""},{"$f":"IF(Form!O96=\"\",\"\",Form!O96)","v":""},null,null,{"$f":"IF(Form!X96=\"\",\"\",Form!X96)","v":""},{"$f":"IF(Form!Z96=\"\",\"\",Form!Z96)","v":""},{"$f":"IF(Form!AB96=\"\",\"\",Form!AB96)","v":""},{"$f":"IF(Form!AD96=\"\",\"\",Form!AD96)","v":""},{"$f":"IF(Form!AF96=\"\",\"\",Form!AF96)","v":""},{"$f":"IF(Form!AH96=\"\",\"\",Form!AH96)","v":""},{"$f":"IF(Form!AJ96=\"\",\"\",Form!AJ96)","v":""},{"$f":"IF(Form!AL96=\"\",\"\",Form!AL96)","v":""},"",null,null,null,null,null,null,null,null,null,null,null,null,null,null,null,null,null,null,null,{"$f":"SUM(Form!$X$55:$AM$55)","v":9930382},{"$f":"SUM(Form!$X$55:$AM$56)","v":9930382}]
[null,null,null,null,{"$f":"IF(Form!G97=\"\",\"\",Form!G97)","v":""},{"$f":"IF(Form!O97=\"\",\"\",Form!O97)","v":""},null,null,{"$f":"IF(Form!X97=\"\",\"\",Form!X97)","v":""},{"$f":"IF(Form!Z97=\"\",\"\",Form!Z97)","v":""},{"$f":"IF(Form!AB97=\"\",\"\",Form!AB97)","v":""},{"$f":"IF(Form!AD97=\"\",\"\",Form!AD97)","v":""},{"$f":"IF(Form!AF97=\"\",\"\",Form!AF97)","v":""},{"$f":"IF(Form!AH97=\"\",\"\",Form!AH97)","v":""},{"$f":"IF(Form!AJ97=\"\",\"\",Form!AJ97)","v":""},{"$f":"IF(Form!AL97=\"\",\"\",Form!AL97)","v":""},"",null,null,null,null,null,null,null,null,null,null,null,null,null,null,null,null,null,null,null,{"$f":"SUM(Form!$X$55:$AM$55)","v":9930382},{"$f":"SUM(Form!$X$55:$AM$56)","v":9930382}]
[null,null,null,null,{"$f":"IF(Form!G98=\"\",\"\",Form!G98)","v":""},{"$f":"IF(Form!O98=\"\",\"\",Form!O98)","v":""},null,null,{"$f":"IF(Form!X98=\"\",\"\",Form!X98)","v":""},{"$f":"IF(Form!Z98=\"\",\"\",Form!Z98)","v":""},{"$f":"IF(Form!AB98=\"\",\"\",Form!AB98)","v":""},{"$f":"IF(Form!AD98=\"\",\"\",Form!AD98)","v":""},{"$f":"IF(Form!AF98=\"\",\"\",Form!AF98)","v":""},{"$f":"IF(Form!AH98=\"\",\"\",Form!AH98)","v":""},{"$f":"IF(Form!AJ98=\"\",\"\",Form!AJ98)","v":""},{"$f":"IF(Form!AL98=\"\",\"\",Form!AL98)","v":""},"",null,null,null,null,null,null,null,null,null,null,null,null,null,null,null,null,null,null,null,{"$f":"SUM(Form!$X$55:$AM$55)","v":9930382},{"$f":"SUM(Form!$X$55:$AM$56)","v":9930382}]
[null,null,null,null,{"$f":"IF(Form!G99=\"\",\"\",Form!G99)","v":""},{"$f":"IF(Form!O99=\"\",\"\",Form!O99)","v":""},null,null,{"$f":"IF(Form!X99=\"\",\"\",Form!X99)","v":""},{"$f":"IF(Form!Z99=\"\",\"\",Form!Z99)","v":""},{"$f":"IF(Form!AB99=\"\",\"\",Form!AB99)","v":""},{"$f":"IF(Form!AD99=\"\",\"\",Form!AD99)","v":""},{"$f":"IF(Form!AF99=\"\",\"\",Form!AF99)","v":""},{"$f":"IF(Form!AH99=\"\",\"\",Form!AH99)","v":""},{"$f":"IF(Form!AJ99=\"\",\"\",Form!AJ99)","v":""},{"$f":"IF(Form!AL99=\"\",\"\",Form!AL99)","v":""},"",null,null,null,null,null,null,null,null,null,null,null,null,null,null,null,null,null,null,null,{"$f":"SUM(Form!$X$55:$AM$55)","v":9930382},{"$f":"SUM(Form!$X$55:$AM$56)","v":9930382}]
[null,null,null,null,{"$f":"IF(Form!G100=\"\",\"\",Form!G100)","v":""},{"$f":"IF(Form!O100=\"\",\"\",Form!O100)","v":""},null,null,{"$f":"IF(Form!X100=\"\",\"\",Form!X100)","v":""},{"$f":"IF(Form!Z100=\"\",\"\",Form!Z100)","v":""},{"$f":"IF(Form!AB100=\"\",\"\",Form!AB100)","v":""},{"$f":"IF(Form!AD100=\"\",\"\",Form!AD100)","v":""},{"$f":"IF(Form!AF100=\"\",\"\",Form!AF100)","v":""},{"$f":"IF(Form!AH100=\"\",\"\",Form!AH100)","v":""},{"$f":"IF(Form!AJ100=\"\",\"\",Form!AJ100)","v":""},{"$f":"IF(Form!AL100=\"\",\"\",Form!AL100)","v":""},"",null,null,null,null,null,null,null,null,null,null,null,null,null,null,null,null,null,null,null,{"$f":"SUM(Form!$X$55:$AM$55)","v":9930382},{"$f":"SUM(Form!$X$55:$AM$56)","v":9930382}]
[null,null,null,null,{"$f":"IF(Form!G101=\"\",\"\",Form!G101)","v":""},{"$f":"IF(Form!O101=\"\",\"\",Form!O101)","v":""},null,null,{"$f":"IF(Form!X101=\"\",\"\",Form!X101)","v":""},{"$f":"IF(Form!Z101=\"\",\"\",Form!Z101)","v":""},{"$f":"IF(Form!AB101=\"\",\"\",Form!AB101)","v":""},{"$f":"IF(Form!AD101=\"\",\"\",Form!AD101)","v":""},{"$f":"IF(Form!AF101=\"\",\"\",Form!AF101)","v":""},{"$f":"IF(Form!AH101=\"\",\"\",Form!AH101)","v":""},{"$f":"IF(Form!AJ101=\"\",\"\",Form!AJ101)","v":""},{"$f":"IF(Form!AL101=\"\",\"\",Form!AL101)","v":""},"",null,null,null,null,null,null,null,null,null,null,null,null,null,null,null,null,null,null,null,{"$f":"SUM(Form!$X$55:$AM$55)","v":9930382},{"$f":"SUM(Form!$X$55:$AM$56)","v":9930382}]
[null,null,null,null,{"$f":"IF(Form!G102=\"\",\"\",Form!G102)","v":""},{"$f":"IF(Form!O102=\"\",\"\",Form!O102)","v":""},null,null,{"$f":"IF(Form!X102=\"\",\"\",Form!X102)","v":""},{"$f":"IF(Form!Z102=\"\",\"\",Form!Z102)","v":""},{"$f":"IF(Form!AB102=\"\",\"\",Form!AB102)","v":""},{"$f":"IF(Form!AD102=\"\",\"\",Form!AD102)","v":""},{"$f":"IF(Form!AF102=\"\",\"\",Form!AF102)","v":""},{"$f":"IF(Form!AH102=\"\",\"\",Form!AH102)","v":""},{"$f":"IF(Form!AJ102=\"\",\"\",Form!AJ102)","v":""},{"$f":"IF(Form!AL102=\"\",\"\",Form!AL102)","v":""},"",null,null,null,null,null,null,null,null,null,null,null,null,null,null,null,null,null,null,null,{"$f":"SUM(Form!$X$55:$AM$55)","v":9930382},{"$f":"SUM(Form!$X$55:$AM$56)","v":9930382}]
[null,null,null,null,{"$f":"IF(Form!G103=\"\",\"\",Form!G103)","v":""},{"$f":"IF(Form!O103=\"\",\"\",Form!O103)","v":""},null,null,{"$f":"IF(Form!X103=\"\",\"\",Form!X103)","v":""},{"$f":"IF(Form!Z103=\"\",\"\",Form!Z103)","v":""},{"$f":"IF(Form!AB103=\"\",\"\",Form!AB103)","v":""},{"$f":"IF(Form!AD103=\"\",\"\",Form!AD103)","v":""},{"$f":"IF(Form!AF103=\"\",\"\",Form!AF103)","v":""},{"$f":"IF(Form!AH103=\"\",\"\",Form!AH103)","v":""},{"$f":"IF(Form!AJ103=\"\",\"\",Form!AJ103)","v":""},{"$f":"IF(Form!AL103=\"\",\"\",Form!AL103)","v":""},"",null,null,null,null,null,null,null,null,null,null,null,null,null,null,null,null,null,null,null,{"$f":"SUM(Form!$X$55:$AM$55)","v":9930382},{"$f":"SUM(Form!$X$55:$AM$56)","v":9930382}]
[null,null,null,null,{"$f":"IF(Form!G104=\"\",\"\",Form!G104)","v":""},{"$f":"IF(Form!O104=\"\",\"\",Form!O104)","v":""},null,null,{"$f":"IF(Form!X104=\"\",\"\",Form!X104)","v":""},{"$f":"IF(Form!Z104=\"\",\"\",Form!Z104)","v":""},{"$f":"IF(Form!AB104=\"\",\"\",Form!AB104)","v":""},{"$f":"IF(Form!AD104=\"\",\"\",Form!AD104)","v":""},{"$f":"IF(Form!AF104=\"\",\"\",Form!AF104)","v":""},{"$f":"IF(Form!AH104=\"\",\"\",Form!AH104)","v":""},{"$f":"IF(Form!AJ104=\"\",\"\",Form!AJ104)","v":""},{"$f":"IF(Form!AL104=\"\",\"\",Form!AL104)","v":""},"",null,null,null,null,null,null,null,null,null,null,null,null,null,null,null,null,null,null,null,{"$f":"SUM(Form!$X$55:$AM$55)","v":9930382},{"$f":"SUM(Form!$X$55:$AM$56)","v":9930382}]
[null,null,null,null,{"$f":"IF(Form!G105=\"\",\"\",Form!G105)","v":""},{"$f":"IF(Form!O105=\"\",\"\",Form!O105)","v":""},null,null,{"$f":"IF(Form!X105=\"\",\"\",Form!X105)","v":""},{"$f":"IF(Form!Z105=\"\",\"\",Form!Z105)","v":""},{"$f":"IF(Form!AB105=\"\",\"\",Form!AB105)","v":""},{"$f":"IF(Form!AD105=\"\",\"\",Form!AD105)","v":""},{"$f":"IF(Form!AF105=\"\",\"\",Form!AF105)","v":""},{"$f":"IF(Form!AH105=\"\",\"\",Form!AH105)","v":""},{"$f":"IF(Form!AJ105=\"\",\"\",Form!AJ105)","v":""},{"$f":"IF(Form!AL105=\"\",\"\",Form!AL105)","v":""},"",null,null,null,null,null,null,null,null,null,null,null,null,null,null,null,null,null,null,null,{"$f":"SUM(Form!$X$55:$AM$55)","v":9930382},{"$f":"SUM(Form!$X$55:$AM$56)","v":9930382}]
[null,null,null,null,{"$f":"IF(Form!G106=\"\",\"\",Form!G106)","v":""},{"$f":"IF(Form!O106=\"\",\"\",Form!O106)","v":""},null,null,{"$f":"IF(Form!X106=\"\",\"\",Form!X106)","v":""},{"$f":"IF(Form!Z106=\"\",\"\",Form!Z106)","v":""},{"$f":"IF(Form!AB106=\"\",\"\",Form!AB106)","v":""},{"$f":"IF(Form!AD106=\"\",\"\",Form!AD106)","v":""},{"$f":"IF(Form!AF106=\"\",\"\",Form!AF106)","v":""},{"$f":"IF(Form!AH106=\"\",\"\",Form!AH106)","v":""},{"$f":"IF(Form!AJ106=\"\",\"\",Form!AJ106)","v":""},{"$f":"IF(Form!AL106=\"\",\"\",Form!AL106)","v":""},"",null,null,null,null,null,null,null,null,null,null,null,null,null,null,null,null,null,null,null,{"$f":"SUM(Form!$X$55:$AM$55)","v":9930382},{"$f":"SUM(Form!$X$55:$AM$56)","v":9930382}]
[null,null,null,null,{"$f":"IF(Form!G107=\"\",\"\",Form!G107)","v":""},{"$f":"IF(Form!O107=\"\",\"\",Form!O107)","v":""},null,null,{"$f":"IF(Form!X107=\"\",\"\",Form!X107)","v":""},{"$f":"IF(Form!Z107=\"\",\"\",Form!Z107)","v":""},{"$f":"IF(Form!AB107=\"\",\"\",Form!AB107)","v":""},{"$f":"IF(Form!AD107=\"\",\"\",Form!AD107)","v":""},{"$f":"IF(Form!AF107=\"\",\"\",Form!AF107)","v":""},{"$f":"IF(Form!AH107=\"\",\"\",Form!AH107)","v":""},{"$f":"IF(Form!AJ107=\"\",\"\",Form!AJ107)","v":""},{"$f":"IF(Form!AL107=\"\",\"\",Form!AL107)","v":""},"",null,null,null,null,null,null,null,null,null,null,null,null,null,null,null,null,null,null,null,{"$f":"SUM(Form!$X$55:$AM$55)","v":9930382},{"$f":"SUM(Form!$X$55:$AM$56)","v":9930382}]
[null,"A",{"$f":"Form!$Q$19","v":"THC040E/001A/007A"},{"$f":"Form!#REF!","v":{"$error":"#REF!"}},{"$f":"IF(Form!G108=\"\",\"\",Form!G108)","v":""},{"$f":"IF(Form!O108=\"\",\"\",Form!O108)","v":""},null,null,{"$f":"IF(Form!X108=\"\",\"\",Form!X108)","v":""},{"$f":"IF(Form!Z108=\"\",\"\",Form!Z108)","v":""},{"$f":"IF(Form!AB108=\"\",\"\",Form!AB108)","v":""},{"$f":"IF(Form!AD108=\"\",\"\",Form!AD108)","v":""},{"$f":"IF(Form!AF108=\"\",\"\",Form!AF108)","v":""},{"$f":"IF(Form!AH108=\"\",\"\",Form!AH108)","v":""},{"$f":"IF(Form!AJ108=\"\",\"\",Form!AJ108)","v":""},{"$f":"IF(Form!AL108=\"\",\"\",Form!AL108)","v":""},"",null,null,null,null,null,null,null,null,null,null,null,null,null,null,null,null,null,null,null,{"$f":"SUM(Form!$X$55:$AM$55)","v":9930382},{"$f":"SUM(Form!$X$55:$AM$56)","v":9930382}]
[null,null,null,null,null,null,null,null,{"$f":"IF(I10=\"\",\"\",SUM(I10:I59))","v":0},{"$f":"IF(J10=\"\",\"\",SUM(J10:J59))","v":0},{"$f":"IF(K10=\"\",\"\",SUM(K10:K59))","v":""},8189000,"","","","",{"$f":"IF(Q10=\"\",\"\",SUM(Q10:Q59))","v":8189000},null,null,{"$f":"IF(T10=\"\",\"\",SUM(T10:T59))","v":8071000},null,null,{"$f":"IF(W10=\"\",\"\",SUM(W10:W59))","v":8070000},null,null,{"$f":"IF(Z10=\"\",\"\",SUM(Z10:Z59))","v":""}]
[]
[]
[]
[]
[]
[]
[]
[]
[]
[]
[]
[]
[]
[]
[]
[]
[]
[]
[]
[]
[]
[]
[]
[]
[]
[]
[]
[]
[]
[]
[]
[]
[]
[]
[]
[]
[]
[]
[]
[]
[]
[]
[]
[]
[]
[]
[]
[]
[]
[]
[]
[]
[]
[]
[]
[]
[]
[]
[]
[]
[]
[]
[]
[]
[]
[]
[]
[]
[]
[]
[]
[]
[]
[]
[]
[]
[]
[]
[]
[]
[]
[]
[]
[]
[]
[]
[]
[]
[]
[]
[]
[]
[]
[]
[]
[]
[]
[]
[]
[]
[]
[]
[]
[]
[]
[]
[]
[]
[]
[]
[]
[]
[]
[]
[]
[]
[]
[null,null,null,null,"Public"]
[null,null,null,null,"Private"]
[null,null,null,null,"Local Levy"]
[null,null,null,null,"Other"]

{"sheet":"ContDataSheet","index":3,"n_rows":21,"n_cols":47,"rows_kept":21,"cut":false,"hidden":true,"merged":[]}
["RowNumber","Filename","AmendDate","CompletedBy","ProjectManager","ProjectExecutive","ProjectName","NationalProjectNumber","1B1SNumber","AIMSNFCDDNumber","RiskMgmtAuthority","Area","RFCC","DeliveryTeam","FundingSource","ContributionType","LegalStatus","PaymentTerms","PaymentDate","Otherdetails","ContactName","OrganisationAddress","Phone","Pre_14/15_Funding","14/15_Funding","15/16_Funding","16/17_Funding","17/18_Funding","18/19_Funding","19/20_Funding","20/21_Funding","Post_20/21_Funding","Total_Funding","Pre_14/15_Expenditure","14/15_Expenditure","15/16_Q1_Expenditure","15/16_Q2_Expenditure","15/16_Q3_Expenditure","15/16_Q4_Expenditure","15/16_Expenditure","16/17_Expenditure","17/18_Expenditure","18/19_Expenditure","19/20_Expenditure","20/21_Expenditure","Post_20/21_Expenditure","Total_Expenditure"]
[1,{"$f":"CELL(\"filename\")","v":"\\\\prodds\\shared\\SE\\Southeast\\WT_FCRM\\Environment Management\\New Projects\\Oxford\\x--06 Quality\\6.15 Efficency\\[CERT Oxford FAS 16107.xlsm]Form"},{"$f":"Form!$C$11","v":42650},{"$f":"Form!$K$11","v":"Heather Taylor (EA PM)"},{"$f":"Form!$C$15","v":"Note: ppmt will pre-populate"},{"$f":"Form!$N$15","v":"Note: ppmt will pre-populate"},{"$f":"Form!$C$19","v":"Oxford Flood Alleviation Scheme"},{"$f":"Form!$Q$19","v":"THC040E/001A/007A"},{"$f":"Form!$Y$19","v":"Note: ppmt will pre-populate"},{"$f":"$AE$19","v":0},"Environment Agency",{"$f":"Form!$N$22","v":"West Thames"},{"$f":"Form!$C$22","v":"Thames"},{"$f":"Form!$Y$22","v":"NCPMS"},{"$f":"Form!C30","v":0},{"$f":"Form!G30","v":0},{"$f":"Form!K30","v":0},{"$f":"'Data Entry (contributions)'!F10","v":0},{"$f":"'Data Entry (contributions)'!G10","v":0},{"$f":"'Data Entry (contributions)'!H10","v":0},{"$f":"'Data Entry (contributions)'!J10","v":0},{"$f":"'Data Entry (contributions)'!K10","v":0},{"$f":"'Data Entry (contributions)'!L10","v":0},{"$f":"Form!R30","v":0},{"$f":"Form!T30","v":0},{"$f":"Form!V30","v":0},{"$f":"Form!X30","v":0},{"$f":"Form!Z30","v":0},{"$f":"Form!AB30","v":0},{"$f":"Form!AD30","v":0},{"$f":"Form!AF30","v":0},{"$f":"Form!AH30","v":0},{"$f":"Form!AK30","v":""},{"$f":"'Data Entry (contributions)'!P10","v":""},{"$f":"'Data Entry (contributions)'!Q10","v":""},{"$f":"'Data Entry (contributions)'!T10","v":""},{"$f":"'Data Entry (contributions)'!U10","v":""},{"$f":"'Data Entry (contributions)'!V10","v":""},{"$f":"'Data Entry (contributions)'!W10","v":""},{"$f":"'Data Entry (contributions)'!X10","v":""},{"$f":"'Data Entry (contributions)'!AE10","v":""},{"$f":"'Data Entry (contributions)'!AF10","v":""},{"$f":"'Data Entry (contributions)'!AG10","v":""},{"$f":"'Data Entry (contributions)'!AH10","v":""},{"$f":"'Data Entry (contributions)'!AI10","v":""},{"$f":"'Data Entry (contributions)'!AL10","v":""},{"$f":"'Data Entry (contributions)'!AN10","v":""}]
[2,{"$f":"CELL(\"filename\")","v":"\\\\prodds\\shared\\SE\\Southeast\\WT_FCRM\\Environment Management\\New Projects\\Oxford\\x--06 Quality\\6.15 Efficency\\[CERT Oxford FAS 16107.xlsm]Form"},{"$f":"Form!$C$11","v":42650},{"$f":"Form!$K$11","v":"Heather Taylor (EA PM)"},{"$f":"Form!$C$15","v":"Note: ppmt will pre-populate"},{"$f":"Form!$N$15","v":"Note: ppmt will pre-populate"},{"$f":"Form!$C$19","v":"Oxford Flood Alleviation Scheme"},{"$f":"Form!$Q$19","v":"THC040E/001A/007A"},{"$f":"Form!$Y$19","v":"Note: ppmt will pre-populate"},0,"Environment Agency",{"$f":"Form!$N$22","v":"West Thames"},{"$f":"Form!$C$22","v":"Thames"},{"$f":"Form!$Y$22","v":"NCPMS"},{"$f":"Form!C31","v":0},{"$f":"Form!G31","v":0},{"$f":"Form!K31","v":0},{"$f":"'Data Entry (contributions)'!F11","v":0},{"$f":"'Data Entry (contributions)'!G11","v":0},{"$f":"'Data Entry (contributions)'!H11","v":0},{"$f":"'Data Entry (contributions)'!J11","v":0},{"$f":"'Data Entry (contributions)'!K11","v":0},{"$f":"'Data Entry (contributions)'!L11","v":0},{"$f":"Form!R31","v":0},{"$f":"Form!T31","v":0},{"$f":"Form!V31","v":0},{"$f":"Form!X31","v":0},{"$f":"Form!Z31","v":0},{"$f":"Form!AB31","v":0},{"$f":"Form!AD31","v":0},{"$f":"Form!AF31","v":0},{"$f":"Form!AH31","v":0},{"$f":"Form!AK31","v":""},{"$f":"'Data Entry (contributions)'!P11","v":""},{"$f":"'Data Entry (contributions)'!Q11","v":""},{"$f":"'Data Entry (contributions)'!T11","v":""},{"$f":"'Data Entry (contributions)'!U11","v":""},{"$f":"'Data Entry (contributions)'!V11","v":""},{"$f":"'Data Entry (contributions)'!W11","v":""},{"$f":"'Data Entry (contributions)'!X11","v":""},{"$f":"'Data Entry (contributions)'!AE11","v":""},{"$f":"'Data Entry (contributions)'!AF11","v":""},{"$f":"'Data Entry (contributions)'!AG11","v":""},{"$f":"'Data Entry (contributions)'!AH11","v":""},{"$f":"'Data Entry (contributions)'!AI11","v":""},{"$f":"'Data Entry (contributions)'!AL11","v":""},{"$f":"'Data Entry (contributions)'!AN11","v":""}]
[3,"\\\\prodds\\shared\\SE\\Southeast\\WT_FCRM\\Environment Management\\New Projects\\Oxford\\x--06 Quality\\6.15 Efficency\\[CERT Oxford FAS 16107.xlsm]Form",{"$f":"Form!$C$11","v":42650},{"$f":"Form!$K$11","v":"Heather Taylor (EA PM)"},{"$f":"Form!$C$15","v":"Note: ppmt will pre-populate"},{"$f":"Form!$N$15","v":"Note: ppmt will pre-populate"},{"$f":"Form!$C$19","v":"Oxford Flood Alleviation Scheme"},{"$f":"Form!$Q$19","v":"THC040E/001A/007A"},{"$f":"Form!$Y$19","v":"Note: ppmt will pre-populate"},0,"Environment Agency",{"$f":"Form!$N$22","v":"West Thames"},{"$f":"Form!$C$22","v":"Thames"},{"$f":"Form!$Y$22","v":"NCPMS"},{"$f":"Form!C32","v":0},{"$f":"Form!G32","v":0},{"$f":"Form!K32","v":0},{"$f":"'Data Entry (contributions)'!F12","v":0},{"$f":"'Data Entry (contributions)'!G12","v":0},{"$f":"'Data Entry (contributions)'!H12","v":0},{"$f":"'Data Entry (contributions)'!J12","v":0},{"$f":"'Data Entry (contributions)'!K12","v":0},{"$f":"'Data Entry (contributions)'!L12","v":0},{"$f":"Form!R32","v":0},{"$f":"Form!T32","v":0},{"$f":"Form!V32","v":0},{"$f":"Form!X32","v":0},{"$f":"Form!Z32","v":0},{"$f":"Form!AB32","v":0},{"$f":"Form!AD32","v":0},{"$f":"Form!AF32","v":0},{"$f":"Form!AH32","v":0},{"$f":"Form!AK32","v":""},{"$f":"'Data Entry (contributions)'!P12","v":""},{"$f":"'Data Entry (contributions)'!Q12","v":""},{"$f":"'Data Entry (contributions)'!T12","v":""},{"$f":"'Data Entry (contributions)'!U12","v":""},{"$f":"'Data Entry (contributions)'!V12","v":""},{"$f":"'Data Entry (contributions)'!W12","v":""},{"$f":"'Data Entry (contributions)'!X12","v":""},{"$f":"'Data Entry (contributions)'!AE12","v":""},{"$f":"'Data Entry (contributions)'!AF12","v":""},{"$f":"'Data Entry (contributions)'!AG12","v":""},{"$f":"'Data Entry (contributions)'!AH12","v":""},{"$f":"'Data Entry (contributions)'!AI12","v":""},{"$f":"'Data Entry (contributions)'!AL12","v":""},{"$f":"'Data Entry (contributions)'!AN12","v":""}]
[4,"\\\\prodds\\shared\\SE\\Southeast\\WT_FCRM\\Environment Management\\New Projects\\Oxford\\x--06 Quality\\6.15 Efficency\\[CERT Oxford FAS 16107.xlsm]Form",{"$f":"Form!$C$11","v":42650},{"$f":"Form!$K$11","v":"Heather Taylor (EA PM)"},{"$f":"Form!$C$15","v":"Note: ppmt will pre-populate"},{"$f":"Form!$N$15","v":"Note: ppmt will pre-populate"},{"$f":"Form!$C$19","v":"Oxford Flood Alleviation Scheme"},{"$f":"Form!$Q$19","v":"THC040E/001A/007A"},{"$f":"Form!$Y$19","v":"Note: ppmt will pre-populate"},0,"Environment Agency",{"$f":"Form!$N$22","v":"West Thames"},{"$f":"Form!$C$22","v":"Thames"},{"$f":"Form!$Y$22","v":"NCPMS"},{"$f":"Form!C33","v":0},{"$f":"Form!G33","v":0},{"$f":"Form!K33","v":0},{"$f":"'Data Entry (contributions)'!F13","v":0},{"$f":"'Data Entry (contributions)'!G13","v":0},{"$f":"'Data Entry (contributions)'!H13","v":0},{"$f":"'Data Entry (contributions)'!J13","v":0},{"$f":"'Data Entry (contributions)'!K13","v":0},{"$f":"'Data Entry (contributions)'!L13","v":0},{"$f":"Form!R33","v":0},{"$f":"Form!T33","v":0},{"$f":"Form!V33","v":0},{"$f":"Form!X33","v":0},{"$f":"Form!Z33","v":0},{"$f":"Form!AB33","v":0},{"$f":"Form!AD33","v":0},{"$f":"Form!AF33","v":0},{"$f":"Form!AH33","v":0},{"$f":"Form!AK33","v":""},{"$f":"'Data Entry (contributions)'!P13","v":""},{"$f":"'Data Entry (contributions)'!Q13","v":""},{"$f":"'Data Entry (contributions)'!T13","v":""},{"$f":"'Data Entry (contributions)'!U13","v":""},{"$f":"'Data Entry (contributions)'!V13","v":""},{"$f":"'Data Entry (contributions)'!W13","v":""},{"$f":"'Data Entry (contributions)'!X13","v":""},{"$f":"'Data Entry (contributions)'!AE13","v":""},{"$f":"'Data Entry (contributions)'!AF13","v":""},{"$f":"'Data Entry (contributions)'!AG13","v":""},{"$f":"'Data Entry (contributions)'!AH13","v":""},{"$f":"'Data Entry (contributions)'!AI13","v":""},{"$f":"'Data Entry (contributions)'!AL13","v":""},{"$f":"'Data Entry (contributions)'!AN13","v":""}]
[5,"\\\\prodds\\shared\\SE\\Southeast\\WT_FCRM\\Environment Management\\New Projects\\Oxford\\x--06 Quality\\6.15 Efficency\\[CERT Oxford FAS 16107.xlsm]Form",{"$f":"Form!$C$11","v":42650},{"$f":"Form!$K$11","v":"Heather Taylor (EA PM)"},{"$f":"Form!$C$15","v":"Note: ppmt will pre-populate"},{"$f":"Form!$N$15","v":"Note: ppmt will pre-populate"},{"$f":"Form!$C$19","v":"Oxford Flood Alleviation Scheme"},{"$f":"Form!$Q$19","v":"THC040E/001A/007A"},{"$f":"Form!$Y$19","v":"Note: ppmt will pre-populate"},0,"Environment Agency",{"$f":"Form!$N$22","v":"West Thames"},{"$f":"Form!$C$22","v":"Thames"},{"$f":"Form!$Y$22","v":"NCPMS"},{"$f":"Form!C34","v":0},{"$f":"Form!G34","v":0},{"$f":"Form!K34","v":0},{"$f":"'Data Entry (contributions)'!F14","v":0},{"$f":"'Data Entry (contributions)'!G14","v":0},{"$f":"'Data Entry (contributions)'!H14","v":0},{"$f":"'Data Entry (contributions)'!J14","v":0},{"$f":"'Data Entry (contributions)'!K14","v":0},{"$f":"'Data Entry (contributions)'!L14","v":0},{"$f":"Form!R34","v":0},{"$f":"Form!T34","v":0},{"$f":"Form!V34","v":0},{"$f":"Form!X34","v":0},{"$f":"Form!Z34","v":0},{"$f":"Form!AB34","v":0},{"$f":"Form!AD34","v":0},{"$f":"Form!AF34","v":0},{"$f":"Form!AH34","v":0},{"$f":"Form!AK34","v":""},{"$f":"'Data Entry (contributions)'!P14","v":""},{"$f":"'Data Entry (contributions)'!Q14","v":""},{"$f":"'Data Entry (contributions)'!T14","v":""},{"$f":"'Data Entry (contributions)'!U14","v":""},{"$f":"'Data Entry (contributions)'!V14","v":""},{"$f":"'Data Entry (contributions)'!W14","v":""},{"$f":"'Data Entry (contributions)'!X14","v":""},{"$f":"'Data Entry (contributions)'!AE14","v":""},{"$f":"'Data Entry (contributions)'!AF14","v":""},{"$f":"'Data Entry (contributions)'!AG14","v":""},{"$f":"'Data Entry (contributions)'!AH14","v":""},{"$f":"'Data Entry (contributions)'!AI14","v":""},{"$f":"'Data Entry (contributions)'!AL14","v":""},{"$f":"'Data Entry (contributions)'!AN14","v":""}]
[6,"\\\\prodds\\shared\\SE\\Southeast\\WT_FCRM\\Environment Management\\New Projects\\Oxford\\x--06 Quality\\6.15 Efficency\\[CERT Oxford FAS 16107.xlsm]Form",{"$f":"Form!$C$11","v":42650},{"$f":"Form!$K$11","v":"Heather Taylor (EA PM)"},{"$f":"Form!$C$15","v":"Note: ppmt will pre-populate"},{"$f":"Form!$N$15","v":"Note: ppmt will pre-populate"},{"$f":"Form!$C$19","v":"Oxford Flood Alleviation Scheme"},{"$f":"Form!$Q$19","v":"THC040E/001A/007A"},{"$f":"Form!$Y$19","v":"Note: ppmt will pre-populate"},0,"Environment Agency",{"$f":"Form!$N$22","v":"West Thames"},{"$f":"Form!$C$22","v":"Thames"},{"$f":"Form!$Y$22","v":"NCPMS"},{"$f":"Form!C35","v":0},{"$f":"Form!G35","v":0},{"$f":"Form!K35","v":0},{"$f":"'Data Entry (contributions)'!F15","v":0},{"$f":"'Data Entry (contributions)'!G15","v":0},{"$f":"'Data Entry (contributions)'!H15","v":0},{"$f":"'Data Entry (contributions)'!J15","v":0},{"$f":"'Data Entry (contributions)'!K15","v":0},{"$f":"'Data Entry (contributions)'!L15","v":0},{"$f":"Form!R35","v":0},{"$f":"Form!T35","v":0},{"$f":"Form!V35","v":0},{"$f":"Form!X35","v":0},{"$f":"Form!Z35","v":0},{"$f":"Form!AB35","v":0},{"$f":"Form!AD35","v":0},{"$f":"Form!AF35","v":0},{"$f":"Form!AH35","v":0},{"$f":"Form!AK35","v":""},{"$f":"'Data Entry (contributions)'!P15","v":""},{"$f":"'Data Entry (contributions)'!Q15","v":""},{"$f":"'Data Entry (contributions)'!T15","v":""},{"$f":"'Data Entry (contributions)'!U15","v":""},{"$f":"'Data Entry (contributions)'!V15","v":""},{"$f":"'Data Entry (contributions)'!W15","v":""},{"$f":"'Data Entry (contributions)'!X15","v":""},{"$f":"'Data Entry (contributions)'!AE15","v":""},{"$f":"'Data Entry (contributions)'!AF15","v":""},{"$f":"'Data Entry (contributions)'!AG15","v":""},{"$f":"'Data Entry (contributions)'!AH15","v":""},{"$f":"'Data Entry (contributions)'!AI15","v":""},{"$f":"'Data Entry (contributions)'!AL15","v":""},{"$f":"'Data Entry (contributions)'!AN15","v":""}]
[7,"\\\\prodds\\shared\\SE\\Southeast\\WT_FCRM\\Environment Management\\New Projects\\Oxford\\x--06 Quality\\6.15 Efficency\\[CERT Oxford FAS 16107.xlsm]Form",{"$f":"Form!$C$11","v":42650},{"$f":"Form!$K$11","v":"Heather Taylor (EA PM)"},{"$f":"Form!$C$15","v":"Note: ppmt will pre-populate"},{"$f":"Form!$N$15","v":"Note: ppmt will pre-populate"},{"$f":"Form!$C$19","v":"Oxford Flood Alleviation Scheme"},{"$f":"Form!$Q$19","v":"THC040E/001A/007A"},{"$f":"Form!$Y$19","v":"Note: ppmt will pre-populate"},0,"Environment Agency",{"$f":"Form!$N$22","v":"West Thames"},{"$f":"Form!$C$22","v":"Thames"},{"$f":"Form!$Y$22","v":"NCPMS"},{"$f":"Form!C36","v":0},{"$f":"Form!G36","v":0},{"$f":"Form!K36","v":0},{"$f":"'Data Entry (contributions)'!F16","v":0},{"$f":"'Data Entry (contributions)'!G16","v":0},{"$f":"'Data Entry (contributions)'!H16","v":0},{"$f":"'Data Entry (contributions)'!J16","v":0},{"$f":"'Data Entry (contributions)'!K16","v":0},{"$f":"'Data Entry (contributions)'!L16","v":0},{"$f":"Form!R36","v":0},{"$f":"Form!T36","v":0},{"$f":"Form!V36","v":0},{"$f":"Form!X36","v":0},{"$f":"Form!Z36","v":0},{"$f":"Form!AB36","v":0},{"$f":"Form!AD36","v":0},{"$f":"Form!AF36","v":0},{"$f":"Form!AH36","v":0},{"$f":"Form!AK36","v":""},{"$f":"'Data Entry (contributions)'!P16","v":""},{"$f":"'Data Entry (contributions)'!Q16","v":""},{"$f":"'Data Entry (contributions)'!T16","v":""},{"$f":"'Data Entry (contributions)'!U16","v":""},{"$f":"'Data Entry (contributions)'!V16","v":""},{"$f":"'Data Entry (contributions)'!W16","v":""},{"$f":"'Data Entry (contributions)'!X16","v":""},{"$f":"'Data Entry (contributions)'!AE16","v":""},{"$f":"'Data Entry (contributions)'!AF16","v":""},{"$f":"'Data Entry (contributions)'!AG16","v":""},{"$f":"'Data Entry (contributions)'!AH16","v":""},{"$f":"'Data Entry (contributions)'!AI16","v":""},{"$f":"'Data Entry (contributions)'!AL16","v":""},{"$f":"'Data Entry (contributions)'!AN16","v":""}]
[8,"\\\\prodds\\shared\\SE\\Southeast\\WT_FCRM\\Environment Management\\New Projects\\Oxford\\x--06 Quality\\6.15 Efficency\\[CERT Oxford FAS 16107.xlsm]Form",{"$f":"Form!$C$11","v":42650},{"$f":"Form!$K$11","v":"Heather Taylor (EA PM)"},{"$f":"Form!$C$15","v":"Note: ppmt will pre-populate"},{"$f":"Form!$N$15","v":"Note: ppmt will pre-populate"},{"$f":"Form!$C$19","v":"Oxford Flood Alleviation Scheme"},{"$f":"Form!$Q$19","v":"THC040E/001A/007A"},{"$f":"Form!$Y$19","v":"Note: ppmt will pre-populate"},0,"Environment Agency",{"$f":"Form!$N$22","v":"West Thames"},{"$f":"Form!$C$22","v":"Thames"},{"$f":"Form!$Y$22","v":"NCPMS"},{"$f":"Form!C37","v":0},{"$f":"Form!G37","v":0},{"$f":"Form!K37","v":0},{"$f":"'Data Entry (contributions)'!F17","v":0},{"$f":"'Data Entry (contributions)'!G17","v":0},{"$f":"'Data Entry (contributions)'!H17","v":0},{"$f":"'Data Entry (contributions)'!J17","v":0},{"$f":"'Data Entry (contributions)'!K17","v":0},{"$f":"'Data Entry (contributions)'!L17","v":0},{"$f":"Form!R37","v":0},{"$f":"Form!T37","v":0},{"$f":"Form!V37","v":0},{"$f":"Form!X37","v":0},{"$f":"Form!Z37","v":0},{"$f":"Form!AB37","v":0},{"$f":"Form!AD37","v":0},{"$f":"Form!AF37","v":0},{"$f":"Form!AH37","v":0},{"$f":"Form!AK37","v":""},{"$f":"'Data Entry (contributions)'!P17","v":""},{"$f":"'Data Entry (contributions)'!Q17","v":""},{"$f":"'Data Entry (contributions)'!T17","v":""},{"$f":"'Data Entry (contributions)'!U17","v":""},{"$f":"'Data Entry (contributions)'!V17","v":""},{"$f":"'Data Entry (contributions)'!W17","v":""},{"$f":"'Data Entry (contributions)'!X17","v":""},{"$f":"'Data Entry (contributions)'!AE17","v":""},{"$f":"'Data Entry (contributions)'!AF17","v":""},{"$f":"'Data Entry (contributions)'!AG17","v":""},{"$f":"'Data Entry (contributions)'!AH17","v":""},{"$f":"'Data Entry (contributions)'!AI17","v":""},{"$f":"'Data Entry (contributions)'!AL17","v":""},{"$f":"'Data Entry (contributions)'!AN17","v":""}]
[9,"\\\\prodds\\shared\\SE\\Southeast\\WT_FCRM\\Environment Management\\New Projects\\Oxford\\x--06 Quality\\6.15 Efficency\\[CERT Oxford FAS 16107.xlsm]Form",{"$f":"Form!$C$11","v":42650},{"$f":"Form!$K$11","v":"Heather Taylor (EA PM)"},{"$f":"Form!$C$15","v":"Note: ppmt will pre-populate"},{"$f":"Form!$N$15","v":"Note: ppmt will pre-populate"},{"$f":"Form!$C$19","v":"Oxford Flood Alleviation Scheme"},{"$f":"Form!$Q$19","v":"THC040E/001A/007A"},{"$f":"Form!$Y$19","v":"Note: ppmt will pre-populate"},0,"Environment Agency",{"$f":"Form!$N$22","v":"West Thames"},{"$f":"Form!$C$22","v":"Thames"},{"$f":"Form!$Y$22","v":"NCPMS"},{"$f":"Form!C38","v":0},{"$f":"Form!G38","v":0},{"$f":"Form!K38","v":0},{"$f":"'Data Entry (contributions)'!F18","v":0},{"$f":"'Data Entry (contributions)'!G18","v":0},{"$f":"'Data Entry (contributions)'!H18","v":0},{"$f":"'Data Entry (contributions)'!J18","v":0},{"$f":"'Data Entry (contributions)'!K18","v":0},{"$f":"'Data Entry (contributions)'!L18","v":0},{"$f":"Form!R38","v":0},{"$f":"Form!T38","v":0},{"$f":"Form!V38","v":0},{"$f":"Form!X38","v":0},{"$f":"Form!Z38","v":0},{"$f":"Form!AB38","v":0},{"$f":"Form!AD38","v":0},{"$f":"Form!AF38","v":0},{"$f":"Form!AH38","v":0},{"$f":"Form!AK38","v":""},{"$f":"'Data Entry (contributions)'!P18","v":""},{"$f":"'Data Entry (contributions)'!Q18","v":""},{"$f":"'Data Entry (contributions)'!T18","v":""},{"$f":"'Data Entry (contributions)'!U18","v":""},{"$f":"'Data Entry (contributions)'!V18","v":""},{"$f":"'Data Entry (contributions)'!W18","v":""},{"$f":"'Data Entry (contributions)'!X18","v":""},{"$f":"'Data Entry (contributions)'!AE18","v":""},{"$f":"'Data Entry (contributions)'!AF18","v":""},{"$f":"'Data Entry (contributions)'!AG18","v":""},{"$f":"'Data Entry (contributions)'!AH18","v":""},{"$f":"'Data Entry (contributions)'!AI18","v":""},{"$f":"'Data Entry (contributions)'!AL18","v":""},{"$f":"'Data Entry (contributions)'!AN18","v":""}]
[10,"\\\\prodds\\shared\\SE\\Southeast\\WT_FCRM\\Environment Management\\New Projects\\Oxford\\x--06 Quality\\6.15 Efficency\\[CERT Oxford FAS 16107.xlsm]Form",{"$f":"Form!$C$11","v":42650},{"$f":"Form!$K$11","v":"Heather Taylor (EA PM)"},{"$f":"Form!$C$15","v":"Note: ppmt will pre-populate"},{"$f":"Form!$N$15","v":"Note: ppmt will pre-populate"},{"$f":"Form!$C$19","v":"Oxford Flood Alleviation Scheme"},{"$f":"Form!$Q$19","v":"THC040E/001A/007A"},{"$f":"Form!$Y$19","v":"Note: ppmt will pre-populate"},0,"Environment Agency",{"$f":"Form!$N$22","v":"West Thames"},{"$f":"Form!$C$22","v":"Thames"},{"$f":"Form!$Y$22","v":"NCPMS"},{"$f":"Form!C39","v":0},{"$f":"Form!G39","v":0},{"$f":"Form!K39","v":0},{"$f":"'Data Entry (contributions)'!F19","v":0},{"$f":"'Data Entry (contributions)'!G19","v":0},{"$f":"'Data Entry (contributions)'!H19","v":0},{"$f":"'Data Entry (contributions)'!J19","v":0},{"$f":"'Data Entry (contributions)'!K19","v":0},{"$f":"'Data Entry (contributions)'!L19","v":0},{"$f":"Form!R39","v":0},{"$f":"Form!T39","v":0},{"$f":"Form!V39","v":0},{"$f":"Form!X39","v":0},{"$f":"Form!Z39","v":0},{"$f":"Form!AB39","v":0},{"$f":"Form!AD39","v":0},{"$f":"Form!AF39","v":0},{"$f":"Form!AH39","v":0},{"$f":"Form!AK39","v":""},{"$f":"'Data Entry (contributions)'!P19","v":""},{"$f":"'Data Entry (contributions)'!Q19","v":""},{"$f":"'Data Entry (contributions)'!T19","v":""},{"$f":"'Data Entry (contributions)'!U19","v":""},{"$f":"'Data Entry (contributions)'!V19","v":""},{"$f":"'Data Entry (contributions)'!W19","v":""},{"$f":"'Data Entry (contributions)'!X19","v":""},{"$f":"'Data Entry (contributions)'!AE19","v":""},{"$f":"'Data Entry (contributions)'!AF19","v":""},{"$f":"'Data Entry (contributions)'!AG19","v":""},{"$f":"'Data Entry (contributions)'!AH19","v":""},{"$f":"'Data Entry (contributions)'!AI19","v":""},{"$f":"'Data Entry (contributions)'!AL19","v":""},{"$f":"'Data Entry (contributions)'!AN19","v":""}]
[11,"\\\\prodds\\shared\\SE\\Southeast\\WT_FCRM\\Environment Management\\New Projects\\Oxford\\x--06 Quality\\6.15 Efficency\\[CERT Oxford FAS 16107.xlsm]Form",{"$f":"Form!$C$11","v":42650},{"$f":"Form!$K$11","v":"Heather Taylor (EA PM)"},{"$f":"Form!$C$15","v":"Note: ppmt will pre-populate"},{"$f":"Form!$N$15","v":"Note: ppmt will pre-populate"},{"$f":"Form!$C$19","v":"Oxford Flood Alleviation Scheme"},{"$f":"Form!$Q$19","v":"THC040E/001A/007A"},{"$f":"Form!$Y$19","v":"Note: ppmt will pre-populate"},0,"Environment Agency",{"$f":"Form!$N$22","v":"West Thames"},{"$f":"Form!$C$22","v":"Thames"},{"$f":"Form!$Y$22","v":"NCPMS"},{"$f":"Form!C40","v":0},{"$f":"Form!G40","v":0},{"$f":"Form!K40","v":0},{"$f":"'Data Entry (contributions)'!F20","v":0},{"$f":"'Data Entry (contributions)'!G20","v":0},{"$f":"'Data Entry (contributions)'!H20","v":0},{"$f":"'Data Entry (contributions)'!J20","v":0},{"$f":"'Data Entry (contributions)'!K20","v":0},{"$f":"'Data Entry (contributions)'!L20","v":0},{"$f":"Form!R40","v":0},{"$f":"Form!T40","v":0},{"$f":"Form!V40","v":0},{"$f":"Form!X40","v":0},{"$f":"Form!Z40","v":0},{"$f":"Form!AB40","v":0},{"$f":"Form!AD40","v":0},{"$f":"Form!AF40","v":0},{"$f":"Form!AH40","v":0},{"$f":"Form!AK40","v":""},{"$f":"'Data Entry (contributions)'!P20","v":""},{"$f":"'Data Entry (contributions)'!Q20","v":""},{"$f":"'Data Entry (contributions)'!T20","v":""},{"$f":"'Data Entry (contributions)'!U20","v":""},{"$f":"'Data Entry (contributions)'!V20","v":""},{"$f":"'Data Entry (contributions)'!W20","v":""},{"$f":"'Data Entry (contributions)'!X20","v":""},{"$f":"'Data Entry (contributions)'!AE20","v":""},{"$f":"'Data Entry (contributions)'!AF20","v":""},{"$f":"'Data Entry (contributions)'!AG20","v":""},{"$f":"'Data Entry (contributions)'!AH20","v":""},{"$f":"'Data Entry (contributions)'!AI20","v":""},{"$f":"'Data Entry (contributions)'!AL20","v":""},{"$f":"'Data Entry (contributions)'!AN20","v":""}]
[12,"\\\\prodds\\shared\\SE\\Southeast\\WT_FCRM\\Environment Management\\New Projects\\Oxford\\x--06 Quality\\6.15 Efficency\\[CERT Oxford FAS 16107.xlsm]Form",{"$f":"Form!$C$11","v":42650},{"$f":"Form!$K$11","v":"Heather Taylor (EA PM)"},{"$f":"Form!$C$15","v":"Note: ppmt will pre-populate"},{"$f":"Form!$N$15","v":"Note: ppmt will pre-populate"},{"$f":"Form!$C$19","v":"Oxford Flood Alleviation Scheme"},{"$f":"Form!$Q$19","v":"THC040E/001A/007A"},{"$f":"Form!$Y$19","v":"Note: ppmt will pre-populate"},0,"Environment Agency",{"$f":"Form!$N$22","v":"West Thames"},{"$f":"Form!$C$22","v":"Thames"},{"$f":"Form!$Y$22","v":"NCPMS"},{"$f":"Form!C41","v":0},{"$f":"Form!G41","v":0},{"$f":"Form!K41","v":0},{"$f":"'Data Entry (contributions)'!F21","v":0},{"$f":"'Data Entry (contributions)'!G21","v":0},{"$f":"'Data Entry (contributions)'!H21","v":0},{"$f":"'Data Entry (contributions)'!J21","v":0},{"$f":"'Data Entry (contributions)'!K21","v":0},{"$f":"'Data Entry (contributions)'!L21","v":0},{"$f":"Form!R41","v":0},{"$f":"Form!T41","v":0},{"$f":"Form!V41","v":0},{"$f":"Form!X41","v":0},{"$f":"Form!Z41","v":0},{"$f":"Form!AB41","v":0},{"$f":"Form!AD41","v":0},{"$f":"Form!AF41","v":0},{"$f":"Form!AH41","v":0},{"$f":"Form!AK41","v":""},{"$f":"'Data Entry (contributions)'!P21","v":""},{"$f":"'Data Entry (contributions)'!Q21","v":""},{"$f":"'Data Entry (contributions)'!T21","v":""},{"$f":"'Data Entry (contributions)'!U21","v":""},{"$f":"'Data Entry (contributions)'!V21","v":""},{"$f":"'Data Entry (contributions)'!W21","v":""},{"$f":"'Data Entry (contributions)'!X21","v":""},{"$f":"'Data Entry (contributions)'!AE21","v":""},{"$f":"'Data Entry (contributions)'!AF21","v":""},{"$f":"'Data Entry (contributions)'!AG21","v":""},{"$f":"'Data Entry (contributions)'!AH21","v":""},{"$f":"'Data Entry (contributions)'!AI21","v":""},{"$f":"'Data Entry (contributions)'!AL21","v":""},{"$f":"'Data Entry (contributions)'!AN21","v":""}]
[13,"\\\\prodds\\shared\\SE\\Southeast\\WT_FCRM\\Environment Management\\New Projects\\Oxford\\x--06 Quality\\6.15 Efficency\\[CERT Oxford FAS 16107.xlsm]Form",{"$f":"Form!$C$11","v":42650},{"$f":"Form!$K$11","v":"Heather Taylor (EA PM)"},{"$f":"Form!$C$15","v":"Note: ppmt will pre-populate"},{"$f":"Form!$N$15","v":"Note: ppmt will pre-populate"},{"$f":"Form!$C$19","v":"Oxford Flood Alleviation Scheme"},{"$f":"Form!$Q$19","v":"THC040E/001A/007A"},{"$f":"Form!$Y$19","v":"Note: ppmt will pre-populate"},0,"Environment Agency",{"$f":"Form!$N$22","v":"West Thames"},{"$f":"Form!$C$22","v":"Thames"},{"$f":"Form!$Y$22","v":"NCPMS"},{"$f":"Form!C42","v":0},{"$f":"Form!G42","v":0},{"$f":"Form!K42","v":0},{"$f":"'Data Entry (contributions)'!F22","v":0},{"$f":"'Data Entry (contributions)'!G22","v":0},{"$f":"'Data Entry (contributions)'!H22","v":0},{"$f":"'Data Entry (contributions)'!J22","v":0},{"$f":"'Data Entry (contributions)'!K22","v":0},{"$f":"'Data Entry (contributions)'!L22","v":0},{"$f":"Form!R42","v":0},{"$f":"Form!T42","v":0},{"$f":"Form!V42","v":0},{"$f":"Form!X42","v":0},{"$f":"Form!Z42","v":0},{"$f":"Form!AB42","v":0},{"$f":"Form!AD42","v":0},{"$f":"Form!AF42","v":0},{"$f":"Form!AH42","v":0},{"$f":"Form!AK42","v":""},{"$f":"'Data Entry (contributions)'!P22","v":""},{"$f":"'Data Entry (contributions)'!Q22","v":""},{"$f":"'Data Entry (contributions)'!T22","v":""},{"$f":"'Data Entry (contributions)'!U22","v":""},{"$f":"'Data Entry (contributions)'!V22","v":""},{"$f":"'Data Entry (contributions)'!W22","v":""},{"$f":"'Data Entry (contributions)'!X22","v":""},{"$f":"'Data Entry (contributions)'!AE22","v":""},{"$f":"'Data Entry (contributions)'!AF22","v":""},{"$f":"'Data Entry (contributions)'!AG22","v":""},{"$f":"'Data Entry (contributions)'!AH22","v":""},{"$f":"'Data Entry (contributions)'!AI22","v":""},{"$f":"'Data Entry (contributions)'!AL22","v":""},{"$f":"'Data Entry (contributions)'!AN22","v":""}]
[14,"\\\\prodds\\shared\\SE\\Southeast\\WT_FCRM\\Environment Management\\New Projects\\Oxford\\x--06 Quality\\6.15 Efficency\\[CERT Oxford FAS 16107.xlsm]Form",{"$f":"Form!$C$11","v":42650},{"$f":"Form!$K$11","v":"Heather Taylor (EA PM)"},{"$f":"Form!$C$15","v":"Note: ppmt will pre-populate"},{"$f":"Form!$N$15","v":"Note: ppmt will pre-populate"},{"$f":"Form!$C$19","v":"Oxford Flood Alleviation Scheme"},{"$f":"Form!$Q$19","v":"THC040E/001A/007A"},{"$f":"Form!$Y$19","v":"Note: ppmt will pre-populate"},0,"Environment Agency",{"$f":"Form!$N$22","v":"West Thames"},{"$f":"Form!$C$22","v":"Thames"},{"$f":"Form!$Y$22","v":"NCPMS"},{"$f":"Form!C43","v":0},{"$f":"Form!G43","v":0},{"$f":"Form!K43","v":0},{"$f":"'Data Entry (contributions)'!F23","v":0},{"$f":"'Data Entry (contributions)'!G23","v":0},{"$f":"'Data Entry (contributions)'!H23","v":0},{"$f":"'Data Entry (contributions)'!J23","v":0},{"$f":"'Data Entry (contributions)'!K23","v":0},{"$f":"'Data Entry (contributions)'!L23","v":0},{"$f":"Form!R43","v":0},{"$f":"Form!T43","v":0},{"$f":"Form!V43","v":0},{"$f":"Form!X43","v":0},{"$f":"Form!Z43","v":0},{"$f":"Form!AB43","v":0},{"$f":"Form!AD43","v":0},{"$f":"Form!AF43","v":0},{"$f":"Form!AH43","v":0},{"$f":"Form!AK43","v":""},{"$f":"'Data Entry (contributions)'!P23","v":""},{"$f":"'Data Entry (contributions)'!Q23","v":""},{"$f":"'Data Entry (contributions)'!T23","v":""},{"$f":"'Data Entry (contributions)'!U23","v":""},{"$f":"'Data Entry (contributions)'!V23","v":""},{"$f":"'Data Entry (contributions)'!W23","v":""},{"$f":"'Data Entry (contributions)'!X23","v":""},{"$f":"'Data Entry (contributions)'!AE23","v":""},{"$f":"'Data Entry (contributions)'!AF23","v":""},{"$f":"'Data Entry (contributions)'!AG23","v":""},{"$f":"'Data Entry (contributions)'!AH23","v":""},{"$f":"'Data Entry (contributions)'!AI23","v":""},{"$f":"'Data Entry (contributions)'!AL23","v":""},{"$f":"'Data Entry (contributions)'!AN23","v":""}]
[15,"\\\\prodds\\shared\\SE\\Southeast\\WT_FCRM\\Environment Management\\New Projects\\Oxford\\x--06 Quality\\6.15 Efficency\\[CERT Oxford FAS 16107.xlsm]Form",{"$f":"Form!$C$11","v":42650},{"$f":"Form!$K$11","v":"Heather Taylor (EA PM)"},{"$f":"Form!$C$15","v":"Note: ppmt will pre-populate"},{"$f":"Form!$N$15","v":"Note: ppmt will pre-populate"},{"$f":"Form!$C$19","v":"Oxford Flood Alleviation Scheme"},{"$f":"Form!$Q$19","v":"THC040E/001A/007A"},{"$f":"Form!$Y$19","v":"Note: ppmt will pre-populate"},0,"Environment Agency",{"$f":"Form!$N$22","v":"West Thames"},{"$f":"Form!$C$22","v":"Thames"},{"$f":"Form!$Y$22","v":"NCPMS"},{"$f":"Form!C44","v":0},{"$f":"Form!G44","v":0},{"$f":"Form!K44","v":0},{"$f":"'Data Entry (contributions)'!F24","v":0},{"$f":"'Data Entry (contributions)'!G24","v":0},{"$f":"'Data Entry (contributions)'!H24","v":0},{"$f":"'Data Entry (contributions)'!J24","v":0},{"$f":"'Data Entry (contributions)'!K24","v":0},{"$f":"'Data Entry (contributions)'!L24","v":0},{"$f":"Form!R44","v":0},{"$f":"Form!T44","v":0},{"$f":"Form!V44","v":0},{"$f":"Form!X44","v":0},{"$f":"Form!Z44","v":0},{"$f":"Form!AB44","v":0},{"$f":"Form!AD44","v":0},{"$f":"Form!AF44","v":0},{"$f":"Form!AH44","v":0},{"$f":"Form!AK44","v":""},{"$f":"'Data Entry (contributions)'!P24","v":""},{"$f":"'Data Entry (contributions)'!Q24","v":""},{"$f":"'Data Entry (contributions)'!T24","v":""},{"$f":"'Data Entry (contributions)'!U24","v":""},{"$f":"'Data Entry (contributions)'!V24","v":""},{"$f":"'Data Entry (contributions)'!W24","v":""},{"$f":"'Data Entry (contributions)'!X24","v":""},{"$f":"'Data Entry (contributions)'!AE24","v":""},{"$f":"'Data Entry (contributions)'!AF24","v":""},{"$f":"'Data Entry (contributions)'!AG24","v":""},{"$f":"'Data Entry (contributions)'!AH24","v":""},{"$f":"'Data Entry (contributions)'!AI24","v":""},{"$f":"'Data Entry (contributions)'!AL24","v":""},{"$f":"'Data Entry (contributions)'!AN24","v":""}]
[16,"\\\\prodds\\shared\\SE\\Southeast\\WT_FCRM\\Environment Management\\New Projects\\Oxford\\x--06 Quality\\6.15 Efficency\\[CERT Oxford FAS 16107.xlsm]Form",{"$f":"Form!$C$11","v":42650},{"$f":"Form!$K$11","v":"Heather Taylor (EA PM)"},{"$f":"Form!$C$15","v":"Note: ppmt will pre-populate"},{"$f":"Form!$N$15","v":"Note: ppmt will pre-populate"},{"$f":"Form!$C$19","v":"Oxford Flood Alleviation Scheme"},{"$f":"Form!$Q$19","v":"THC040E/001A/007A"},{"$f":"Form!$Y$19","v":"Note: ppmt will pre-populate"},0,"Environment Agency",{"$f":"Form!$N$22","v":"West Thames"},{"$f":"Form!$C$22","v":"Thames"},{"$f":"Form!$Y$22","v":"NCPMS"},{"$f":"Form!C45","v":0},{"$f":"Form!G45","v":0},{"$f":"Form!K45","v":0},{"$f":"'Data Entry (contributions)'!F25","v":0},{"$f":"'Data Entry (contributions)'!G25","v":0},{"$f":"'Data Entry (contributions)'!H25","v":0},{"$f":"'Data Entry (contributions)'!J25","v":0},{"$f":"'Data Entry (contributions)'!K25","v":0},{"$f":"'Data Entry (contributions)'!L25","v":0},{"$f":"Form!R45","v":0},{"$f":"Form!T45","v":0},{"$f":"Form!V45","v":0},{"$f":"Form!X45","v":0},{"$f":"Form!Z45","v":0},{"$f":"Form!AB45","v":0},{"$f":"Form!AD45","v":0},{"$f":"Form!AF45","v":0},{"$f":"Form!AH45","v":0},{"$f":"Form!AK45","v":""},{"$f":"'Data Entry (contributions)'!P25","v":""},{"$f":"'Data Entry (contributions)'!Q25","v":""},{"$f":"'Data Entry (contributions)'!T25","v":""},{"$f":"'Data Entry (contributions)'!U25","v":""},{"$f":"'Data Entry (contributions)'!V25","v":""},{"$f":"'Data Entry (contributions)'!W25","v":""},{"$f":"'Data Entry (contributions)'!X25","v":""},{"$f":"'Data Entry (contributions)'!AE25","v":""},{"$f":"'Data Entry (contributions)'!AF25","v":""},{"$f":"'Data Entry (contributions)'!AG25","v":""},{"$f":"'Data Entry (contributions)'!AH25","v":""},{"$f":"'Data Entry (contributions)'!AI25","v":""},{"$f":"'Data Entry (contributions)'!AL25","v":""},{"$f":"'Data Entry (contributions)'!AN25","v":""}]
[17,"\\\\prodds\\shared\\SE\\Southeast\\WT_FCRM\\Environment Management\\New Projects\\Oxford\\x--06 Quality\\6.15 Efficency\\[CERT Oxford FAS 16107.xlsm]Form",{"$f":"Form!$C$11","v":42650},{"$f":"Form!$K$11","v":"Heather Taylor (EA PM)"},{"$f":"Form!$C$15","v":"Note: ppmt will pre-populate"},{"$f":"Form!$N$15","v":"Note: ppmt will pre-populate"},{"$f":"Form!$C$19","v":"Oxford Flood Alleviation Scheme"},{"$f":"Form!$Q$19","v":"THC040E/001A/007A"},{"$f":"Form!$Y$19","v":"Note: ppmt will pre-populate"},0,"Environment Agency",{"$f":"Form!$N$22","v":"West Thames"},{"$f":"Form!$C$22","v":"Thames"},{"$f":"Form!$Y$22","v":"NCPMS"},{"$f":"Form!C46","v":0},{"$f":"Form!G46","v":0},{"$f":"Form!K46","v":0},{"$f":"'Data Entry (contributions)'!F26","v":0},{"$f":"'Data Entry (contributions)'!G26","v":0},{"$f":"'Data Entry (contributions)'!H26","v":0},{"$f":"'Data Entry (contributions)'!J26","v":0},{"$f":"'Data Entry (contributions)'!K26","v":0},{"$f":"'Data Entry (contributions)'!L26","v":0},{"$f":"Form!R46","v":0},{"$f":"Form!T46","v":0},{"$f":"Form!V46","v":0},{"$f":"Form!X46","v":0},{"$f":"Form!Z46","v":0},{"$f":"Form!AB46","v":0},{"$f":"Form!AD46","v":0},{"$f":"Form!AF46","v":0},{"$f":"Form!AH46","v":0},{"$f":"Form!AK46","v":""},{"$f":"'Data Entry (contributions)'!P26","v":""},{"$f":"'Data Entry (contributions)'!Q26","v":""},{"$f":"'Data Entry (contributions)'!T26","v":""},{"$f":"'Data Entry (contributions)'!U26","v":""},{"$f":"'Data Entry (contributions)'!V26","v":""},{"$f":"'Data Entry (contributions)'!W26","v":""},{"$f":"'Data Entry (contributions)'!X26","v":""},{"$f":"'Data Entry (contributions)'!AE26","v":""},{"$f":"'Data Entry (contributions)'!AF26","v":""},{"$f":"'Data Entry (contributions)'!AG26","v":""},{"$f":"'Data Entry (contributions)'!AH26","v":""},{"$f":"'Data Entry (contributions)'!AI26","v":""},{"$f":"'Data Entry (contributions)'!AL26","v":""},{"$f":"'Data Entry (contributions)'!AN26","v":""}]
[18,"\\\\prodds\\shared\\SE\\Southeast\\WT_FCRM\\Environment Management\\New Projects\\Oxford\\x--06 Quality\\6.15 Efficency\\[CERT Oxford FAS 16107.xlsm]Form",{"$f":"Form!$C$11","v":42650},{"$f":"Form!$K$11","v":"Heather Taylor (EA PM)"},{"$f":"Form!$C$15","v":"Note: ppmt will pre-populate"},{"$f":"Form!$N$15","v":"Note: ppmt will pre-populate"},{"$f":"Form!$C$19","v":"Oxford Flood Alleviation Scheme"},{"$f":"Form!$Q$19","v":"THC040E/001A/007A"},{"$f":"Form!$Y$19","v":"Note: ppmt will pre-populate"},0,"Environment Agency",{"$f":"Form!$N$22","v":"West Thames"},{"$f":"Form!$C$22","v":"Thames"},{"$f":"Form!$Y$22","v":"NCPMS"},{"$f":"Form!C47","v":0},{"$f":"Form!G47","v":0},{"$f":"Form!K47","v":0},{"$f":"'Data Entry (contributions)'!F27","v":0},{"$f":"'Data Entry (contributions)'!G27","v":0},{"$f":"'Data Entry (contributions)'!H27","v":0},{"$f":"'Data Entry (contributions)'!J27","v":0},{"$f":"'Data Entry (contributions)'!K27","v":0},{"$f":"'Data Entry (contributions)'!L27","v":0},{"$f":"Form!R47","v":0},{"$f":"Form!T47","v":0},{"$f":"Form!V47","v":0},{"$f":"Form!X47","v":0},{"$f":"Form!Z47","v":0},{"$f":"Form!AB47","v":0},{"$f":"Form!AD47","v":0},{"$f":"Form!AF47","v":0},{"$f":"Form!AH47","v":0},{"$f":"Form!AK47","v":""},{"$f":"'Data Entry (contributions)'!P27","v":""},{"$f":"'Data Entry (contributions)'!Q27","v":""},{"$f":"'Data Entry (contributions)'!T27","v":""},{"$f":"'Data Entry (contributions)'!U27","v":""},{"$f":"'Data Entry (contributions)'!V27","v":""},{"$f":"'Data Entry (contributions)'!W27","v":""},{"$f":"'Data Entry (contributions)'!X27","v":""},{"$f":"'Data Entry (contributions)'!AE27","v":""},{"$f":"'Data Entry (contributions)'!AF27","v":""},{"$f":"'Data Entry (contributions)'!AG27","v":""},{"$f":"'Data Entry (contributions)'!AH27","v":""},{"$f":"'Data Entry (contributions)'!AI27","v":""},{"$f":"'Data Entry (contributions)'!AL27","v":""},{"$f":"'Data Entry (contributions)'!AN27","v":""}]
[19,"\\\\prodds\\shared\\SE\\Southeast\\WT_FCRM\\Environment Management\\New Projects\\Oxford\\x--06 Quality\\6.15 Efficency\\[CERT Oxford FAS 16107.xlsm]Form",{"$f":"Form!$C$11","v":42650},{"$f":"Form!$K$11","v":"Heather Taylor (EA PM)"},{"$f":"Form!$C$15","v":"Note: ppmt will pre-populate"},{"$f":"Form!$N$15","v":"Note: ppmt will pre-populate"},{"$f":"Form!$C$19","v":"Oxford Flood Alleviation Scheme"},{"$f":"Form!$Q$19","v":"THC040E/001A/007A"},{"$f":"Form!$Y$19","v":"Note: ppmt will pre-populate"},0,"Environment Agency",{"$f":"Form!$N$22","v":"West Thames"},{"$f":"Form!$C$22","v":"Thames"},{"$f":"Form!$Y$22","v":"NCPMS"},{"$f":"Form!C48","v":0},{"$f":"Form!G48","v":0},{"$f":"Form!K48","v":0},{"$f":"'Data Entry (contributions)'!F28","v":0},{"$f":"'Data Entry (contributions)'!G28","v":0},{"$f":"'Data Entry (contributions)'!H28","v":0},{"$f":"'Data Entry (contributions)'!J28","v":0},{"$f":"'Data Entry (contributions)'!K28","v":0},{"$f":"'Data Entry (contributions)'!L28","v":0},{"$f":"Form!R48","v":0},{"$f":"Form!T48","v":0},{"$f":"Form!V48","v":0},{"$f":"Form!X48","v":0},{"$f":"Form!Z48","v":0},{"$f":"Form!AB48","v":0},{"$f":"Form!AD48","v":0},{"$f":"Form!AF48","v":0},{"$f":"Form!AH48","v":0},{"$f":"Form!AK48","v":""},{"$f":"'Data Entry (contributions)'!P28","v":""},{"$f":"'Data Entry (contributions)'!Q28","v":""},{"$f":"'Data Entry (contributions)'!T28","v":""},{"$f":"'Data Entry (contributions)'!U28","v":""},{"$f":"'Data Entry (contributions)'!V28","v":""},{"$f":"'Data Entry (contributions)'!W28","v":""},{"$f":"'Data Entry (contributions)'!X28","v":""},{"$f":"'Data Entry (contributions)'!AE28","v":""},{"$f":"'Data Entry (contributions)'!AF28","v":""},{"$f":"'Data Entry (contributions)'!AG28","v":""},{"$f":"'Data Entry (contributions)'!AH28","v":""},{"$f":"'Data Entry (contributions)'!AI28","v":""},{"$f":"'Data Entry (contributions)'!AL28","v":""},{"$f":"'Data Entry (contributions)'!AN28","v":""}]
[20,"\\\\prodds\\shared\\SE\\Southeast\\WT_FCRM\\Environment Management\\New Projects\\Oxford\\x--06 Quality\\6.15 Efficency\\[CERT Oxford FAS 16107.xlsm]Form",{"$f":"Form!$C$11","v":42650},{"$f":"Form!$K$11","v":"Heather Taylor (EA PM)"},{"$f":"Form!$C$15","v":"Note: ppmt will pre-populate"},{"$f":"Form!$N$15","v":"Note: ppmt will pre-populate"},{"$f":"Form!$C$19","v":"Oxford Flood Alleviation Scheme"},{"$f":"Form!$Q$19","v":"THC040E/001A/007A"},{"$f":"Form!$Y$19","v":"Note: ppmt will pre-populate"},0,"Environment Agency",{"$f":"Form!$N$22","v":"West Thames"},{"$f":"Form!$C$22","v":"Thames"},{"$f":"Form!$Y$22","v":"NCPMS"},{"$f":"Form!C49","v":0},{"$f":"Form!G49","v":0},{"$f":"Form!K49","v":0},{"$f":"'Data Entry (contributions)'!F29","v":0},{"$f":"'Data Entry (contributions)'!G29","v":0},{"$f":"'Data Entry (contributions)'!H29","v":0},{"$f":"'Data Entry (contributions)'!J29","v":0},{"$f":"'Data Entry (contributions)'!K29","v":0},{"$f":"'Data Entry (contributions)'!L29","v":0},{"$f":"Form!R49","v":0},{"$f":"Form!T49","v":0},{"$f":"Form!V49","v":0},{"$f":"Form!X49","v":0},{"$f":"Form!Z49","v":0},{"$f":"Form!AB49","v":0},{"$f":"Form!AD49","v":0},{"$f":"Form!AF49","v":0},{"$f":"Form!AH49","v":0},{"$f":"Form!AK49","v":""},{"$f":"'Data Entry (contributions)'!P29","v":""},{"$f":"'Data Entry (contributions)'!Q29","v":""},{"$f":"'Data Entry (contributions)'!T29","v":""},{"$f":"'Data Entry (contributions)'!U29","v":""},{"$f":"'Data Entry (contributions)'!V29","v":""},{"$f":"'Data Entry (contributions)'!W29","v":""},{"$f":"'Data Entry (contributions)'!X29","v":""},{"$f":"'Data Entry (contributions)'!AE29","v":""},{"$f":"'Data Entry (contributions)'!AF29","v":""},{"$f":"'Data Entry (contributions)'!AG29","v":""},{"$f":"'Data Entry (contributions)'!AH29","v":""},{"$f":"'Data Entry (contributions)'!AI29","v":""},{"$f":"'Data Entry (contributions)'!AL29","v":""},{"$f":"'Data Entry (contributions)'!AN29","v":""}]

{"sheet":"EffDataSheet","index":4,"n_rows":21,"n_cols":45,"rows_kept":21,"cut":false,"hidden":true,"merged":[]}
["RowNumber","Filename","AmendDate","CompletedBy","ProjectManager","ProjectExecutive","ProjectName","NationalProjectNumber","1B1SNumber","AIMSNFCDDNumber","RiskMgmtAuthority","Area","RFCC","DeliveryTeam","CapitalRevenue","Baseline","Description","Quarter","15/16_ExpectedValue","16/17_ExpectedValue","17/18_ExpectedValue","18/19_ExpectedValue","19/20_ExpectedValue","20/21_ExpectedValue","Beyond_20/21_ExpectedValue","ExpectedValueTotal","Category","Outcome","ActualValue","DateRealised_Quarter","DateRealised_Year","EfficiencyReinvested_Value","EfficiencyReinvested_Description","EfficiencyReinvested_Comment","EfficiencyHandedBack_Value","EfficiencyHandedBack_Description","EfficiencyHandedBack_Comment","HowCalculated","LeadConsultant","LeadConstructor","LeadCostMgmt","SavingIdentified","ProjectTeamAgree","SavingForecast","SavingActual"]
[1,{"$f":"CELL(\"filename\")","v":"\\\\prodds\\shared\\SE\\Southeast\\WT_FCRM\\Environment Management\\New Projects\\Oxford\\x--06 Quality\\6.15 Efficency\\[CERT Oxford FAS 16107.xlsm]Form"},{"$f":"Form!$C$11","v":42650},{"$f":"Form!$K$11","v":"Heather Taylor (EA PM)"},{"$f":"Form!$C$15","v":"Note: ppmt will pre-populate"},{"$f":"Form!$N$15","v":"Note: ppmt will pre-populate"},{"$f":"Form!$C$19","v":"Oxford Flood Alleviation Scheme"},{"$f":"Form!$Q$19","v":"THC040E/001A/007A"},{"$f":"Form!$Y$19","v":"Note: ppmt will pre-populate"},{"$f":"Form!$AG$19","v":"Note: ppmt will pre-populate"},"Environment Agency",{"$f":"Form!$N$22","v":"West Thames"},{"$f":"Form!$C$22","v":"Thames"},{"$f":"Form!$Y$22","v":"NCPMS"},{"$f":"Form!C59","v":"Capital"},{"$f":"Form!G59","v":"2Nr full time ecologists survey 70 ponds to identify if there is a presence of great crested newts"},{"$f":"Form!O59","v":"Environmental DNA (eDNA) is a new technique which can detect great crested newt DNA in a water body. A water sample is collected in May from the target pond, which is then tested in a lab for the presence of the GCN DNA."},{"$f":"Form!X59","v":"Q2"},{"$f":"Form!Z59","v":0},{"$f":"Form!AB59","v":0},{"$f":"Form!AD59","v":60000},{"$f":"Form!AF59","v":0},{"$f":"Form!AH59","v":0},{"$f":"Form!AJ59","v":0},{"$f":"Form!AL59","v":0},{"$f":"'Data Entry (efficiencies)'!Q10","v":60000},{"$f":"'Data Entry (efficiencies)'!G10","v":"Innovation and value engineering"},{"$f":"'Data Entry (efficiencies)'!S10","v":"Same outcome but more cost effective"},{"$f":"'Data Entry (efficiencies)'!T10","v":60000},{"$f":"'Data Entry (efficiencies)'!U10","v":"Q2"},{"$f":"'Data Entry (efficiencies)'!V10","v":42584},{"$f":"'Data Entry (efficiencies)'!W10","v":60000},{"$f":"'Data Entry (efficiencies)'!X10","v":"Risk realised within budget"},{"$f":"'Data Entry (efficiencies)'!Y10","v":"Jo Larmour"},{"$f":"'Data Entry (efficiencies)'!Z10","v":0},{"$f":"'Data Entry (efficiencies)'!AA10","v":0},{"$f":"'Data Entry (efficiencies)'!AB10","v":0},{"$f":"'Data Entry (efficiencies)'!AC10","v":"Cost of staff time and lab costs valued against original technique of mulitple ecologists visits on site"},{"$f":"'Data Entry (efficiencies)'!AE10","v":"Halcrow group Ltd"},{"$f":"'Data Entry (efficiencies)'!AF10","v":"Halcrow group Ltd"},{"$f":"'Data Entry (efficiencies)'!AG10","v":"EC Harris"},{"$f":"'Data Entry (efficiencies)'!AH10","v":"Penny Burt"},{"$f":"'Data Entry (efficiencies)'!AI10","v":"Agreed"},{"$f":"'Data Entry (efficiencies)'!#REF!","v":{"$error":"#REF!"}},{"$f":"'Data Entry (efficiencies)'!#REF!","v":{"$error":"#REF!"}}]
[2,{"$f":"CELL(\"filename\")","v":"\\\\prodds\\shared\\SE\\Southeast\\WT_FCRM\\Environment Management\\New Projects\\Oxford\\x--06 Quality\\6.15 Efficency\\[CERT Oxford FAS 16107.xlsm]Form"},{"$f":"Form!$C$11","v":42650},{"$f":"Form!$K$11","v":"Heather Taylor (EA PM)"},{"$f":"Form!$C$15","v":"Note: ppmt will pre-populate"},{"$f":"Form!$N$15","v":"Note: ppmt will pre-populate"},{"$f":"Form!$C$19","v":"Oxford Flood Alleviation Scheme"},{"$f":"Form!$Q$19","v":"THC040E/001A/007A"},{"$f":"Form!$Y$19","v":"Note: ppmt will pre-populate"},{"$f":"Form!$AG$19","v":"Note: ppmt will pre-populate"},"Environment Agency",{"$f":"Form!$N$22","v":"West Thames"},{"$f":"Form!$C$22","v":"Thames"},{"$f":"Form!$Y$22","v":"NCPMS"},{"$f":"Form!C60","v":"Capital"},{"$f":"Form!G60","v":"Utilise Lot 4 to construct culverts under railway"},{"$f":"Form!O60","v":"Network Rail constructed culverts on their flood relief project. See briefing note"},{"$f":"Form!X60","v":"Q2"},{"$f":"Form!Z60","v":0},{"$f":"Form!AB60","v":0},{"$f":"Form!AD60","v":3000000},{"$f":"Form!AF60","v":0},{"$f":"Form!AH60","v":0},{"$f":"Form!AJ60","v":0},{"$f":"Form!AL60","v":0},{"$f":"'Data Entry (efficiencies)'!Q11","v":3000000},{"$f":"'Data Entry (efficiencies)'!G11","v":"Contracting approach"},{"$f":"'Data Entry (efficiencies)'!S11","v":"Allowed the project to progress. It is highly unlikely that the project would have been able to progress as we wont have go the line closure.  In addition, this is a significant cost saving for the project.  See briefing note"},{"$f":"'Data Entry (efficiencies)'!T11","v":3000000},{"$f":"'Data Entry (efficiencies)'!U11","v":"Q2"},{"$f":"'Data Entry (efficiencies)'!V11","v":42583},{"$f":"'Data Entry (efficiencies)'!W11","v":3000000},{"$f":"'Data Entry (efficiencies)'!X11","v":"Risk realised within budget"},{"$f":"'Data Entry (efficiencies)'!Y11","v":"Jo Larmour aware"},{"$f":"'Data Entry (efficiencies)'!Z11","v":0},{"$f":"'Data Entry (efficiencies)'!AA11","v":0},{"$f":"'Data Entry (efficiencies)'!AB11","v":0},{"$f":"'Data Entry (efficiencies)'!AC11","v":"See Briefing note"},{"$f":"'Data Entry (efficiencies)'!AE11","v":"Halcrow group Ltd"},{"$f":"'Data Entry (efficiencies)'!AF11","v":"Halcrow group Ltd"},{"$f":"'Data Entry (efficiencies)'!AG11","v":"EC Harris"},{"$f":"'Data Entry (efficiencies)'!AH11","v":"Richard Harding"},{"$f":"'Data Entry (efficiencies)'!AI11","v":"Agreed"},{"$f":"'Data Entry (efficiencies)'!#REF!","v":{"$error":"#REF!"}},{"$f":"'Data Entry (efficiencies)'!#REF!","v":{"$error":"#REF!"}}]
[3,"\\\\prodds\\shared\\SE\\Southeast\\WT_FCRM\\Environment Management\\New Projects\\Oxford\\x--06 Quality\\6.15 Efficency\\[CERT Oxford FAS 16107.xlsm]Form",{"$f":"Form!$C$11","v":42650},{"$f":"Form!$K$11","v":"Heather Taylor (EA PM)"},{"$f":"Form!$C$15","v":"Note: ppmt will pre-populate"},{"$f":"Form!$N$15","v":"Note: ppmt will pre-populate"},{"$f":"Form!$C$19","v":"Oxford Flood Alleviation Scheme"},{"$f":"Form!$Q$19","v":"THC040E/001A/007A"},{"$f":"Form!$Y$19","v":"Note: ppmt will pre-populate"},{"$f":"Form!$AG$19","v":"Note: ppmt will pre-populate"},"Environment Agency",{"$f":"Form!$N$22","v":"West Thames"},{"$f":"Form!$C$22","v":"Thames"},{"$f":"Form!$Y$22","v":"NCPMS"},{"$f":"Form!C61","v":"Capital"},{"$f":"Form!G61","v":"600,000- 700,000m3 to be taken to landfill"},{"$f":"Form!O61","v":"400,000m3 now to be taken to tip"},{"$f":"Form!X61","v":"Q3"},{"$f":"Form!Z61","v":0},{"$f":"Form!AB61","v":0},{"$f":"Form!AD61","v":5000000},{"$f":"Form!AF61","v":0},{"$f":"Form!AH61","v":0},{"$f":"Form!AJ61","v":0},{"$f":"Form!AL61","v":0},{"$f":"'Data Entry (efficiencies)'!Q12","v":5000000},{"$f":"'Data Entry (efficiencies)'!G12","v":"Streamlining"},{"$f":"'Data Entry (efficiencies)'!S12","v":"Reduction in costs and therefore reducing our funding gap and programme "},{"$f":"'Data Entry (efficiencies)'!T12","v":5000000},{"$f":"'Data Entry (efficiencies)'!U12","v":"Q3"},{"$f":"'Data Entry (efficiencies)'!V12","v":2016},{"$f":"'Data Entry (efficiencies)'!W12","v":5000000},{"$f":"'Data Entry (efficiencies)'!X12","v":"Risk realised within budget"},{"$f":"'Data Entry (efficiencies)'!Y12","v":"Jo Larmour aware"},{"$f":"'Data Entry (efficiencies)'!Z12","v":0},{"$f":"'Data Entry (efficiencies)'!AA12","v":0},{"$f":"'Data Entry (efficiencies)'!AB12","v":0},{"$f":"'Data Entry (efficiencies)'!AC12","v":"Calculated value saved of volumn of material not being excavation and disposal of material to landfill.  This value has been calculated between the costs in the SOC and the costs in OBC"},{"$f":"'Data Entry (efficiencies)'!AE12","v":"Halcrow group Ltd"},{"$f":"'Data Entry (efficiencies)'!AF12","v":"Halcrow group Ltd"},{"$f":"'Data Entry (efficiencies)'!AG12","v":"EC Harris"},{"$f":"'Data Entry (efficiencies)'!AH12","v":"Richard Harding"},{"$f":"'Data Entry (efficiencies)'!AI12","v":"Agreed"},{"$f":"'Data Entry (efficiencies)'!#REF!","v":{"$error":"#REF!"}},{"$f":"'Data Entry (efficiencies)'!#REF!","v":{"$error":"#REF!"}}]
[4,"\\\\prodds\\shared\\SE\\Southeast\\WT_FCRM\\Environment Management\\New Projects\\Oxford\\x--06 Quality\\6.15 Efficency\\[CERT Oxford FAS 16107.xlsm]Form",{"$f":"Form!$C$11","v":42650},{"$f":"Form!$K$11","v":"Heather Taylor (EA PM)"},{"$f":"Form!$C$15","v":"Note: ppmt will pre-populate"},{"$f":"Form!$N$15","v":"Note: ppmt will pre-populate"},{"$f":"Form!$C$19","v":"Oxford Flood Alleviation Scheme"},{"$f":"Form!$Q$19","v":"THC040E/001A/007A"},{"$f":"Form!$Y$19","v":"Note: ppmt will pre-populate"},{"$f":"Form!$AG$19","v":"Note: ppmt will pre-populate"},"Environment Agency",{"$f":"Form!$N$22","v":"West Thames"},{"$f":"Form!$C$22","v":"Thames"},{"$f":"Form!$Y$22","v":"NCPMS"},{"$f":"Form!C62","v":"Capital"},{"$f":"Form!G62","v":"Hydrological and hydraulic modelling using standard industry practices"},{"$f":"Form!O62","v":"Utilise CH2M's unique global flood modelling software "},{"$f":"Form!X62","v":"Q2"},{"$f":"Form!Z62","v":0},{"$f":"Form!AB62","v":0},{"$f":"Form!AD62","v":128000},{"$f":"Form!AF62","v":0},{"$f":"Form!AH62","v":0},{"$f":"Form!AJ62","v":0},{"$f":"Form!AL62","v":0},{"$f":"'Data Entry (efficiencies)'!Q13","v":128000},{"$f":"'Data Entry (efficiencies)'!G13","v":"Innovation and value engineering"},{"$f":"'Data Entry (efficiencies)'!S13","v":"Allowed the project to get to the design solution quickier by running different options in parallel.  Softwarre want available at time of the bid and a unique piece of software to CH2M"},{"$f":"'Data Entry (efficiencies)'!T13","v":10000},{"$f":"'Data Entry (efficiencies)'!U13","v":"Q2"},{"$f":"'Data Entry (efficiencies)'!V13","v":2016},{"$f":"'Data Entry (efficiencies)'!W13","v":10000},{"$f":"'Data Entry (efficiencies)'!X13","v":"Risk realised within budget"},{"$f":"'Data Entry (efficiencies)'!Y13","v":"Jo Larmour aware"},{"$f":"'Data Entry (efficiencies)'!Z13","v":0},{"$f":"'Data Entry (efficiencies)'!AA13","v":0},{"$f":"'Data Entry (efficiencies)'!AB13","v":0},{"$f":"'Data Entry (efficiencies)'!AC13","v":"The saving on programme also equates to a saving in cost – 8 weeks of additional PM time, so conservatively £4,800. Setting everything up in Global Flood Modeller, also reduces the cost of setting up each simulation, equating to at least 15 minutes saved for each simulation run. So, we have run well over 200 simulations, saving at least another £3,000. In total, GFM has saved 8 weeks of programme time and at least £10k in costs. "},{"$f":"'Data Entry (efficiencies)'!AE13","v":"Halcrow group Ltd"},{"$f":"'Data Entry (efficiencies)'!AF13","v":"Halcrow group Ltd"},{"$f":"'Data Entry (efficiencies)'!AG13","v":"EC Harris"},{"$f":"'Data Entry (efficiencies)'!AH13","v":"Heather Taylor"},{"$f":"'Data Entry (efficiencies)'!AI13","v":"Agreed"},{"$f":"'Data Entry (efficiencies)'!#REF!","v":{"$error":"#REF!"}},{"$f":"'Data Entry (efficiencies)'!#REF!","v":{"$error":"#REF!"}}]
[5,"\\\\prodds\\shared\\SE\\Southeast\\WT_FCRM\\Environment Management\\New Projects\\Oxford\\x--06 Quality\\6.15 Efficency\\[CERT Oxford FAS 16107.xlsm]Form",{"$f":"Form!$C$11","v":42650},{"$f":"Form!$K$11","v":"Heather Taylor (EA PM)"},{"$f":"Form!$C$15","v":"Note: ppmt will pre-populate"},{"$f":"Form!$N$15","v":"Note: ppmt will pre-populate"},{"$f":"Form!$C$19","v":"Oxford Flood Alleviation Scheme"},{"$f":"Form!$Q$19","v":"THC040E/001A/007A"},{"$f":"Form!$Y$19","v":"Note: ppmt will pre-populate"},{"$f":"Form!$AG$19","v":"Note: ppmt will pre-populate"},"Environment Agency",{"$f":"Form!$N$22","v":"West Thames"},{"$f":"Form!$C$22","v":"Thames"},{"$f":"Form!$Y$22","v":"NCPMS"},{"$f":"Form!C63","v":"Capital"},{"$f":"Form!G63","v":"A Form E was required for 3 team members to secure authorisation to negotiate for third party contributions (FCRM capital projects) and to evidence the approval of third party contributions to projects for 12 investors"},{"$f":"Form!O63","v":"The project sought an agreement to submit one Form E covering all three project team members and the twelve investors. This saved the Operations Director and Area Manager needing to review and sign off 36 different documents. "},{"$f":"Form!X63","v":"Q2"},{"$f":"Form!Z63","v":0},{"$f":"Form!AB63","v":0},{"$f":"Form!AD63","v":1000},{"$f":"Form!AF63","v":0},{"$f":"Form!AH63","v":0},{"$f":"Form!AJ63","v":0},{"$f":"Form!AL63","v":0},{"$f":"'Data Entry (efficiencies)'!Q14","v":1000},{"$f":"'Data Entry (efficiencies)'!G14","v":"Streamlining"},{"$f":"'Data Entry (efficiencies)'!S14","v":"2 persons time over 2 days"},{"$f":"'Data Entry (efficiencies)'!T14","v":1000},{"$f":"'Data Entry (efficiencies)'!U14","v":"Q2"},{"$f":"'Data Entry (efficiencies)'!V14","v":42583},{"$f":"'Data Entry (efficiencies)'!W14","v":0},{"$f":"'Data Entry (efficiencies)'!X14","v":"Risk realised within budget"},{"$f":"'Data Entry (efficiencies)'!Y14","v":"Jo Larmour aware"},{"$f":"'Data Entry (efficiencies)'!Z14","v":0},{"$f":"'Data Entry (efficiencies)'!AA14","v":0},{"$f":"'Data Entry (efficiencies)'!AB14","v":0},{"$f":"'Data Entry (efficiencies)'!AC14","v":"Calculated as a staff rate, time saved"},{"$f":"'Data Entry (efficiencies)'!AE14","v":"Halcrow group Ltd"},{"$f":"'Data Entry (efficiencies)'!AF14","v":"Halcrow group Ltd"},{"$f":"'Data Entry (efficiencies)'!AG14","v":"EC Harris"},{"$f":"'Data Entry (efficiencies)'!AH14","v":"Emma Formoy"},{"$f":"'Data Entry (efficiencies)'!AI14","v":"Agreed"},{"$f":"'Data Entry (efficiencies)'!#REF!","v":{"$error":"#REF!"}},{"$f":"'Data Entry (efficiencies)'!#REF!","v":{"$error":"#REF!"}}]
[6,"\\\\prodds\\shared\\SE\\Southeast\\WT_FCRM\\Environment Management\\New Projects\\Oxford\\x--06 Quality\\6.15 Efficency\\[CERT Oxford FAS 16107.xlsm]Form",{"$f":"Form!$C$11","v":42650},{"$f":"Form!$K$11","v":"Heather Taylor (EA PM)"},{"$f":"Form!$C$15","v":"Note: ppmt will pre-populate"},{"$f":"Form!$N$15","v":"Note: ppmt will pre-populate"},{"$f":"Form!$C$19","v":"Oxford Flood Alleviation Scheme"},{"$f":"Form!$Q$19","v":"THC040E/001A/007A"},{"$f":"Form!$Y$19","v":"Note: ppmt will pre-populate"},{"$f":"Form!$AG$19","v":"Note: ppmt will pre-populate"},"Environment Agency",{"$f":"Form!$N$22","v":"West Thames"},{"$f":"Form!$C$22","v":"Thames"},{"$f":"Form!$Y$22","v":"NCPMS"},{"$f":"Form!C64","v":"Capital"},{"$f":"Form!G64","v":"OBC sign off- shorten assurance process"},{"$f":"Form!O64","v":"Original timeline for assurance process would have been adopted"},{"$f":"Form!X64","v":0},{"$f":"Form!Z64","v":0},{"$f":"Form!AB64","v":0},{"$f":"Form!AD64","v":0},{"$f":"Form!AF64","v":0},{"$f":"Form!AH64","v":0},{"$f":"Form!AJ64","v":0},{"$f":"Form!AL64","v":0},{"$f":"'Data Entry (efficiencies)'!Q15","v":""},{"$f":"'Data Entry (efficiencies)'!G15","v":"Streamlining"},{"$f":"'Data Entry (efficiencies)'!S15","v":0},{"$f":"'Data Entry (efficiencies)'!T15","v":0},{"$f":"'Data Entry (efficiencies)'!U15","v":0},{"$f":"'Data Entry (efficiencies)'!V15","v":0},{"$f":"'Data Entry (efficiencies)'!W15","v":0},{"$f":"'Data Entry (efficiencies)'!X15","v":0},{"$f":"'Data Entry (efficiencies)'!Y15","v":0},{"$f":"'Data Entry (efficiencies)'!Z15","v":0},{"$f":"'Data Entry (efficiencies)'!AA15","v":0},{"$f":"'Data Entry (efficiencies)'!AB15","v":0},{"$f":"'Data Entry (efficiencies)'!AC15","v":0},{"$f":"'Data Entry (efficiencies)'!AE15","v":0},{"$f":"'Data Entry (efficiencies)'!AF15","v":0},{"$f":"'Data Entry (efficiencies)'!AG15","v":0},{"$f":"'Data Entry (efficiencies)'!AH15","v":0},{"$f":"'Data Entry (efficiencies)'!AI15","v":0},{"$f":"'Data Entry (efficiencies)'!#REF!","v":{"$error":"#REF!"}},{"$f":"'Data Entry (efficiencies)'!#REF!","v":{"$error":"#REF!"}}]
[7,"\\\\prodds\\shared\\SE\\Southeast\\WT_FCRM\\Environment Management\\New Projects\\Oxford\\x--06 Quality\\6.15 Efficency\\[CERT Oxford FAS 16107.xlsm]Form",{"$f":"Form!$C$11","v":42650},{"$f":"Form!$K$11","v":"Heather Taylor (EA PM)"},{"$f":"Form!$C$15","v":"Note: ppmt will pre-populate"},{"$f":"Form!$N$15","v":"Note: ppmt will pre-populate"},{"$f":"Form!$C$19","v":"Oxford Flood Alleviation Scheme"},{"$f":"Form!$Q$19","v":"THC040E/001A/007A"},{"$f":"Form!$Y$19","v":"Note: ppmt will pre-populate"},{"$f":"Form!$AG$19","v":"Note: ppmt will pre-populate"},"Environment Agency",{"$f":"Form!$N$22","v":"West Thames"},{"$f":"Form!$C$22","v":"Thames"},{"$f":"Form!$Y$22","v":"NCPMS"},{"$f":"Form!C65","v":"Capital"},{"$f":"Form!G65","v":"Planning application to be submitted to the three planning authorities "},{"$f":"Form!O65","v":"In principal agreement that there wil be a single application and single determination by the Oxford County Council"},{"$f":"Form!X65","v":0},{"$f":"Form!Z65","v":0},{"$f":"Form!AB65","v":0},{"$f":"Form!AD65","v":0},{"$f":"Form!AF65","v":0},{"$f":"Form!AH65","v":0},{"$f":"Form!AJ65","v":0},{"$f":"Form!AL65","v":0},{"$f":"'Data Entry (efficiencies)'!Q16","v":""},{"$f":"'Data Entry (efficiencies)'!G16","v":"Streamlining"},{"$f":"'Data Entry (efficiencies)'!S16","v":0},{"$f":"'Data Entry (efficiencies)'!T16","v":0},{"$f":"'Data Entry (efficiencies)'!U16","v":0},{"$f":"'Data Entry (efficiencies)'!V16","v":0},{"$f":"'Data Entry (efficiencies)'!W16","v":0},{"$f":"'Data Entry (efficiencies)'!X16","v":0},{"$f":"'Data Entry (efficiencies)'!Y16","v":0},{"$f":"'Data Entry (efficiencies)'!Z16","v":0},{"$f":"'Data Entry (efficiencies)'!AA16","v":0},{"$f":"'Data Entry (efficiencies)'!AB16","v":0},{"$f":"'Data Entry (efficiencies)'!AC16","v":0},{"$f":"'Data Entry (efficiencies)'!AE16","v":0},{"$f":"'Data Entry (efficiencies)'!AF16","v":0},{"$f":"'Data Entry (efficiencies)'!AG16","v":0},{"$f":"'Data Entry (efficiencies)'!AH16","v":0},{"$f":"'Data Entry (efficiencies)'!AI16","v":0},{"$f":"'Data Entry (efficiencies)'!#REF!","v":{"$error":"#REF!"}},{"$f":"'Data Entry (efficiencies)'!#REF!","v":{"$error":"#REF!"}}]
[8,"\\\\prodds\\shared\\SE\\Southeast\\WT_FCRM\\Environment Management\\New Projects\\Oxford\\x--06 Quality\\6.15 Efficency\\[CERT Oxford FAS 16107.xlsm]Form",{"$f":"Form!$C$11","v":42650},{"$f":"Form!$K$11","v":"Heather Taylor (EA PM)"},{"$f":"Form!$C$15","v":"Note: ppmt will pre-populate"},{"$f":"Form!$N$15","v":"Note: ppmt will pre-populate"},{"$f":"Form!$C$19","v":"Oxford Flood Alleviation Scheme"},{"$f":"Form!$Q$19","v":"THC040E/001A/007A"},{"$f":"Form!$Y$19","v":"Note: ppmt will pre-populate"},{"$f":"Form!$AG$19","v":"Note: ppmt will pre-populate"},"Environment Agency",{"$f":"Form!$N$22","v":"West Thames"},{"$f":"Form!$C$22","v":"Thames"},{"$f":"Form!$Y$22","v":"NCPMS"},{"$f":"Form!C66","v":"Capital"},{"$f":"Form!G66","v":"Materials management solution"},{"$f":"Form!O66","v":0},{"$f":"Form!X66","v":0},{"$f":"Form!Z66","v":0},{"$f":"Form!AB66","v":0},{"$f":"Form!AD66","v":0},{"$f":"Form!AF66","v":0},{"$f":"Form!AH66","v":0},{"$f":"Form!AJ66","v":0},{"$f":"Form!AL66","v":0},{"$f":"'Data Entry (efficiencies)'!Q17","v":""},{"$f":"'Data Entry (efficiencies)'!G17","v":"Innovation and value engineering"},{"$f":"'Data Entry (efficiencies)'!S17","v":0},{"$f":"'Data Entry (efficiencies)'!T17","v":0},{"$f":"'Data Entry (efficiencies)'!U17","v":0},{"$f":"'Data Entry (efficiencies)'!V17","v":0},{"$f":"'Data Entry (efficiencies)'!W17","v":0},{"$f":"'Data Entry (efficiencies)'!X17","v":0},{"$f":"'Data Entry (efficiencies)'!Y17","v":0},{"$f":"'Data Entry (efficiencies)'!Z17","v":0},{"$f":"'Data Entry (efficiencies)'!AA17","v":0},{"$f":"'Data Entry (efficiencies)'!AB17","v":0},{"$f":"'Data Entry (efficiencies)'!AC17","v":0},{"$f":"'Data Entry (efficiencies)'!AE17","v":0},{"$f":"'Data Entry (efficiencies)'!AF17","v":0},{"$f":"'Data Entry (efficiencies)'!AG17","v":0},{"$f":"'Data Entry (efficiencies)'!AH17","v":0},{"$f":"'Data Entry (efficiencies)'!AI17","v":0},{"$f":"'Data Entry (efficiencies)'!#REF!","v":{"$error":"#REF!"}},{"$f":"'Data Entry (efficiencies)'!#REF!","v":{"$error":"#REF!"}}]
[9,"\\\\prodds\\shared\\SE\\Southeast\\WT_FCRM\\Environment Management\\New Projects\\Oxford\\x--06 Quality\\6.15 Efficency\\[CERT Oxford FAS 16107.xlsm]Form",{"$f":"Form!$C$11","v":42650},{"$f":"Form!$K$11","v":"Heather Taylor (EA PM)"},{"$f":"Form!$C$15","v":"Note: ppmt will pre-populate"},{"$f":"Form!$N$15","v":"Note: ppmt will pre-populate"},{"$f":"Form!$C$19","v":"Oxford Flood Alleviation Scheme"},{"$f":"Form!$Q$19","v":"THC040E/001A/007A"},{"$f":"Form!$Y$19","v":"Note: ppmt will pre-populate"},{"$f":"Form!$AG$19","v":"Note: ppmt will pre-populate"},"Environment Agency",{"$f":"Form!$N$22","v":"West Thames"},{"$f":"Form!$C$22","v":"Thames"},{"$f":"Form!$Y$22","v":"NCPMS"},{"$f":"Form!C67","v":0},{"$f":"Form!G67","v":0},{"$f":"Form!O67","v":0},{"$f":"Form!X67","v":0},{"$f":"Form!Z67","v":0},{"$f":"Form!AB67","v":0},{"$f":"Form!AD67","v":0},{"$f":"Form!AF67","v":0},{"$f":"Form!AH67","v":0},{"$f":"Form!AJ67","v":0},{"$f":"Form!AL67","v":0},{"$f":"'Data Entry (efficiencies)'!Q18","v":""},{"$f":"'Data Entry (efficiencies)'!G18","v":0},{"$f":"'Data Entry (efficiencies)'!S18","v":0},{"$f":"'Data Entry (efficiencies)'!T18","v":0},{"$f":"'Data Entry (efficiencies)'!U18","v":0},{"$f":"'Data Entry (efficiencies)'!V18","v":0},{"$f":"'Data Entry (efficiencies)'!W18","v":0},{"$f":"'Data Entry (efficiencies)'!X18","v":0},{"$f":"'Data Entry (efficiencies)'!Y18","v":0},{"$f":"'Data Entry (efficiencies)'!Z18","v":0},{"$f":"'Data Entry (efficiencies)'!AA18","v":0},{"$f":"'Data Entry (efficiencies)'!AB18","v":0},{"$f":"'Data Entry (efficiencies)'!AC18","v":0},{"$f":"'Data Entry (efficiencies)'!AE18","v":0},{"$f":"'Data Entry (efficiencies)'!AF18","v":0},{"$f":"'Data Entry (efficiencies)'!AG18","v":0},{"$f":"'Data Entry (efficiencies)'!AH18","v":0},{"$f":"'Data Entry (efficiencies)'!AI18","v":0},{"$f":"'Data Entry (efficiencies)'!#REF!","v":{"$error":"#REF!"}},{"$f":"'Data Entry (efficiencies)'!#REF!","v":{"$error":"#REF!"}}]
[10,"\\\\prodds\\shared\\SE\\Southeast\\WT_FCRM\\Environment Management\\New Projects\\Oxford\\x--06 Quality\\6.15 Efficency\\[CERT Oxford FAS 16107.xlsm]Form",{"$f":"Form!$C$11","v":42650},{"$f":"Form!$K$11","v":"Heather Taylor (EA PM)"},{"$f":"Form!$C$15","v":"Note: ppmt will pre-populate"},{"$f":"Form!$N$15","v":"Note: ppmt will pre-populate"},{"$f":"Form!$C$19","v":"Oxford Flood Alleviation Scheme"},{"$f":"Form!$Q$19","v":"THC040E/001A/007A"},{"$f":"Form!$Y$19","v":"Note: ppmt will pre-populate"},{"$f":"Form!$AG$19","v":"Note: ppmt will pre-populate"},"Environment Agency",{"$f":"Form!$N$22","v":"West Thames"},{"$f":"Form!$C$22","v":"Thames"},{"$f":"Form!$Y$22","v":"NCPMS"},{"$f":"Form!C68","v":0},{"$f":"Form!G68","v":0},{"$f":"Form!O68","v":0},{"$f":"Form!X68","v":0},{"$f":"Form!Z68","v":0},{"$f":"Form!AB68","v":0},{"$f":"Form!AD68","v":0},{"$f":"Form!AF68","v":0},{"$f":"Form!AH68","v":0},{"$f":"Form!AJ68","v":0},{"$f":"Form!AL68","v":0},{"$f":"'Data Entry (efficiencies)'!Q19","v":""},{"$f":"'Data Entry (efficiencies)'!G19","v":0},{"$f":"'Data Entry (efficiencies)'!S19","v":0},{"$f":"'Data Entry (efficiencies)'!T19","v":0},{"$f":"'Data Entry (efficiencies)'!U19","v":0},{"$f":"'Data Entry (efficiencies)'!V19","v":0},{"$f":"'Data Entry (efficiencies)'!W19","v":0},{"$f":"'Data Entry (efficiencies)'!X19","v":0},{"$f":"'Data Entry (efficiencies)'!Y19","v":0},{"$f":"'Data Entry (efficiencies)'!Z19","v":0},{"$f":"'Data Entry (efficiencies)'!AA19","v":0},{"$f":"'Data Entry (efficiencies)'!AB19","v":0},{"$f":"'Data Entry (efficiencies)'!AC19","v":0},{"$f":"'Data Entry (efficiencies)'!AE19","v":0},{"$f":"'Data Entry (efficiencies)'!AF19","v":0},{"$f":"'Data Entry (efficiencies)'!AG19","v":0},{"$f":"'Data Entry (efficiencies)'!AH19","v":0},{"$f":"'Data Entry (efficiencies)'!AI19","v":0},{"$f":"'Data Entry (efficiencies)'!#REF!","v":{"$error":"#REF!"}},{"$f":"'Data Entry (efficiencies)'!#REF!","v":{"$error":"#REF!"}}]
[11,"\\\\prodds\\shared\\SE\\Southeast\\WT_FCRM\\Environment Management\\New Projects\\Oxford\\x--06 Quality\\6.15 Efficency\\[CERT Oxford FAS 16107.xlsm]Form",{"$f":"Form!$C$11","v":42650},{"$f":"Form!$K$11","v":"Heather Taylor (EA PM)"},{"$f":"Form!$C$15","v":"Note: ppmt will pre-populate"},{"$f":"Form!$N$15","v":"Note: ppmt will pre-populate"},{"$f":"Form!$C$19","v":"Oxford Flood Alleviation Scheme"},{"$f":"Form!$Q$19","v":"THC040E/001A/007A"},{"$f":"Form!$Y$19","v":"Note: ppmt will pre-populate"},{"$f":"Form!$AG$19","v":"Note: ppmt will pre-populate"},"Environment Agency",{"$f":"Form!$N$22","v":"West Thames"},{"$f":"Form!$C$22","v":"Thames"},{"$f":"Form!$Y$22","v":"NCPMS"},{"$f":"Form!C69","v":0},{"$f":"Form!G69","v":0},{"$f":"Form!O69","v":0},{"$f":"Form!X69","v":0},{"$f":"Form!Z69","v":0},{"$f":"Form!AB69","v":0},{"$f":"Form!AD69","v":0},{"$f":"Form!AF69","v":0},{"$f":"Form!AH69","v":0},{"$f":"Form!AJ69","v":0},{"$f":"Form!AL69","v":0},{"$f":"'Data Entry (efficiencies)'!Q20","v":""},{"$f":"'Data Entry (efficiencies)'!G20","v":0},{"$f":"'Data Entry (efficiencies)'!S20","v":0},{"$f":"'Data Entry (efficiencies)'!T20","v":0},{"$f":"'Data Entry (efficiencies)'!U20","v":0},{"$f":"'Data Entry (efficiencies)'!V20","v":0},{"$f":"'Data Entry (efficiencies)'!W20","v":0},{"$f":"'Data Entry (efficiencies)'!X20","v":0},{"$f":"'Data Entry (efficiencies)'!Y20","v":0},{"$f":"'Data Entry (efficiencies)'!Z20","v":0},{"$f":"'Data Entry (efficiencies)'!AA20","v":0},{"$f":"'Data Entry (efficiencies)'!AB20","v":0},{"$f":"'Data Entry (efficiencies)'!AC20","v":0},{"$f":"'Data Entry (efficiencies)'!AE20","v":0},{"$f":"'Data Entry (efficiencies)'!AF20","v":0},{"$f":"'Data Entry (efficiencies)'!AG20","v":0},{"$f":"'Data Entry (efficiencies)'!AH20","v":0},{"$f":"'Data Entry (efficiencies)'!AI20","v":0},{"$f":"'Data Entry (efficiencies)'!#REF!","v":{"$error":"#REF!"}},{"$f":"'Data Entry (efficiencies)'!#REF!","v":{"$error":"#REF!"}}]
[12,"\\\\prodds\\shared\\SE\\Southeast\\WT_FCRM\\Environment Management\\New Projects\\Oxford\\x--06 Quality\\6.15 Efficency\\[CERT Oxford FAS 16107.xlsm]Form",{"$f":"Form!$C$11","v":42650},{"$f":"Form!$K$11","v":"Heather Taylor (EA PM)"},{"$f":"Form!$C$15","v":"Note: ppmt will pre-populate"},{"$f":"Form!$N$15","v":"Note: ppmt will pre-populate"},{"$f":"Form!$C$19","v":"Oxford Flood Alleviation Scheme"},{"$f":"Form!$Q$19","v":"THC040E/001A/007A"},{"$f":"Form!$Y$19","v":"Note: ppmt will pre-populate"},{"$f":"Form!$AG$19","v":"Note: ppmt will pre-populate"},"Environment Agency",{"$f":"Form!$N$22","v":"West Thames"},{"$f":"Form!$C$22","v":"Thames"},{"$f":"Form!$Y$22","v":"NCPMS"},{"$f":"Form!C70","v":0},{"$f":"Form!G70","v":0},{"$f":"Form!O70","v":0},{"$f":"Form!X70","v":0},{"$f":"Form!Z70","v":0},{"$f":"Form!AB70","v":0},{"$f":"Form!AD70","v":0},{"$f":"Form!AF70","v":0},{"$f":"Form!AH70","v":0},{"$f":"Form!AJ70","v":0},{"$f":"Form!AL70","v":0},{"$f":"'Data Entry (efficiencies)'!Q21","v":""},{"$f":"'Data Entry (efficiencies)'!G21","v":0},{"$f":"'Data Entry (efficiencies)'!S21","v":0},{"$f":"'Data Entry (efficiencies)'!T21","v":0},{"$f":"'Data Entry (efficiencies)'!U21","v":0},{"$f":"'Data Entry (efficiencies)'!V21","v":0},{"$f":"'Data Entry (efficiencies)'!W21","v":0},{"$f":"'Data Entry (efficiencies)'!X21","v":0},{"$f":"'Data Entry (efficiencies)'!Y21","v":0},{"$f":"'Data Entry (efficiencies)'!Z21","v":0},{"$f":"'Data Entry (efficiencies)'!AA21","v":0},{"$f":"'Data Entry (efficiencies)'!AB21","v":0},{"$f":"'Data Entry (efficiencies)'!AC21","v":0},{"$f":"'Data Entry (efficiencies)'!AE21","v":0},{"$f":"'Data Entry (efficiencies)'!AF21","v":0},{"$f":"'Data Entry (efficiencies)'!AG21","v":0},{"$f":"'Data Entry (efficiencies)'!AH21","v":0},{"$f":"'Data Entry (efficiencies)'!AI21","v":0},{"$f":"'Data Entry (efficiencies)'!#REF!","v":{"$error":"#REF!"}},{"$f":"'Data Entry (efficiencies)'!#REF!","v":{"$error":"#REF!"}}]
[13,"\\\\prodds\\shared\\SE\\Southeast\\WT_FCRM\\Environment Management\\New Projects\\Oxford\\x--06 Quality\\6.15 Efficency\\[CERT Oxford FAS 16107.xlsm]Form",{"$f":"Form!$C$11","v":42650},{"$f":"Form!$K$11","v":"Heather Taylor (EA PM)"},{"$f":"Form!$C$15","v":"Note: ppmt will pre-populate"},{"$f":"Form!$N$15","v":"Note: ppmt will pre-populate"},{"$f":"Form!$C$19","v":"Oxford Flood Alleviation Scheme"},{"$f":"Form!$Q$19","v":"THC040E/001A/007A"},{"$f":"Form!$Y$19","v":"Note: ppmt will pre-populate"},{"$f":"Form!$AG$19","v":"Note: ppmt will pre-populate"},"Environment Agency",{"$f":"Form!$N$22","v":"West Thames"},{"$f":"Form!$C$22","v":"Thames"},{"$f":"Form!$Y$22","v":"NCPMS"},{"$f":"Form!C71","v":0},{"$f":"Form!G71","v":0},{"$f":"Form!O71","v":0},{"$f":"Form!X71","v":0},{"$f":"Form!Z71","v":0},{"$f":"Form!AB71","v":0},{"$f":"Form!AD71","v":0},{"$f":"Form!AF71","v":0},{"$f":"Form!AH71","v":0},{"$f":"Form!AJ71","v":0},{"$f":"Form!AL71","v":0},{"$f":"'Data Entry (efficiencies)'!Q22","v":""},{"$f":"'Data Entry (efficiencies)'!G22","v":0},{"$f":"'Data Entry (efficiencies)'!S22","v":0},{"$f":"'Data Entry (efficiencies)'!T22","v":0},{"$f":"'Data Entry (efficiencies)'!U22","v":0},{"$f":"'Data Entry (efficiencies)'!V22","v":0},{"$f":"'Data Entry (efficiencies)'!W22","v":0},{"$f":"'Data Entry (efficiencies)'!X22","v":0},{"$f":"'Data Entry (efficiencies)'!Y22","v":0},{"$f":"'Data Entry (efficiencies)'!Z22","v":0},{"$f":"'Data Entry (efficiencies)'!AA22","v":0},{"$f":"'Data Entry (efficiencies)'!AB22","v":0},{"$f":"'Data Entry (efficiencies)'!AC22","v":0},{"$f":"'Data Entry (efficiencies)'!AE22","v":0},{"$f":"'Data Entry (efficiencies)'!AF22","v":0},{"$f":"'Data Entry (efficiencies)'!AG22","v":0},{"$f":"'Data Entry (efficiencies)'!AH22","v":0},{"$f":"'Data Entry (efficiencies)'!AI22","v":0},{"$f":"'Data Entry (efficiencies)'!#REF!","v":{"$error":"#REF!"}},{"$f":"'Data Entry (efficiencies)'!#REF!","v":{"$error":"#REF!"}}]
[14,"\\\\prodds\\shared\\SE\\Southeast\\WT_FCRM\\Environment Management\\New Projects\\Oxford\\x--06 Quality\\6.15 Efficency\\[CERT Oxford FAS 16107.xlsm]Form",{"$f":"Form!$C$11","v":42650},{"$f":"Form!$K$11","v":"Heather Taylor (EA PM)"},{"$f":"Form!$C$15","v":"Note: ppmt will pre-populate"},{"$f":"Form!$N$15","v":"Note: ppmt will pre-populate"},{"$f":"Form!$C$19","v":"Oxford Flood Alleviation Scheme"},{"$f":"Form!$Q$19","v":"THC040E/001A/007A"},{"$f":"Form!$Y$19","v":"Note: ppmt will pre-populate"},{"$f":"Form!$AG$19","v":"Note: ppmt will pre-populate"},"Environment Agency",{"$f":"Form!$N$22","v":"West Thames"},{"$f":"Form!$C$22","v":"Thames"},{"$f":"Form!$Y$22","v":"NCPMS"},{"$f":"Form!C72","v":0},{"$f":"Form!G72","v":0},{"$f":"Form!O72","v":0},{"$f":"Form!X72","v":0},{"$f":"Form!Z72","v":0},{"$f":"Form!AB72","v":0},{"$f":"Form!AD72","v":0},{"$f":"Form!AF72","v":0},{"$f":"Form!AH72","v":0},{"$f":"Form!AJ72","v":0},{"$f":"Form!AL72","v":0},{"$f":"'Data Entry (efficiencies)'!Q23","v":""},{"$f":"'Data Entry (efficiencies)'!G23","v":0},{"$f":"'Data Entry (efficiencies)'!S23","v":0},{"$f":"'Data Entry (efficiencies)'!T23","v":0},{"$f":"'Data Entry (efficiencies)'!U23","v":0},{"$f":"'Data Entry (efficiencies)'!V23","v":0},{"$f":"'Data Entry (efficiencies)'!W23","v":0},{"$f":"'Data Entry (efficiencies)'!X23","v":0},{"$f":"'Data Entry (efficiencies)'!Y23","v":0},{"$f":"'Data Entry (efficiencies)'!Z23","v":0},{"$f":"'Data Entry (efficiencies)'!AA23","v":0},{"$f":"'Data Entry (efficiencies)'!AB23","v":0},{"$f":"'Data Entry (efficiencies)'!AC23","v":0},{"$f":"'Data Entry (efficiencies)'!AE23","v":0},{"$f":"'Data Entry (efficiencies)'!AF23","v":0},{"$f":"'Data Entry (efficiencies)'!AG23","v":0},{"$f":"'Data Entry (efficiencies)'!AH23","v":0},{"$f":"'Data Entry (efficiencies)'!AI23","v":0},{"$f":"'Data Entry (efficiencies)'!#REF!","v":{"$error":"#REF!"}},{"$f":"'Data Entry (efficiencies)'!#REF!","v":{"$error":"#REF!"}}]
[15,"\\\\prodds\\shared\\SE\\Southeast\\WT_FCRM\\Environment Management\\New Projects\\Oxford\\x--06 Quality\\6.15 Efficency\\[CERT Oxford FAS 16107.xlsm]Form",{"$f":"Form!$C$11","v":42650},{"$f":"Form!$K$11","v":"Heather Taylor (EA PM)"},{"$f":"Form!$C$15","v":"Note: ppmt will pre-populate"},{"$f":"Form!$N$15","v":"Note: ppmt will pre-populate"},{"$f":"Form!$C$19","v":"Oxford Flood Alleviation Scheme"},{"$f":"Form!$Q$19","v":"THC040E/001A/007A"},{"$f":"Form!$Y$19","v":"Note: ppmt will pre-populate"},{"$f":"Form!$AG$19","v":"Note: ppmt will pre-populate"},"Environment Agency",{"$f":"Form!$N$22","v":"West Thames"},{"$f":"Form!$C$22","v":"Thames"},{"$f":"Form!$Y$22","v":"NCPMS"},{"$f":"Form!C73","v":0},{"$f":"Form!G73","v":0},{"$f":"Form!O73","v":0},{"$f":"Form!X73","v":0},{"$f":"Form!Z73","v":0},{"$f":"Form!AB73","v":0},{"$f":"Form!AD73","v":0},{"$f":"Form!AF73","v":0},{"$f":"Form!AH73","v":0},{"$f":"Form!AJ73","v":0},{"$f":"Form!AL73","v":0},{"$f":"'Data Entry (efficiencies)'!Q24","v":""},{"$f":"'Data Entry (efficiencies)'!G24","v":0},{"$f":"'Data Entry (efficiencies)'!S24","v":0},{"$f":"'Data Entry (efficiencies)'!T24","v":0},{"$f":"'Data Entry (efficiencies)'!U24","v":0},{"$f":"'Data Entry (efficiencies)'!V24","v":0},{"$f":"'Data Entry (efficiencies)'!W24","v":0},{"$f":"'Data Entry (efficiencies)'!X24","v":0},{"$f":"'Data Entry (efficiencies)'!Y24","v":0},{"$f":"'Data Entry (efficiencies)'!Z24","v":0},{"$f":"'Data Entry (efficiencies)'!AA24","v":0},{"$f":"'Data Entry (efficiencies)'!AB24","v":0},{"$f":"'Data Entry (efficiencies)'!AC24","v":0},{"$f":"'Data Entry (efficiencies)'!AE24","v":0},{"$f":"'Data Entry (efficiencies)'!AF24","v":0},{"$f":"'Data Entry (efficiencies)'!AG24","v":0},{"$f":"'Data Entry (efficiencies)'!AH24","v":0},{"$f":"'Data Entry (efficiencies)'!AI24","v":0},{"$f":"'Data Entry (efficiencies)'!#REF!","v":{"$error":"#REF!"}},{"$f":"'Data Entry (efficiencies)'!#REF!","v":{"$error":"#REF!"}}]
[16,"\\\\prodds\\shared\\SE\\Southeast\\WT_FCRM\\Environment Management\\New Projects\\Oxford\\x--06 Quality\\6.15 Efficency\\[CERT Oxford FAS 16107.xlsm]Form",{"$f":"Form!$C$11","v":42650},{"$f":"Form!$K$11","v":"Heather Taylor (EA PM)"},{"$f":"Form!$C$15","v":"Note: ppmt will pre-populate"},{"$f":"Form!$N$15","v":"Note: ppmt will pre-populate"},{"$f":"Form!$C$19","v":"Oxford Flood Alleviation Scheme"},{"$f":"Form!$Q$19","v":"THC040E/001A/007A"},{"$f":"Form!$Y$19","v":"Note: ppmt will pre-populate"},{"$f":"Form!$AG$19","v":"Note: ppmt will pre-populate"},"Environment Agency",{"$f":"Form!$N$22","v":"West Thames"},{"$f":"Form!$C$22","v":"Thames"},{"$f":"Form!$Y$22","v":"NCPMS"},{"$f":"Form!C74","v":0},{"$f":"Form!G74","v":0},{"$f":"Form!O74","v":0},{"$f":"Form!X74","v":0},{"$f":"Form!Z74","v":0},{"$f":"Form!AB74","v":0},{"$f":"Form!AD74","v":0},{"$f":"Form!AF74","v":0},{"$f":"Form!AH74","v":0},{"$f":"Form!AJ74","v":0},{"$f":"Form!AL74","v":0},{"$f":"'Data Entry (efficiencies)'!Q25","v":""},{"$f":"'Data Entry (efficiencies)'!G25","v":0},{"$f":"'Data Entry (efficiencies)'!S25","v":0},{"$f":"'Data Entry (efficiencies)'!T25","v":0},{"$f":"'Data Entry (efficiencies)'!U25","v":0},{"$f":"'Data Entry (efficiencies)'!V25","v":0},{"$f":"'Data Entry (efficiencies)'!W25","v":0},{"$f":"'Data Entry (efficiencies)'!X25","v":0},{"$f":"'Data Entry (efficiencies)'!Y25","v":0},{"$f":"'Data Entry (efficiencies)'!Z25","v":0},{"$f":"'Data Entry (efficiencies)'!AA25","v":0},{"$f":"'Data Entry (efficiencies)'!AB25","v":0},{"$f":"'Data Entry (efficiencies)'!AC25","v":0},{"$f":"'Data Entry (efficiencies)'!AE25","v":0},{"$f":"'Data Entry (efficiencies)'!AF25","v":0},{"$f":"'Data Entry (efficiencies)'!AG25","v":0},{"$f":"'Data Entry (efficiencies)'!AH25","v":0},{"$f":"'Data Entry (efficiencies)'!AI25","v":0},{"$f":"'Data Entry (efficiencies)'!#REF!","v":{"$error":"#REF!"}},{"$f":"'Data Entry (efficiencies)'!#REF!","v":{"$error":"#REF!"}}]
[17,"\\\\prodds\\shared\\SE\\Southeast\\WT_FCRM\\Environment Management\\New Projects\\Oxford\\x--06 Quality\\6.15 Efficency\\[CERT Oxford FAS 16107.xlsm]Form",{"$f":"Form!$C$11","v":42650},{"$f":"Form!$K$11","v":"Heather Taylor (EA PM)"},{"$f":"Form!$C$15","v":"Note: ppmt will pre-populate"},{"$f":"Form!$N$15","v":"Note: ppmt will pre-populate"},{"$f":"Form!$C$19","v":"Oxford Flood Alleviation Scheme"},{"$f":"Form!$Q$19","v":"THC040E/001A/007A"},{"$f":"Form!$Y$19","v":"Note: ppmt will pre-populate"},{"$f":"Form!$AG$19","v":"Note: ppmt will pre-populate"},"Environment Agency",{"$f":"Form!$N$22","v":"West Thames"},{"$f":"Form!$C$22","v":"Thames"},{"$f":"Form!$Y$22","v":"NCPMS"},{"$f":"Form!C85","v":0},{"$f":"Form!G85","v":0},{"$f":"Form!O85","v":0},{"$f":"Form!X85","v":0},{"$f":"Form!Z85","v":0},{"$f":"Form!AB85","v":0},{"$f":"Form!AD85","v":0},{"$f":"Form!AF85","v":0},{"$f":"Form!AH85","v":0},{"$f":"Form!AJ85","v":0},{"$f":"Form!AL85","v":0},{"$f":"'Data Entry (efficiencies)'!Q36","v":""},{"$f":"'Data Entry (efficiencies)'!G36","v":0},{"$f":"'Data Entry (efficiencies)'!S36","v":0},{"$f":"'Data Entry (efficiencies)'!T36","v":0},{"$f":"'Data Entry (efficiencies)'!U36","v":0},{"$f":"'Data Entry (efficiencies)'!V36","v":0},{"$f":"'Data Entry (efficiencies)'!W36","v":0},{"$f":"'Data Entry (efficiencies)'!X36","v":0},{"$f":"'Data Entry (efficiencies)'!Y36","v":0},{"$f":"'Data Entry (efficiencies)'!Z36","v":0},{"$f":"'Data Entry (efficiencies)'!AA36","v":0},{"$f":"'Data Entry (efficiencies)'!AB36","v":0},{"$f":"'Data Entry (efficiencies)'!AC36","v":0},{"$f":"'Data Entry (efficiencies)'!AE36","v":0},{"$f":"'Data Entry (efficiencies)'!AF36","v":0},{"$f":"'Data Entry (efficiencies)'!AG36","v":0},{"$f":"'Data Entry (efficiencies)'!AH36","v":0},{"$f":"'Data Entry (efficiencies)'!AI36","v":0},{"$f":"'Data Entry (efficiencies)'!#REF!","v":{"$error":"#REF!"}},{"$f":"'Data Entry (efficiencies)'!#REF!","v":{"$error":"#REF!"}}]
[18,"\\\\prodds\\shared\\SE\\Southeast\\WT_FCRM\\Environment Management\\New Projects\\Oxford\\x--06 Quality\\6.15 Efficency\\[CERT Oxford FAS 16107.xlsm]Form",{"$f":"Form!$C$11","v":42650},{"$f":"Form!$K$11","v":"Heather Taylor (EA PM)"},{"$f":"Form!$C$15","v":"Note: ppmt will pre-populate"},{"$f":"Form!$N$15","v":"Note: ppmt will pre-populate"},{"$f":"Form!$C$19","v":"Oxford Flood Alleviation Scheme"},{"$f":"Form!$Q$19","v":"THC040E/001A/007A"},{"$f":"Form!$Y$19","v":"Note: ppmt will pre-populate"},{"$f":"Form!$AG$19","v":"Note: ppmt will pre-populate"},"Environment Agency",{"$f":"Form!$N$22","v":"West Thames"},{"$f":"Form!$C$22","v":"Thames"},{"$f":"Form!$Y$22","v":"NCPMS"},{"$f":"Form!C86","v":0},{"$f":"Form!G86","v":0},{"$f":"Form!O86","v":0},{"$f":"Form!X86","v":0},{"$f":"Form!Z86","v":0},{"$f":"Form!AB86","v":0},{"$f":"Form!AD86","v":0},{"$f":"Form!AF86","v":0},{"$f":"Form!AH86","v":0},{"$f":"Form!AJ86","v":0},{"$f":"Form!AL86","v":0},{"$f":"'Data Entry (efficiencies)'!Q37","v":""},{"$f":"'Data Entry (efficiencies)'!G37","v":0},{"$f":"'Data Entry (efficiencies)'!S37","v":0},{"$f":"'Data Entry (efficiencies)'!T37","v":0},{"$f":"'Data Entry (efficiencies)'!U37","v":0},{"$f":"'Data Entry (efficiencies)'!V37","v":0},{"$f":"'Data Entry (efficiencies)'!W37","v":0},{"$f":"'Data Entry (efficiencies)'!X37","v":0},{"$f":"'Data Entry (efficiencies)'!Y37","v":0},{"$f":"'Data Entry (efficiencies)'!Z37","v":0},{"$f":"'Data Entry (efficiencies)'!AA37","v":0},{"$f":"'Data Entry (efficiencies)'!AB37","v":0},{"$f":"'Data Entry (efficiencies)'!AC37","v":0},{"$f":"'Data Entry (efficiencies)'!AE37","v":0},{"$f":"'Data Entry (efficiencies)'!AF37","v":0},{"$f":"'Data Entry (efficiencies)'!AG37","v":0},{"$f":"'Data Entry (efficiencies)'!AH37","v":0},{"$f":"'Data Entry (efficiencies)'!AI37","v":0},{"$f":"'Data Entry (efficiencies)'!#REF!","v":{"$error":"#REF!"}},{"$f":"'Data Entry (efficiencies)'!#REF!","v":{"$error":"#REF!"}}]
[19,"\\\\prodds\\shared\\SE\\Southeast\\WT_FCRM\\Environment Management\\New Projects\\Oxford\\x--06 Quality\\6.15 Efficency\\[CERT Oxford FAS 16107.xlsm]Form",{"$f":"Form!$C$11","v":42650},{"$f":"Form!$K$11","v":"Heather Taylor (EA PM)"},{"$f":"Form!$C$15","v":"Note: ppmt will pre-populate"},{"$f":"Form!$N$15","v":"Note: ppmt will pre-populate"},{"$f":"Form!$C$19","v":"Oxford Flood Alleviation Scheme"},{"$f":"Form!$Q$19","v":"THC040E/001A/007A"},{"$f":"Form!$Y$19","v":"Note: ppmt will pre-populate"},{"$f":"Form!$AG$19","v":"Note: ppmt will pre-populate"},"Environment Agency",{"$f":"Form!$N$22","v":"West Thames"},{"$f":"Form!$C$22","v":"Thames"},{"$f":"Form!$Y$22","v":"NCPMS"},{"$f":"Form!C87","v":0},{"$f":"Form!G87","v":0},{"$f":"Form!O87","v":0},{"$f":"Form!X87","v":0},{"$f":"Form!Z87","v":0},{"$f":"Form!AB87","v":0},{"$f":"Form!AD87","v":0},{"$f":"Form!AF87","v":0},{"$f":"Form!AH87","v":0},{"$f":"Form!AJ87","v":0},{"$f":"Form!AL87","v":0},{"$f":"'Data Entry (efficiencies)'!Q38","v":""},{"$f":"'Data Entry (efficiencies)'!G38","v":0},{"$f":"'Data Entry (efficiencies)'!S38","v":0},{"$f":"'Data Entry (efficiencies)'!T38","v":0},{"$f":"'Data Entry (efficiencies)'!U38","v":0},{"$f":"'Data Entry (efficiencies)'!V38","v":0},{"$f":"'Data Entry (efficiencies)'!W38","v":0},{"$f":"'Data Entry (efficiencies)'!X38","v":0},{"$f":"'Data Entry (efficiencies)'!Y38","v":0},{"$f":"'Data Entry (efficiencies)'!Z38","v":0},{"$f":"'Data Entry (efficiencies)'!AA38","v":0},{"$f":"'Data Entry (efficiencies)'!AB38","v":0},{"$f":"'Data Entry (efficiencies)'!AC38","v":0},{"$f":"'Data Entry (efficiencies)'!AE38","v":0},{"$f":"'Data Entry (efficiencies)'!AF38","v":0},{"$f":"'Data Entry (efficiencies)'!AG38","v":0},{"$f":"'Data Entry (efficiencies)'!AH38","v":0},{"$f":"'Data Entry (efficiencies)'!AI38","v":0},{"$f":"'Data Entry (efficiencies)'!#REF!","v":{"$error":"#REF!"}},{"$f":"'Data Entry (efficiencies)'!#REF!","v":{"$error":"#REF!"}}]
[20,"\\\\prodds\\shared\\SE\\Southeast\\WT_FCRM\\Environment Management\\New Projects\\Oxford\\x--06 Quality\\6.15 Efficency\\[CERT Oxford FAS 16107.xlsm]Form",{"$f":"Form!$C$11","v":42650},{"$f":"Form!$K$11","v":"Heather Taylor (EA PM)"},{"$f":"Form!$C$15","v":"Note: ppmt will pre-populate"},{"$f":"Form!$N$15","v":"Note: ppmt will pre-populate"},{"$f":"Form!$C$19","v":"Oxford Flood Alleviation Scheme"},{"$f":"Form!$Q$19","v":"THC040E/001A/007A"},{"$f":"Form!$Y$19","v":"Note: ppmt will pre-populate"},{"$f":"Form!$AG$19","v":"Note: ppmt will pre-populate"},"Environment Agency",{"$f":"Form!$N$22","v":"West Thames"},{"$f":"Form!$C$22","v":"Thames"},{"$f":"Form!$Y$22","v":"NCPMS"},{"$f":"Form!C108","v":0},{"$f":"Form!G108","v":0},{"$f":"Form!O108","v":0},{"$f":"Form!X108","v":0},{"$f":"Form!Z108","v":0},{"$f":"Form!AB108","v":0},{"$f":"Form!AD108","v":0},{"$f":"Form!AF108","v":0},{"$f":"Form!AH108","v":0},{"$f":"Form!AJ108","v":0},{"$f":"Form!AL108","v":0},{"$f":"'Data Entry (efficiencies)'!Q59","v":""},{"$f":"'Data Entry (efficiencies)'!G59","v":0},{"$f":"'Data Entry (efficiencies)'!S59","v":0},{"$f":"'Data Entry (efficiencies)'!T59","v":0},{"$f":"'Data Entry (efficiencies)'!U59","v":0},{"$f":"'Data Entry (efficiencies)'!V59","v":0},{"$f":"'Data Entry (efficiencies)'!W59","v":0},{"$f":"'Data Entry (efficiencies)'!X59","v":0},{"$f":"'Data Entry (efficiencies)'!Y59","v":0},{"$f":"'Data Entry (efficiencies)'!Z59","v":0},{"$f":"'Data Entry (efficiencies)'!AA59","v":0},{"$f":"'Data Entry (efficiencies)'!AB59","v":0},{"$f":"'Data Entry (efficiencies)'!AC59","v":0},{"$f":"'Data Entry (efficiencies)'!AE59","v":0},{"$f":"'Data Entry (efficiencies)'!AF59","v":0},{"$f":"'Data Entry (efficiencies)'!AG59","v":0},{"$f":"'Data Entry (efficiencies)'!AH59","v":0},{"$f":"'Data Entry (efficiencies)'!AI59","v":0},{"$f":"'Data Entry (efficiencies)'!#REF!","v":{"$error":"#REF!"}},{"$f":"'Data Entry (efficiencies)'!#REF!","v":{"$error":"#REF!"}}]

{"sheet":"Sheet1","index":5,"n_rows":3217,"n_cols":125,"rows_kept":3217,"cut":false,"hidden":false,"merged":[]}
["npn","project","area","rfcc","delivery","B1","B2","B3","B4","B5","B6","B7","B8","B9","B10","B11","B12","B13","B14","B15","B16","B17","B18","B19","B20","B21","B22","B23","B24","B25","B26","B27","B28","B29","B30","D1","D2","D3","D4","D5","D6","D7","D8","D9","D10","D11","D12","D13","D14","D15","D16","D17","D18","D19","D20","D21","D22","D23","D24","D25","D26","D27","D28","D29","D30","F1","F2","F3","F4","F5","F6","F7","F8","F9","F10","F11","F12","F13","F14","F15","F16","F17","F18","F19","F20","F21","F22","F23","F24","F25","F26","F27","F28","F29","F30","A1","A2","A3","A4","A5","A6","A7","A8","A9","A10","A11","A12","A13","A14","A15","A16","A17","A18","A19","A20","A21","A22","A23","A24","A25","A26","A27","A28","A29","A30"]
["WXC007E/000A/194A","Cannington FDS","Wessex",null,"NCPMS","Highways specification roadbridges designed for landowners"," Standard hydrogeomorphological assessment of channel sedimentation",null,null,null,null,null,null,null,null,null,null,null,null,null,null,null,null,null,null,null,null,null,null,null,null,null,null,null,null,"Access ramps used in place of road bridge"," Hydraulic design specifically focuses on the reduction of sedimentation within channel",null,null,null,null,null,null,null,null,null,null,null,null,null,null,null,null,null,null,null,null,null,null,null,null,null,null,null,null,100000,25000,null,null,null,null,null,null,null,null,null,null,null,null,null,null,null,null,null,null,null,null,null,null,null,null,null,null,null,null,0," "]
["WXS004E/001A/009A","CONGRESBURY YEO TIDAL BANKS","Wessex",null,"NCPMS","Win Spoil for new embankment construction from locally situated borrow pits rather than import. Negotiations in an advanced stage of completion."," Separate progress meetings",null,null,null,null,null,null,null,null,null,null,null,null,null,null,null,null,null,null,null,null,null,null,null,null,null,null,null,null,0," Combined project progress meetings for Cannington and Congresbury Yeo",null,null,null,null,null,null,null,null,null,null,null,null,null,null,null,null,null,null,null,null,null,null,null,null,null,null,null,null,473975,750,null,null,null,null,null,null,null,null,null,null,null,null,null,null,null,null,null,null,null,null,null,null,null,null,null,null,null,null,0," "]
["SWC013E/000A/082A","Dawlish Warren & Exmouth Beach Management Scheme","Devon and Cornwall",null,"NCPMS","Undertake the Appraisal Stage and then do a competetion for the Detailed Design after PAR (end 2014)",null,null,null,null,null,null,null,null,null,null,null,null,null,null,null,null,null,null,null,null,null,null,null,null,null,null,null,null,null,"Addition of detailed design consultancy services to appraisal scope presents option to avoid need for further competition post-PAR",null,null,null,null,null,null,null,null,null,null,null,null,null,null,null,null,null,null,null,null,null,null,null,null,null,null,null,null,null,15000,null,null,null,null,null,null,null,null,null,null,null,null,null,null,null,null,null,null,null,null,null,null,null,null,null,null,null,null,null,0]
["SWC013E/000A/016A","Exeter FDS","Devon and Cornwall",null,"NCPMS","Phase 1 - Tender - contractor priced dewatering using traditional dams and dewatering methods"," Site clearance at d/s check weir (vegetation). "," Traditional wooden cladding fixings"," Stop logs in Trews Weir fish pass to allow maintenance of fish pass"," Trews Weir fish pass - mass concrete infill to voids to enable construction and sup[port existing quay wall"," Reduce level of weir and recast new crest blocks"," Safety piles used to secure the boom structure"," Fish pass to be located upstream of existing side spill weir"," Stainless steel larinier baffles & lamprey plates"," Eel pass designed to EA standards"," Traditional timber cladding to Trews Fish Pass and Side Spill Weir fish pass for aesthetic purpose as in middle of city"," Channel vehicle causeway - designed using EA standards"," Channel Pedestrian Causeway - designed using EA standards"," Gateman on Bridge Road to ensure safe access and exit from main road",null,null,null,null,null,null,null,null,null,null,null,null,null,null,null,null,"Used VE idea from Bam Nuttall (not successful contractor) to use Portadam products which are cheaper to use quicker to install more robust in flooding occurrences and are less risk re: H&S and working in a live  river - TVO to investigate further"," Re-use of the existing wetland plants in new planned wetland areas (avoids possible new purchases)"," Change to stainless steel Halfen channels and bolts (alternative product) - identified as VE by BAM Nuttall in the tender process - TVO to investigate further"," Identified alternative  methodology that allows for the fish pass to be  isolated and maintenance undertaken. Stop logs no longer required"," Use lean mix infill capped with structural concrete. Change geometry of fish pass to reduce plan area of structure whilst maintaining width of rest pool - Halcrow to redesign geometry"," Reuse existing coping blocks if possible. TVO to investigate on site by removing one block and seeing if achievable"," Remove safety piles and secure using cleats and vertical rails welded to existing structures"," VE from Lot 4 Tender (TVO) - construct side spill fish pass within the stilling basin. Reduces temporary works and complexity of construction"," Using Galvanised Steel. Agreed by team as over designed and hence not claimable VE. Cost saving c. £20000"," VE from Lot 4 Tender (TVO)- There are tight constraints with electricity cable in the river that have resulted in some complex geometry to he current design. Considering structure mounted solution rather than insitu concrete structure"," VE from Lot 4 Tender (TVO) - remove cladding and replace with rough sawn wood as will have same appearance from distance (cannot be seen up close due to location and view from opposite side of the river) - TVO to progress"," VE from Lot 4 Tender (TVO) - simplification of design incl: reduction of culverts removal of Trief kerbs trench sheets as toe of low flow channel - TVO to investigate"," VE from Lot 4 Tender (TVO) - reduce size of piles to allow smaller installation plant and cost savings and programme reduction - Halcrow to reconsider design of Piles"," Contractor using convoy system and the driver to open and close bridge road gate -",null,null,null,null,null,null,null,null,null,null,null,null,null,null,null,null,0,2000,1000,5000,25000,50000,25000,205000,null,20000,10000,20000,5000,32500,null,null,null,null,null,null,null,null,null,null,null,null,null,null,null,null,0," "," "," "," "," "," "," "," "," "," "," "," "," "]
["WXC001E/000A/033A","Swanage FSR No. 1 Embankment Failure","Wessex",null,"NCPMS","Drain design to be sand"," Provide drainage for ponding at NW end of bank."," Install bends at each vertical drai n pipe into toe drain. ",null,null,null,null,null,null,null,null,null,null,null,null,null,null,null,null,null,null,null,null,null,null,null,null,null,null,null,"VE proposed drain design – replace sand with pea gravel "," Omit drain & remould ground using excavated material unsuitable for bank repair. "," Omit bends & reconfigure discharge to toe drain.",null,null,null,null,null,null,null,null,null,null,null,null,null,null,null,null,null,null,null,null,null,null,null,null,null,null,null,10000,5000,5000,null,null,null,null,null,null,null,null,null,null,null,null,null,null,null,null,null,null,null,null,null,null,null,null,null,null,null,0," "," "]
["THC001A/000E/005A","Wick FAS","Wessex",null,"NCPMS","dowels in the wall stem extension"," dowels and mass concrete shear key for the existing wall foundation"," embankment keyed into existing ground"," benching of the existing embankment"," embankment alignment"," embankments etc formed from imported fill",null,null,null,null,null,null,null,null,null,null,null,null,null,null,null,null,null,null,null,null,null,null,null,null,"delete proposed dowels"," delete the proposed dowels and the proposed mass concrete shear key"," delete the embankment key"," delete the benching "," realign the embankment to take advantage of high ground (reducing import) "," hope to be winning material from the scrapes and ponds (reducing imported fill)",null,null,null,null,null,null,null,null,null,null,null,null,null,null,null,null,null,null,null,null,null,null,null,null,500,1500,5000,2000,5000,2000,null,null,null,null,null,null,null,null,null,null,null,null,null,null,null,null,null,null,null,null,null,null,null,null,0," "," "," "," "," "]
["WXC006E/000A/155A","Bruton Reservoir Section 10 Improvements","Wessex",null,"NCPMS","Deliver the project with the associated EA staff costs."," ECCPM to be assigned to the project."," Supervisor assigned to the project. "," Lot 4 contractor designs and constructs the works for the project. "," 2 year programme"," Off site disposal of drainage arisings",null,null,null,null,null,null,null,null,null,null,null,null,null,null,null,null,null,null,null,null,null,null,null,null,"Package the project together with similar projects arising from Section 10 inspections at Curry Moor Tubbs Bottom Cribbs Causeway & Westford under one contract so that efficiencies can be made in the management of the project by EA staff. "," ECCPM to be assigned to the package of five similar projects."," Supervisor to be assigned to the package of five similar projects."," Lot 4 contractor designs and constructs the works for the package of projects. One programme of works covers all 5 projects so that the projects can be more efficiently designed and constructed. "," Successful contractor proposed a 1 year programme at tender stage. "," Local re-profiling to design in on-site use of excavated material from new drainage installation works",null,null,null,null,null,null,null,null,null,null,null,null,null,null,null,null,null,null,null,null,null,null,null,null,5000,5000,10000,25000,35000,2000,null,null,null,null,null,null,null,null,null,null,null,null,null,null,null,null,null,null,null,null,null,null,null,null,0," "," "," "," ",3800]
["WXC005E/000A/147A","Cribbs Causeway Reservoir Section 10 Improvements","Wessex",null,"NCPMS","Deliver the project with the associated EA staff costs."," ECCPM to be assigned to the project."," Supervisor assigned to the project. "," Lot 4 contractor designs and constructs the works for the project. "," 2 year programme"," Off site disposal of drainage arisings",null,null,null,null,null,null,null,null,null,null,null,null,null,null,null,null,null,null,null,null,null,null,null,null,"Package the project together with similar projects arising from Section 10 inspections at Bruton Curry Moor Tubbs Bottom & Westford under one contract so that efficiencies can be made in the management of the project by EA staff. "," ECCPM to be assigned to the package of five similar projects."," Supervisor to be assigned to the package of five similar projects."," Lot 4 contractor designs and constructs the works for the package of projects. One programme of works covers all 5 projects so that the projects can be more efficiently designed and constructed. "," Successful contractor proposed a 1 year programme at tender stage. "," Local re-profiling to design in on site use of excavated material from new drainage installation works",null,null,null,null,null,null,null,null,null,null,null,null,null,null,null,null,null,null,null,null,null,null,null,null,5000,5000,10000,25000,35000,2000,null,null,null,null,null,null,null,null,null,null,null,null,null,null,null,null,null,null,null,null,null,null,null,null,3800,3800,3800," "," "," "]
["WXC005E/000A/148A","Tubbs Bottom Reservoir Section 10 Improvements","Wessex",null,"NCPMS","Deliver the project with the associated EA staff costs."," ECCPM to be assigned to the project."," Supervisor assigned to the project. "," Lot 4 contractor designs and constructs the works for the project. ",null,null,null,null,null,null,null,null,null,null,null,null,null,null,null,null,null,null,null,null,null,null,null,null,null,null,"Package the project together with similar projects arising from Section 10 inspections at Bruton Curry Moor Cribbs Causeway & Westford under one contract so that efficiencies can be made in the management of the project by EA staff. "," ECCPM to be assigned to the package of five similar projects."," Supervisor to be assigned to the package of five similar projects."," Lot 4 contractor designs and constructs the works for the package of projects. One programme of works covers all 5 projects so that the projects can be more efficiently designed and constructed. ",null,null,null,null,null,null,null,null,null,null,null,null,null,null,null,null,null,null,null,null,null,null,null,null,null,null,5000,5000,10000,25000,null,null,null,null,null,null,null,null,null,null,null,null,null,null,null,null,null,null,null,null,null,null,null,null,null,null,0," "," "," "]
["WXC007E/000A/220A","Westford Reservoir Section 10 Improvements","Wessex",null,"NCPMS","2 year programme"," Off site disposal of drainage arisings"," Deliver the project with the associated EA staff costs."," ECCPM to be assigned to the project."," Supervisor assigned to the project. "," Lot 4 contractor designs and constructs the works for the project. ",null,null,null,null,null,null,null,null,null,null,null,null,null,null,null,null,null,null,null,null,null,null,null,null,"Successful contractor proposed a 1 year programme at tender stage. "," Local re-profiling to design in on site use of excavated material from new drainage installation works"," Package the project together with similar projects arising from Section 10 inspections at Curry Moor Tubbs Bottom Cribbs Causeway & Bruton under one contract so that efficiencies can be made in the management of the project by EA staff. "," ECCPM to be assigned to the package of five similar projects."," Supervisor to be assigned to the package of five similar projects."," Lot 4 contractor designs and constructs the works for the package of projects. One programme of works covers all 5 projects so that the projects can be more efficiently designed and constructed. ",null,null,null,null,null,null,null,null,null,null,null,null,null,null,null,null,null,null,null,null,null,null,null,null,35000,2000,5000,5000,10000,25000,null,null,null,null,null,null,null,null,null,null,null,null,null,null,null,null,null,null,null,null,null,null,null,null,0," "," "," "," "," "]
["WXC007E/000A/220A","Westford Reservoir Section 10 Improvements","Wessex",null,"NCPMS","2 year programme"," Demountable trash screen"," Off site disposal of drainage arisings",null,null,null,null,null,null,null,null,null,null,null,null,null,null,null,null,null,null,null,null,null,null,null,null,null,null,null,"Successful contractor proposed a 1 year programme at tender stage. "," Upstream screen no longer required.  Further investigation into the need for telemetry to be extended either side of the screen.  Details included in PMI- 13"," Local re-profiling to design in on site use of excavated material from new drainage installation works",null,null,null,null,null,null,null,null,null,null,null,null,null,null,null,null,null,null,null,null,null,null,null,null,null,null,null,35000,1000,2000,null,null,null,null,null,null,null,null,null,null,null,null,null,null,null,null,null,null,null,null,null,null,null,null,null,null,null,0," "," "]
["SWC013E/000A/044A","Stoke Canon Flood Defence","Devon and Cornwall",null,"NCPMS","Strengthen parapet of Stoke Canon Bridge using a proprietary system",null,null,null,null,null,null,null,null,null,null,null,null,null,null,null,null,null,null,null,null,null,null,null,null,null,null,null,null,null,"Re-design so that a thicker parapet is provided..  Minimises risk to historic structure reduces road closure cheaper construction. ",null,null,null,null,null,null,null,null,null,null,null,null,null,null,null,null,null,null,null,null,null,null,null,null,null,null,null,null,null,10000,null,null,null,null,null,null,null,null,null,null,null,null,null,null,null,null,null,null,null,null,null,null,null,null,null,null,null,null,null,0]
["SWC015E/000A/052A","Totnes Flood Defence Improvements","Devon and Cornwall",null,"NCPMS","2nr public displays during the appraisal period.",null,null,null,null,null,null,null,null,null,null,null,null,null,null,null,null,null,null,null,null,null,null,null,null,null,null,null,null,null,"Undertake public displays on consecutive days to minimise travel burden and expenses and potentially to minimums venue costs. (Saving TBC).",null,null,null,null,null,null,null,null,null,null,null,null,null,null,null,null,null,null,null,null,null,null,null,null,null,null,null,null,null,200,null,null,null,null,null,null,null,null,null,null,null,null,null,null,null,null,null,null,null,null,null,null,null,null,null,null,null,null,null,0]
["THC036E/001A/008A","Salmons Brook","Kent and South London",null,"NCPMS","Asbestos/contaminated ground discovery in MRC culvert area cost for off-site disposal of balance of contaminated materials not dealt with under Item 29 above ",null,null,null,null,null,null,null,null,null,null,null,null,null,null,null,null,null,null,null,null,null,null,null,null,null,null,null,null,null,"Remodel approach to dealing with contaminated ground. Encapsulation of remaining contaminated materials in on site embankments etc. This to be agreed. Present assessment is a further £480000 saving but reported amount limited to £350000. ",null,null,null,null,null,null,null,null,null,null,null,null,null,null,null,null,null,null,null,null,null,null,null,null,null,null,null,null,null,0,null,null,null,null,null,null,null,null,null,null,null,null,null,null,null,null,null,null,null,null,null,null,null,null,null,null,null,null,null,0]
["THE001E/000A/013A","TTFP1","West Thames",null,"NCPMS","TTFP1 (IMTH001749) PAR allowed £666k compensation.  This allowance was made as the original construction methodology would have required extensive relocation and disturbance allowances to occupying businesses and landowners.",null,null,null,null,null,null,null,null,null,null,null,null,null,null,null,null,null,null,null,null,null,null,null,null,null,null,null,null,null,"Through the detailed design process the construction methodology and programme was improved to reduce the disruption to the site occupiers.  The new baseline worst case for compensation efficiency was £506k as the costs for Minoco and Town Quay were removed from the PAR value .",null,null,null,null,null,null,null,null,null,null,null,null,null,null,null,null,null,null,null,null,null,null,null,null,null,null,null,null,null,310000,null,null,null,null,null,null,null,null,null,null,null,null,null,null,null,null,null,null,null,null,null,null,null,null,null,null,null,null,null,0]
["THC009E/001A/002A","Upper Mole FAS","Kent and South London",null,"NCPMS","The PAR construction value for Grattons Park was £500000 and was going to be undertaken using EA framework suppliers.",null,null,null,null,null,null,null,null,null,null,null,null,null,null,null,null,null,null,null,null,null,null,null,null,null,null,null,null,null,"Crawley Borough Council (CBC) offered to undertake the works at Gratton Park using their suppliers.  In August 2013 an agreement was signed between CBC and the EA which agreed that  CBC would cover £250k of the construction cost and the EA would pay CBC £16k towards the works.  Works are almost complete at Grattons Park and an additional £4k of work may be required which will be paid for by the EA.  Therefore total saving is £500k - £16k - £4k -£50k (the -£50k is due to efficiency ID 14 where a £50k saving was previously identified therefore not double counted) = £430k",null,null,null,null,null,null,null,null,null,null,null,null,null,null,null,null,null,null,null,null,null,null,null,null,null,null,null,null,null,430000,null,null,null,null,null,null,null,null,null,null,null,null,null,null,null,null,null,null,null,null,null,null,null,null,null,null,null,null,null,0]
["THE001E/001A/025A","Thames Barrier Drive Equipment Logic Control Pilot","Kent and South London",null,"NCPMS","Dispose of and replace hydraulic oil for old Hydraulic Power Units (HPU)"," Use Un-interuptable Power Supply (UPS) for backup power",null,null,null,null,null,null,null,null,null,null,null,null,null,null,null,null,null,null,null,null,null,null,null,null,null,null,null,null,"Install off line filtration system to enable cleaning and reuse of oil. ",null,null,null,null,null,null,null,null,null,null,null,null,null,null,null,null,null,null,null,null,null,null,null,null,null,null,null,null,null,15000,11950,3000,10400,7000," TBA",null,null,null,null,null,null,null,null,null,null,null,null,null,null,null,null,null,null,null,null,null,null,null,null,0," "," "," "," "," "]
["THC000E/000A/101B","Thames Weirs High Priority Programme Package 1 (Molesey)","West Thames",null,"NCPMS","Season 2 - Mass Concrete under Weir Apron 1000mm at PAR design for the other half of the Weir to be completed in 2014"," We originally used Cam watch which was a constant monitoring system running on battery pack that needed recharging twice a day. We thus had an emission buster full time on site which actuated the generator. We had to power up the generator to charge up the batteries then turn the generator back off again. This was an expensive way of monitoring",null,null,null,null,null,null,null,null,null,null,null,null,null,null,null,null,null,null,null,null,null,null,null,null,null,null,null,null,"Redesign toe levels of the piles upstream and downstream to reduce uplift pressure and hence reduce mass Concrete under Weir Apron from 1000mm to 650mm saving of 350mm. "," It was decided to change to Secure Site (remote observation system) because operating cost were signifacantly less. This option does not use a generator and therefore is significantly less expensive to use.",null,null,null,null,null,null,null,null,null,null,null,null,null,null,null,null,null,null,null,null,null,null,null,null,null,null,null,null,18790.666666666701,20000,11200,null,null,null,null,null,null,null,null,null,null,null,null,null,null,null,null,null,null,null,null,null,null,null,null,null,null,null,0," "," "]
["THC029E/000A/002A","Hillmans Cottages","West Thames",null,"NCPMS","Clay soil was to be imported to form bund"," The origianal scope included for finding compensatory storage",null,null,null,null,null,null,null,null,null,null,null,null,null,null,null,null,null,null,null,null,null,null,null,null,null,null,null,null,"To re-use clay soil from existing embankment and elimate the need of importing new clay. "," By proving to development and flood risk that construction would not result in increased water levels downstream we avoided the costs of investigating compensatory storage volumes. ",null,null,null,null,null,null,null,null,null,null,null,null,null,null,null,null,null,null,null,null,null,null,null,null,null,null,null,null,5000,5000,null,null,null,null,null,null,null,null,null,null,null,null,null,null,null,null,null,null,null,null,null,null,null,null,null,null,null,null,0," "]
["SOW001E/001A/006A","East Farleigh Emergency Works","Kent and South London",null,"NCPMS","Use access tower to carry out works to Gate 2",null,null,null,null,null,null,null,null,null,null,null,null,null,null,null,null,null,null,null,null,null,null,null,null,null,null,null,null,null,"Lessons learnt from works to Gate 1 changed the construction methodology from access tower to scaffold this had speed up works and resulted in  a shorter than planned programme on Gate 2. (based on a potential saving 3 days labour/supervision and Prelims)",null,null,null,null,null,null,null,null,null,null,null,null,null,null,null,null,null,null,null,null,null,null,null,null,null,null,null,null,null,10500,null,null,null,null,null,null,null,null,null,null,null,null,null,null,null,null,null,null,null,null,null,null,null,null,null,null,null,null,null,0]
["THC022E/000A/021A","Lewisham and Catford FAS","West Thames",null,"NCPMS","Paying for public exhibition space (4 events)",null,null,null,null,null,null,null,null,null,null,null,null,null,null,null,null,null,null,null,null,null,null,null,null,null,null,null,null,null,"Locations and people for public exhibition provided by the ",null,null,null,null,null,null,null,null,null,null,null,null,null,null,null,null,null,null,null,null,null,null,null,null,null,null,null,null,null,3000,3600,5000,3000,null,null,null,null,null,null,null,null,null,null,null,null,null,null,null,null,null,null,null,null,null,null,null,null,null,null,0," "," "," "]
["THC007E/000A/005A","Eastbury Flood alleviation scheme","West Thames",null,"NCPMS","Hire of external Ecological Clerk of Works. ",null,null,null,null,null,null,null,null,null,null,null,null,null,null,null,null,null,null,null,null,null,null,null,null,null,null,null,null,null,"Use of internal staff member as Ecological Clerk of Works at no cost. [12 weeks x 4hr x £44] ",null,null,null,null,null,null,null,null,null,null,null,null,null,null,null,null,null,null,null,null,null,null,null,null,null,null,null,null,null,2112,null,null,null,null,null,null,null,null,null,null,null,null,null,null,null,null,null,null,null,null,null,null,null,null,null,null,null,null,null,0]
["THC038E/001A/001A","RTS Channel & Capacity Improvements","West Thames",null,"NCPMS","Conduct SI and topo surveys at Molesey Weir"," Topographic Survey required at Teddington Weir"," SI boreholes required over water "," Conduct enough boreholes to sufficiently advise the design"," Obtain Biological Records Data from the Biological Records Centre"," SI contractors have small site compound and welfare van for Sunbury weir works locally",null,null,null,null,null,null,null,null,null,null,null,null,null,null,null,null,null,null,null,null,null,null,null,null,"Use existing data from historic environment agency projects sourced from archives to avoid the need to conduct new surveys. At scoping stage it was assumed very limited existing information would be available and it was likely is wouldnt be sufficient and more would be needed"," Use existing data from historic environment agency projects sourced from archives to limit the need to conduct new surveys. At scoping stage it was assumed very limited existing information would be available and it was likely is wouldnt be sufficient and more would be needed"," No boreholes over the water required saving the cost of the jack-up barge. Using a combination of existing data and techniques to interpolate data across the river and only need boreholes on land either side of banks"," Fewer boreholes are required as a result of procurement of 1:10000 scale British Geological Survey data which meant that geological mapping could be used to inform and hence limit the scope of the SI works. This data wasnt initially available but for a small addition cost it avoided the need for a greater si cost"," EA to obtain data directly from the three Biological Records Centres using their existing Service Level Agreements. The majoirty of this data is expected to be obtained free of charge using and existing relationships and Service Level Agreements which the EA whole therefore reducing overall project cost. Still in negotiations with indiviudal centres to assess data to be provided."," Locate compound within Sunbury EA depot and use EA facilities thus avoiding need to liaise with landowners and reduce cost of Si contractor",null,null,null,null,null,null,null,null,null,null,null,null,null,null,null,null,null,null,null,null,null,null,null,null,18500,3500,45000,30000,2500,1500,null,null,null,null,null,null,null,null,null,null,null,null,null,null,null,null,null,null,null,null,null,null,null,null,0," "," "," "," "," "]
["","Salmons Brook","Herts and North London",null,"NCPMS","Provision of manhole for railway culvert",null,null,null,null,null,null,null,null,null,null,null,null,null,null,null,null,null,null,null,null,null,null,null,null,null,null,null,null,null,"Redesign and remove the need of manhole."," Redesign of and reduction in size of culvert beneath road to minimise area of road excavated and required to be closed",null,null,null,null,null,null,null,null,null,null,null,null,null,null,null,null,null,null,null,null,null,null,null,null,null,null,null,null,4000,15000,null,null,null,null,null,null,null,null,null,null,null,null,null,null,null,null,null,null,null,null,null,null,null,null,null,null,null,null,5593,14481]
["","Thames Barrier Drive Equipment Logic Control Pilot","Kent and South London",null,"NCPMS","Original design included 2 ethernet connections on either side of gate 40 in total ",null,null,null,null,null,null,null,null,null,null,null,null,null,null,null,null,null,null,null,null,null,null,null,null,null,null,null,null,null,"Redesign to have 3 Profibus connections which is a lot cheaper compare to original design of 40 ethernet to each pannel. ",null,null,null,null,null,null,null,null,null,null,null,null,null,null,null,null,null,null,null,null,null,null,null,null,null,null,null,null,null,22000,null,null,null,null,null,null,null,null,null,null,null,null,null,null,null,null,null,null,null,null,null,null,null,null,null,null,null,null,null,22450]
["THC000E/000A/205A","TW Gates Replacement","West Thames",null,"NCPMS","Original Scope was to replace Cookham and Romney Gates. ",null,null,null,null,null,null,null,null,null,null,null,null,null,null,null,null,null,null,null,null,null,null,null,null,null,null,null,null,null,"The area asset team decided to add Mapledurham and Caversham Last Hope to package the project for greated efficiencies for the overall capital programme. ",null,null,null,null,null,null,null,null,null,null,null,null,null,null,null,null,null,null,null,null,null,null,null,null,null,null,null,null,null,50000,null,null,null,null,null,null,null,null,null,null,null,null,null,null,null,null,null,null,null,null,null,null,null,null,null,null,null,null,null,50000]
["NWC001E/001A/005A","Crossens","Cumbria and Lancashire",null,null,"Carry on using diesel pumps at Crossens Pumping Station and existing weedscreen configuration "," Standby generator to be located between pump hall and diesel store. Cable tails required to reach from generator to switchboard in the pump hall.",null,null,null,null,null,null,null,null,null,null,null,null,null,null,null,null,null,null,null,null,null,null,null,null,null,null,null,null,"Remove diesel pumps and replace with new electric pumps and replace existing weedscreen configuration with new split configuration reducing operational maintenance costs"," Relocate generator and move switchboard to an external location. Cuts down on cable lengths required. ",null,null,null,null,null,null,null,null,null,null,null,null,null,null,null,null,null,null,null,null,null,null,null,null,null,null,null,null,422750,50000,null,null,null,null,null,null,null,null,null,null,null,null,null,null,null,null,null,null,null,null,null,null,null,null,null,null,null,null,0," "]
["NWC008E/002A/001A","Mersey Warrington FRMS - Delivery Stage","Gtr Mancs Mersey and Ches",null,null,"RC wall and embankment from the scottish power site along the bank of padgate brook."," Original plan was clad the MR4 sheet piling with PCC cladding to match the phase 1 and 2 appearance. "," Mechanical Flap Valve on river outfalls"," Engineered embankment between NE corner of SP compound ant Farrell Street."," Profile area between Ambulance staion and substaion",null,null,null,null,null,null,null,null,null,null,null,null,null,null,null,null,null,null,null,null,null,null,null,null,null,"Realignment of defence alignment to the rear of Scottish power to tie into Farrel street bridge. Reduced embankment works and moves construction footprint away from watercousre and potential habitat site for watervoles."," Omission of PCC cladding to MR4 sheet piling and disguise sheet piling with security fencing thus providing reduction in cost and improvement to the security of the allotments."," Trial installation of in line Wastop or similar anti flood device accessable from inspection chamber increased capital cost but reduced whole life maintenance costs."," Modify embankment design and profile to allow construction with surplus material generated on site rather than use new imported material."," Further reconfigure levels on North area of phase 2a to utilise site won materials",null,null,null,null,null,null,null,null,null,null,null,null,null,null,null,null,null,null,null,null,null,null,null,null,null,100000,20000," ",20000,10000,null,null,null,null,null,null,null,null,null,null,null,null,null,null,null,null,null,null,null,null,null,null,null,null,null,0," "," "," "," "]
["NWC012E/002A/001A","Northwich","Gtr Mancs Mersey and Ches",null,null,"Install self raising barriers along Waitrose site to maintain visual connectivity with the river ",null,null,null,null,null,null,null,null,null,null,null,null,null,null,null,null,null,null,null,null,null,null,null,null,null,null,null,null,null,"Agree the use of demountable defences (above the 1 in 20 year level) or glass panels with the relevant stakeholders ",null,null,null,null,null,null,null,null,null,null,null,null,null,null,null,null,null,null,null,null,null,null,null,null,null,null,null,null,null,400000,null,null,null,null,null,null,null,null,null,null,null,null,null,null,null,null,null,null,null,null,null,null,null,null,null,null,null,null,null,0]
["TRC003E/000A/533A","Perry Barr & Witton","Staffs Warks and West Mids",null,"NCPMS","Use of external specialist for all Japanese Knotweed spraying"," Use of external consultant to fulfil archaeological trial trenching ECW role."," Use of external consultant to undertake watervole survey"," Reinforcement to electricity pylon foundations through Forge Mill storage area"," Payment of compensation to Golf course for loss of land at Forge Mill from embankment construction and inundation."," Alignment of Tame Road new wall to Eurocode standards resulting in extensive groundworks high compensation payments and major business disruption."," Construction of 3m high wall along Brookvale Road requiring use of extensive groundworks and in channel working"," Appointment of external contractor to survey extent of Crassula at Forge Mill"," Submission of planning application with no prior discussion potentially resulting in multiple applications and numerous consents"," Divert MLP pipeline"," Removal of Atlas bridge and widening of access route to rear of industrial estate","Packaging topographic survey for Phase 2 in with The Bourn project",null,null,null,null,null,null,null,null,null,null,null,null,null,null,null,null,null,null,"Use of EA Ops team in house for June 2014 spray"," Use of internal FRB team to fulfil ECW role."," Use of internal FRB team to undertake watervole survey including use of boat"," Discussions with Western Power Distribution and use of examples from other EA schemes plus explanation of modelling results has resulted in agreement that no mitigation works are required."," Agreement of land swap between BCC and golf course avoiding requirement for most if not all compensation and resulting in provision of better quality habitat land for BCC."," Agreement of project board to pragmatic approach to alignment of wall and application of Eurocodes."," Redesign of scheme outside of Strategy to a much lower cost and providing much higher benefits (due to number of houses receiving a benefit)"," Analysis and Reporting team surveying the extent of Crassula at Forge Mill"," Regular updates to BCC planning department has resulted in planning consent first time with limited conditions."," Protect MLP pipeline in existing location following procurement of feasibility study"," Redesign to remove requirement to remove bridge","Asking for suppliers to price two scenarios: the projects packaged and the projects separately. The cheapest combination consisted of separate suppliers delivering the two sets of surveys.",null,null,null,null,null,null,null,null,null,null,null,null,null,null,null,null,null,null,2000,1500,2500,250000,500000,50000,3000000,1000,5000,626000,250000,5000,null,null,null,null,null,null,null,null,null,null,null,null,null,null,null,null,null,null,4226,928,1022.8,363200," "," "," ",1340,8160," ",310000,6781.1040000000003]
["SNC001E/000A/647A","Severn Critical Eels","Shrops Heref Worcs and Glos",null,"NCPMS","Construction on all 5 sites costed individually",null,null,null,null,null,null,null,null,null,null,null,null,null,null,null,null,null,null,null,null,null,null,null,null,null,null,null,null,null,"By packging 3 of the sites together and synchronising the programme for access then mobilisation and welfare savings were offered by the contractor",null,null,null,null,null,null,null,null,null,null,null,null,null,null,null,null,null,null,null,null,null,null,null,null,null,null,null,null,null,7000,null,null,null,null,null,null,null,null,null,null,null,null,null,null,null,null,null,null,null,null,null,null,null,null,null,null,null,null,null,7000]
["SNO000E/000A/175A","Puxton and Stourvale","Shrops Heref Worcs and Glos",null,"NCPMS","Installation of new river level gauge and stage board in River Stour to support groundwater monitoring proposed as part of groundwater monitoring works by contractor",null,null,null,null,null,null,null,null,null,null,null,null,null,null,null,null,null,null,null,null,null,null,null,null,null,null,null,null,null,"EA already has river level monitoring nearby that is suitable for use so river gauge withdrawn from specification. Stage board to be supplied and installed by EA",null,null,null,null,null,null,null,null,null,null,null,null,null,null,null,null,null,null,null,null,null,null,null,null,null,null,null,null,null,2573,null,null,null,null,null,null,null,null,null,null,null,null,null,null,null,null,null,null,null,null,null,null,null,null,null,null,null,null,null,2573]
["TRC003E/000A/144A","Southwell Fish Pass","Derbys Notts and Leics",null,"NCPMS","Southwell - Construct Pre-barrage and pumped up and over eel pass",null,null,null,null,null,null,null,null,null,null,null,null,null,null,null,null,null,null,null,null,null,null,null,null,null,null,null,null,null,"Construct Hern baffles with recessed eel tiles",null,null,null,null,null,null,null,null,null,null,null,null,null,null,null,null,null,null,null,null,null,null,null,null,null,null,null,null,null,200000,null,null,null,null,null,null,null,null,null,null,null,null,null,null,null,null,null,null,null,null,null,null,null,null,null,null,null,null,null,200000]
["TRC003E/000A/059A","The Bourn FAS","Staffs Warks and West Mids",null,"NCPMS","Topographical Survey",null,null,null,null,null,null,null,null,null,null,null,null,null,null,null,null,null,null,null,null,null,null,null,null,null,null,null,null,null,"Alternative way of procurement using Surveying Framework to reduce costs and ensure work is deliverable in a tight time frame. By opting to use 2 suppliers (rather than 1 packaged as originaly intended) we are able to get all work programmed in by March 2015.",null,null,null,null,null,null,null,null,null,null,null,null,null,null,null,null,null,null,null,null,null,null,null,null,null,null,null,null,null,5274,null,null,null,null,null,null,null,null,null,null,null,null,null,null,null,null,null,null,null,null,null,null,null,null,null,null,null,null,null,5274.4]
["TRK003E/000A/622A","Whatstandwell Fish Pass","Derbys Notts and Leics",null,"NCPMS","Whatstandwell - Remove all contaminated spoil from site",null,null,null,null,null,null,null,null,null,null,null,null,null,null,null,null,null,null,null,null,null,null,null,null,null,null,null,null,null,"Reuse spoil on site",null,null,null,null,null,null,null,null,null,null,null,null,null,null,null,null,null,null,null,null,null,null,null,null,null,null,null,null,null,50000,null,null,null,null,null,null,null,null,null,null,null,null,null,null,null,null,null,null,null,null,null,null,null,null,null,null,null,null,null,50000]
["TRC003E/000A/018A","West Stockwith","Derbys Notts and Leics",null,"NCPMS","Use ECC PM to manage the contract during construction"," Paint the assets whilst in situ."," Gate designed not to collect debris and silt   (Revenue saving?)"," Stoning work done by the local EA team as part of the WS gate replacement project."," Use Ainscough 250T crane. ",null,null,null,null,null,null,null,null,null,null,null,null,null,null,null,null,null,null,null,null,null,null,null,null,null,"PM with support from in house const consultant administered the contract"," Paint structure and counterbalance whilst the assets are on the ground and accessible. Easier access less environmental and H&S risk to paint whilst the structure is on the ground rather than in position over the watercourse."," reduced cost of maintenance. (previously silt was hosed off the gate and debris had to be taken off the structure intermittently. Assume half/day per month @ £250 per half day.therefore assume £3K/yr for 30yr design life. )"," Work packaged up with reovery work. "," Use 120T crane rigged up to 230T",null,null,null,null,null,null,null,null,null,null,null,null,null,null,null,null,null,null,null,null,null,null,null,null,null,15000,35000,90000,3130,5430,null,null,null,null,null,null,null,null,null,null,null,null,null,null,null,null,null,null,null,null,null,null,null,null,null,15000,35000," ",3130,5430]
["TRK003E/000A/150A","Trent Critical Eels","Derbys Notts and Leics",null,"NCPMS","PAR written by Consultant"," Consultant undertake options appraisal and WFD assessment of fish pass solutions"," Traditional pet flap style fish passess"," Use established Fish Pass suppliers",null,null,null,null,null,null,null,null,null,null,null,null,null,null,null,null,null,null,null,null,null,null,null,null,null,null,"PAR written in house by ncpms PM"," EA provide steer of most likley solution for Consultant to test the suitability of and Biodiversity to undertake the WFD assessments."," Dampers instead of pet flaps at 2 sites"," Work with HCWatercontrol to develop and test a new product that will provide the same solution. ",null,null,null,null,null,null,null,null,null,null,null,null,null,null,null,null,null,null,null,null,null,null,null,null,null,null,3800,3351,13200,8200,null,null,null,null,null,null,null,null,null,null,null,null,null,null,null,null,null,null,null,null,null,null,null,null,null,null,3800,3351,13200,8200]
["TRC003F/000A/009A","Leicester R Soar Conveyance PAR","Derbys Notts and Leics",null,"NCPMS","Mitigation plantin is required to mitigate for an area of tree and shrub removal. The original plan was to deliver deliver the planting through the EA Landscape Framework as one package with further planting works at the end of the main construction works which would have included 5 years maintenance."," To allow the detailed design of the project to be undertake a tree survey for all site to BS5837 a total of 4 sites. The original plan was to procure these tree surveys using the appointed WEM Lot 3 supplier."," As part of the project the project team had made an allowance within the business case to create artwork for interpretation boards to install at each of the five sites where construction would be undertaken."," Delivery of a large flood storage reservoir to reduce flood risk to approximately 2000 properties.",null,null,null,null,null,null,null,null,null,null,null,null,null,null,null,null,null,null,null,null,null,null,null,null,null,null,"Following discussion with Leicester City Council an oportunity arose for Leicester City Council to undertake the initial mitigation planting using their Parks and Open Spaces team along with local Conservation Trust Volunteers. Leicester City Council are able to undertake this planting work while undertaking further planting work in the area because of this there will be no additional labour costs to Leicester City Council or the EA - effectively a packageing exercise/economy of scale. As part of this work Leicester City Council would also take on the five year maintenance commitment on behalf of the Environment Agency. The EA have provided the planting materials at a cost of £1587. Using the landscape framework rates the planting costs have been calculated to be ~£5000. A figure for 5 years maintenance has been calculated from the landscape framework as £3243. Therefore this change in delivery approach has saved the project £6656 while still delivering the same product."," A quote was recieved from the WEM Lot 3 supplier for  £10000 to undertake the tree surveys at the four sites. Leicester City Council identified that they have an inhouse team who are trained and compentant to undertake the required tree surveys. The Leicester City Council Trees & Woodlands Team provided a quote to undertake the surveys for £3480 apposed to the WEM consultant quote of £10k. Therefore the Leicester City Council Trees and Wodlands Team were procured offering a project saving  of £6520."," Through close partnership working with Leicester City Council it has been agreed that the EA can use the Leicester City Council artwork that they have for all notice boards along the River Soar. This will effectively standardise the art work along the whole river corridor. A cost allowance of £1000 was made within the PAR. "," The original project mandate aimed to construct a flood storage area to reduce flood risk to approximately 2000 properties. During an initial assessment undertaken by the Area PSO team and ncpms during summer 2013 it was concluded that there was the opportunity for a more cost effective scheme that would reduce flood risk to the same number of properties within Leicester or potentially more by making a series or conveyance improvements along the River Soar that would offer both flood risk management and green infrastructure improvements. This is an initiative approach that has not been undertaken on this scale in recent years. The change in approach was discussed and agreed by the schemes Project Board. See seperate file note for full details.",null,null,null,null,null,null,null,null,null,null,null,null,null,null,null,null,null,null,null,null,null,null,null,null,null,null,6656,6520,1000,1128200,null,null,null,null,null,null,null,null,null,null,null,null,null,null,null,null,null,null,null,null,null,null,null,null,null,null,6656,6520," ",1128200]
["ACC451F/000A/004A","West End, Silverstone, Flood Alleviation Scheme","Cambs and Bedfordshire","Anglian Central"]
["ACC451E/000A/608A","Brackley Flood Risk Management Scheme","Cambs and Bedfordshire","Anglian Central"]
["ANC405F/000A/008A","Main Road, Shutlanger, Flood Risk Management Scheme","Cambs and Bedfordshire","Anglian Central"]
["ANC405F/000A/006A","Cosgrove Road, Old Stratford - Surface Water Flood Risk Improvement Works","Cambs and Bedfordshire","Anglian Central"]
["ACS451E/001A/002A","Hunstanton/Heacham Beach Management","Cambs and Bedfordshire","Anglian Central"]
["ACC451E/000A/594A","Webbs Hole Sluice Pumping Station","Cambs and Bedfordshire","Anglian Central"]
["ACC451I/004A/018A","Middle Level Bank Raising Scheme","Cambs and Bedfordshire","Anglian Central"]
["ACC451F/000A/021A","Newmarket Flood Alleviation Scheme","Cambs and Bedfordshire","Anglian Central"]
["ACC451E/000A/599A","Gough Way Culvert Repairs","Cambs and Bedfordshire","Anglian Central"]
["ACC451I/000A/207A","Pix Brook flood alleviation scheme","Cambs and Bedfordshire","Anglian Central"]
["ACC451E/000A/586A","King's Lynn Fisher Fleet - Refurbishment of Floodgates","Cambs and Bedfordshire","Anglian Central"]
["ACC451F/000A/025A","Yelden & Upper Dean Flood Risk Management Scheme","Cambs and Bedfordshire","Anglian Central"]
["ACC451E/000A/615a","Ouse Washes Reservoir Section 10 Works","Cambs and Bedfordshire","Anglian Central"]
["ACC451F/000S/008A","March Surface Water Flood Alleviation Scheme","Cambs and Bedfordshire","Anglian Central"]
["ACC451I/000A/238A","Kings Ditch Flood Risk Management Scheme","Cambs and Bedfordshire","Anglian Central"]
["ACC451F/000A/019A","Riverside Surface Water Flood Alleviation Scheme","Cambs and Bedfordshire","Anglian Central"]
["ACC451F/000A/017A","Brunswick Surface Water Flood Alleviation Scheme","Cambs and Bedfordshire","Anglian Central"]
["ACC451F/000A/026A","Brampton Flood Risk Management Scheme","Cambs and Bedfordshire","Anglian Central"]
["ACC451F/000A/018A","Kelvin Close Surface Water Flood Alleviation Scheme","Cambs and Bedfordshire","Anglian Central"]
["ACC451E/001A/001F","Tidal river erosion protection","Cambs and Bedfordshire","Anglian Central"]
["ACC451F/000A/003A","Kings Hedges & Arbury Estate, Cambridge, Surface Water Flood Alleviation Scheme","Cambs and Bedfordshire","Anglian Central"]
["ACC451I/004A/145A","West Lynn Outfall - Refurbishment","Cambs and Bedfordshire","Anglian Central"]
["ACC451I/000A/002A","Eaton Bray Flood Risk Management Scheme","Cambs and Bedfordshire","Anglian Central"]
["ACC451I/000A/237A","Stow Fen 1950's pumping station - Pumping station replacement","Cambs and Bedfordshire","Anglian Central"]
["ACC451F/000A/002A","Cherry Hinton Estate, Cambridge, Surface Water Flood Alleviation Scheme","Cambs and Bedfordshire","Anglian Central"]
["ACC451F/000A/015A","Godmanchester  Surface Water Flood Alleviation Scheme","Cambs and Bedfordshire","Anglian Central"]
["ACC451F/000A/016A","Histon/Impington  Surface Water Flood Alleviation Scheme","Cambs and Bedfordshire","Anglian Central"]
["ACC451I/000A/217A","Wretton Fen Pumping Station - Replacement / Refurbishment of pumps and infrastructure","Cambs and Bedfordshire","Anglian Central"]
["ACC451I/000A/214A","Hockwold Pumping Station - Refurbishment of Pumps and Infrastructure","Cambs and Bedfordshire","Anglian Central"]
["ACC451I/000A/231A","Saddlebow Pumping Station - Replacement / Refurbishment of pumps and infrastructure","Cambs and Bedfordshire","Anglian Central"]
["ACC451E/000A/007C","Denver Little Eyes replacement (stage 3)","Cambs and Bedfordshire","Anglian Central"]
["ACC451I/000A/230A","Stow Fen 1980's Pumping Station Refurbishment","Cambs and Bedfordshire","Anglian Central"]
["ACC451I/000A/213A","Catsholme Pumping Station - Replacement / Refurbishment of pumps and infrastructure.","Cambs and Bedfordshire","Anglian Central"]
["ACC451I/004A/137A","Magdalen Bridge Outfall - Replacement with Pumping Station","Cambs and Bedfordshire","Anglian Central"]
["ACC451I/004A/141A","Gaywood River, Millfleet Tilting Gate - Refurbishment","Cambs and Bedfordshire","Anglian Central"]
["ACC451I/004A/006A","Crabbes Abbey Pumping Station - Inlet Refurbishment and Pump Replacement","Cambs and Bedfordshire","Anglian Central"]
["ACC451I/004A/078A","Alder Fen Pumping Station- Replacment / Refurbishment of Pumping Station","Cambs and Bedfordshire","Anglian Central"]
["ACC451I/004A/146A","Green Bank Pumping Station - Pump Refurbishment","Cambs and Bedfordshire","Anglian Central"]
["ACC451I/000A/227A","Nar Valley Pumping Station -Replacement / Refurbishment of Pumps and Infrastructure","Cambs and Bedfordshire","Anglian Central"]
["ACC451I/000A/228A","Southery Pumping Station - Replacement / Refurbishment of pumps and infrastructure","Cambs and Bedfordshire","Anglian Central"]
["ACC451I/004A/144A","North Lynn Pumping Station - Pump Refurbishment","Cambs and Bedfordshire","Anglian Central"]
["ACC451I/004A/067A","Ten Mile Pumping Station - Replacement / Refurbishment of pumping station","Cambs and Bedfordshire","Anglian Central"]
["ACC451I/004A/177A","Borrowmoor pumping station - pump replacement","Cambs and Bedfordshire","Anglian Central"]
["ACC451I/000A/167A","Cock Fen Pumping Station Electrification","Cambs and Bedfordshire","Anglian Central"]
["ACC451I/004A/198A","Wimblington Common Pumping Station Refurbishment","Cambs and Bedfordshire","Anglian Central"]
["ACC451I/004A/182A","Glenhouse Pumping Station Refurbishment","Cambs and Bedfordshire","Anglian Central"]
["ACC451I/004A/181A","Duncombes Pumping Station Refurbishment","Cambs and Bedfordshire","Anglian Central"]
["ACC451I/004A/184A","Iron Bridge Pumping Station Refurbishment","Cambs and Bedfordshire","Anglian Central"]
["ACC451I/004A/088A","Padnal No. 1 Pumping Station - Replacement / Refurbishment of pumping station","Cambs and Bedfordshire","Anglian Central"]
["ACC451I/004A/193A","Puddock Pumping Station Refurbishment","Cambs and Bedfordshire","Anglian Central"]
["ACC451I/004A/197A","White Fen Pumping Station Refurbishment","Cambs and Bedfordshire","Anglian Central"]
["ACC451I/004A/188A","Middlemoor Pumping Station Replacement","Cambs and Bedfordshire","Anglian Central"]
["ACC451I/004A/190A","New Fen Pumping Station Replacement","Cambs and Bedfordshire","Anglian Central"]
["ACC451I/004A/194A","Reed Fen Pumping Station Refurbishment","Cambs and Bedfordshire","Anglian Central"]
["ACC451I/004A/179A","Castle Hill Pumping Station Refurbishment","Cambs and Bedfordshire","Anglian Central"]
["ACC451I/004A/192A","Pidley Pumping Station Refurbishment","Cambs and Bedfordshire","Anglian Central"]
["ACC451E/000A/611A","Swavesey Flood Risk Management Scheme","Cambs and Bedfordshire","Anglian Central"]
["ACC451E/000A/583A","Girton Flood Risk Management Scheme","Cambs and Bedfordshire","Anglian Central"]
["ACC451I/004A/196A","Westmoor Pumping Station Refurbishment","Cambs and Bedfordshire","Anglian Central"]
["ACC451I/000A/123A","Green Dyke Pumping Station Replacement","Cambs and Bedfordshire","Anglian Central"]
["ACC451I/004A/180A","Conington Pumping Station Refurbishment","Cambs and Bedfordshire","Anglian Central"]
["ACC451I/004A/187A","Mepal Pumping Station Replacement","Cambs and Bedfordshire","Anglian Central"]
["ACC451I/004A/195A","Rings End Pumping Station Refurbishment","Cambs and Bedfordshire","Anglian Central"]
["ACC451I/004A/183A","High Fen Pumping Station Refurbishment","Cambs and Bedfordshire","Anglian Central"]
["ACC451I/004A/063A","Hundred Foot Pumping Station - Replacement / Refurbishment of Pumping Station","Cambs and Bedfordshire","Anglian Central"]
["ACC451I/000A/216A","Oulsham Pumping Station - Replacement / Refurbishment of Pumps and Infrastructure.","Cambs and Bedfordshire","Anglian Central"]
["ACC451I/004A/185A","Latches Fen Pumping Station Refurbishment","Cambs and Bedfordshire","Anglian Central"]
["ACC451I/004A/175A","Acre Fen Pumping Station Refurbishment","Cambs and Bedfordshire","Anglian Central"]
["ACC451I/004A/189A","Moat Farm Pumping Station Replacement","Cambs and Bedfordshire","Anglian Central"]
["ACC451I/000A/164A","Nordelph Pumping Station Replacement","Cambs and Bedfordshire","Anglian Central"]
["ACC451I/004A/167A","Great Fen - Upstream storage scheme","Cambs and Bedfordshire","Anglian Central"]
["ACC000E/000A/347A","Saffron Walden Town Centre (Slades) Culvert ","Cambs and Bedfordshire","Anglian Central"]
["ACC451I/000A/166A","Padgets Corner Pumping Station Refurbishment","Cambs and Bedfordshire","Anglian Central"]
["ACC451I/004A/178A","Broadall Pumping Station Refurbishment","Cambs and Bedfordshire","Anglian Central"]
["ACC451I/004A/089A","Padnal No. 2 Pumping Station - Replacement / Refurbishment of pumping station","Cambs and Bedfordshire","Anglian Central"]
["ACC451I/000A/033A","Curf Pumping Station Refurbishment","Cambs and Bedfordshire","Anglian Central"]
["ACC451E/000A/604A","Fenstanton Flood Risk Management Scheme","Cambs and Bedfordshire","Anglian Central"]
["ACC451I/000A/210A","Bensons Pumping Station Refurbishment","Cambs and Bedfordshire","Anglian Central"]
["ACC451I/004A/084A","Chear Fen Pumping Station - Replacement / Refurbishment of Pumping Station","Cambs and Bedfordshire","Anglian Central"]
["ACC451I/006A/036A","Henny Fen Pumping Station - Replacement / Refurbishment of Pumping station","Cambs and Bedfordshire","Anglian Central"]
["ACC451I/004A/134A","Waterden Pumping Station - Replacement / Refurbishment of pumping station","Cambs and Bedfordshire","Anglian Central"]
["ACC451E/000A/600A","Pulp Mill Side Sluices Refurbishment","Cambs and Bedfordshire","Anglian Central"]
["ACC451I/006A/035A","Harrimere Pumping Station - Replacement / Refurbishment of Pumping station","Cambs and Bedfordshire","Anglian Central"]
["ACC451E/000A/605A","River Kennett Flood Risk Management Scheme ","Cambs and Bedfordshire","Anglian Central"]
["ACC451I/000A/240A","Lodes End Pumping Station Health & Safety Works","Cambs and Bedfordshire","Anglian Central"]
["ACC451I/004A/147A","Wolferton Pumping station - Refurbishment","Cambs and Bedfordshire","Anglian Central"]
["ACC451I/000A/224A","Mill Fen Pumping Station - Replacement / Refurbishment of Pumps and Infrastrucure","Cambs and Bedfordshire","Anglian Central"]
["ACC451I/006A/037A","Prickwillow Pumping Station - Replacement / Refurbishment of pumping station","Cambs and Bedfordshire","Anglian Central"]
["ACC451F/000A/027A","Downham Flood Risk Mitigation Scheme","Cambs and Bedfordshire","Anglian Central"]
["ACC451I/000A/225A","Mow Fen Pumping Station - Replacement / Refurbishment of Pumps and Infrastructure","Cambs and Bedfordshire","Anglian Central"]
["ACC451I/004A/169A","Islington Catchment Flood Risk Management Scheme","Cambs and Bedfordshire","Anglian Central"]
["ACC451I/000A/226A","Chainbridge Pumping Station - Refurbishment of Pumps and infrastructure","Cambs and Bedfordshire","Anglian Central"]
["ACC451I/004A/176A","Binnimoor Pumping Station Refurbishment","Cambs and Bedfordshire","Anglian Central"]
["ACC451E/000A/624A","A1101 Wash Road Welney Improvement Scheme","Cambs and Bedfordshire","Anglian Central"]
["ACC451I/004A/029A","Cawdle Fen Pumping Station - Replacement / Refurbishment of Pumping Station","Cambs and Bedfordshire","Anglian Central"]
["ACC451I/004A/025A","Lark Pumping Station - Replacement / Refurbishment of pumping station (both diesel & electric)","Cambs and Bedfordshire","Anglian Central"]
["ACC451I/004A/027A","Whitehall Pumping Station - Replacement / Refurbishment of pumping station","Cambs and Bedfordshire","Anglian Central"]
["ACC451I/006A/050A","Upware Pumping Station - Replacement / Refurbishment of pumping station","Cambs and Bedfordshire","Anglian Central"]
["ACC451F/000A/029A","King's Lynn Flood Risk Mitigation Scheme","Cambs and Bedfordshire","Anglian Central"]
["ACC451I/000A/239A","Stocking Fen Pumping Station Health & Safety Works","Cambs and Bedfordshire","Anglian Central"]
["ACC451I/004A/065A","Oxlode Pumping Station - Replacement / Refurbishment of pumping station","Cambs and Bedfordshire","Anglian Central"]
["ACC451I/000A/219A","Fordham Fen Pumping Station - Refurbishment of Pumps and Infrastructure","Cambs and Bedfordshire","Anglian Central"]
["ACC451F/000A/028A","Heacham Flood Risk Mitigation Scheme","Cambs and Bedfordshire","Anglian Central"]
["ACC451I/004A/085A","Queenholme Pumping Station - Replacement / Refurbishment of pumping station","Cambs and Bedfordshire","Anglian Central"]
["ACC451I/004A/060A","Lakenheath Pumping Station - Replacement / Refurbishment of pumping station","Cambs and Bedfordshire","Anglian Central"]
["ACC451I/000A/222A","Polver Pumping Station - Replacement / Refurbishment of pumps and infrastructure","Cambs and Bedfordshire","Anglian Central"]
["ACC451I/004A/064A","Little Thetford Pumping Station - Replacement / Refurbishment of pumping station","Cambs and Bedfordshire","Anglian Central"]
["ACC451I/004A/120A","Bottisham Locks Pumping Station - Replacement / Refurbishment of Pumping Station","Cambs and Bedfordshire","Anglian Central"]
["ACC451I/000A/229A","Hilgay Pumping Station - Refurbishment of Pumps and Infrastructure","Cambs and Bedfordshire","Anglian Central"]
["ACC451E/000A/602A","Swaffham Lode Pumping Station Refurbishment","Cambs and Bedfordshire","Anglian Central"]
["ACC451I/000A/218A","Cornerways Pumping Station - Refurbishment of Pumps and Infrastructure","Cambs and Bedfordshire","Anglian Central"]
["ACC451I/004A/066A","Stretham Pumping Station - Replacement / Refurbishment of pumping station","Cambs and Bedfordshire","Anglian Central"]
["ACC451E/000A/601A","Soham Lode Pumping Station Refurbishment","Cambs and Bedfordshire","Anglian Central"]
["ACC451I/000A/220A","Roxham Fen Pumping Station - Replacement / Refurbishment of pumps and infrastructure","Cambs and Bedfordshire","Anglian Central"]
["ACC451I/004A/090A","Redmore Pumping Station - Replacement / Refurbishment of pumping station","Cambs and Bedfordshire","Anglian Central"]
["ACC451I/004A/122A","Holt Fen Pumping Station - Replacement / Refurbishment of pumping station","Cambs and Bedfordshire","Anglian Central"]
["ACC451I/004A/191A","Ouse Washes Water Level Management Improvement Scheme","Cambs and Bedfordshire","Anglian Central"]
["ACC451E/000A/603A","St Neots Brook Street Flood Risk Management Scheme","Cambs and Bedfordshire","Anglian Central"]
["ACS451E/001A/004A","Wash East Coastal Management Strategy - Works arising ","Cambs and Bedfordshire","Anglian Central"]
["ACC451I/004A/007A","Knowles Sluice - Refurbishment","Cambs and Bedfordshire","Anglian Central"]
["ACC451I/004A/142A","Merries Farm Sluice - Refurbishment","Cambs and Bedfordshire","Anglian Central"]
["ACC451I/000A/001A","Ledburn Flood Risk Management Scheme","Cambs and Bedfordshire","Anglian Central"]
["ACC451I/000A/003A","Caldecotte Flood Risk Management Scheme","Cambs and Bedfordshire","Anglian Central"]
["ACC451E/000A/597A","Great Ouse Property Level Protection Scheme","Cambs and Bedfordshire","Anglian Central"]
["AEC503E/003A/001A","Broadland Public, Private, Partnership Project","Essex Norfolk and Suffolk","Anglian Eastern"]
["AEO000E/000A/043A","ARHCP: BAP Habitat Creation","Essex Norfolk and Suffolk","Anglian Eastern"]
["AEC506E/000A/007A","Scarhouse Dyke - Conveyance","Essex Norfolk and Suffolk","Anglian Eastern"]
["AES503E/008A/001B","Easton Broad Flood Management Project","Essex Norfolk and Suffolk","Anglian Eastern"]
["AEO000E/000A/323A","Hickling Reedbed Creation","Essex Norfolk and Suffolk","Anglian Eastern"]
["AES502C/000A/004A","Cromer Coast Protection Scheme","Essex Norfolk and Suffolk","Anglian Eastern"]
["AES502C/000A/005A","Sheringham West Coast Protection Scheme","Essex Norfolk and Suffolk","Anglian Eastern"]
["AEO000E/000A/394A","Barnby North Cove Pumping Station Reorganisation","Essex Norfolk and Suffolk","Anglian Eastern"]
["AEO000E/000A/358A","Needham Market flood risk management project","Essex Norfolk and Suffolk","Anglian Eastern"]
["AEC506E/000A/019A","Sandford Mill -  Bridge Removal ","Essex Norfolk and Suffolk","Anglian Eastern"]
["AES501E/000A/010A\n","Cley Salthouse Water Level Management Plan","Essex Norfolk and Suffolk","Anglian Eastern"]
["AES504E/005A/017A","Tilbury Barrier - Dual Function Lock Gate","Essex Norfolk and Suffolk","Anglian Eastern"]
["AEC504F/000A/002A","Ipswich - Stone Lodge Park Sustainable Urban Drainage","Essex Norfolk and Suffolk","Anglian Eastern"]
["AES503C/000A/004A","Felixstowe South.  Works to replace groyne navigation marks over SCDC and EA frontages.","Essex Norfolk and Suffolk","Anglian Eastern"]
["AEO000E/000A/357A","Methwold Reedbed Creation","Essex Norfolk and Suffolk","Anglian Eastern"]
["AES503E/008A/006A","Lowestoft Flood Risk Management Project","Essex Norfolk and Suffolk","Anglian Eastern"]
["AES502E/002A/002C","Great Yarmouth Tidal Defences - Compartment C - Stage 2 - 2016 to 2021","Essex Norfolk and Suffolk","Anglian Eastern"]
["AES504C/000A/008A","Clacton Holland on Sea Management Plan Implementation Phase 1 (Zones B and C)","Essex Norfolk and Suffolk","Anglian Eastern"]
["AES502C/002A/001A","Gorleston Coast Protection Scheme","Essex Norfolk and Suffolk","Anglian Eastern"]
["AES503C/010A/001A","Aldeburgh Town Frontage Works","Essex Norfolk and Suffolk","Anglian Eastern"]
["AES503E/000A/024A","Aldeburgh Town Marsh Seawall Refurbishment","Essex Norfolk and Suffolk","Anglian Eastern"]
["AEC506E/000A/025A","Ashingdon Community Flood Risk Alleviation","Essex Norfolk and Suffolk","Anglian Eastern"]
["AEC503I/003A/110A","Ashtree Pumping Station Replacement","Essex Norfolk and Suffolk","Anglian Eastern"]
["AEO000E/000A/393A","Askews Pump Replacement, Haddiscoe","Essex Norfolk and Suffolk","Anglian Eastern"]
["AEC503E/000A/019A","Aylsham - Investigating Property Level Protection","Essex Norfolk and Suffolk","Anglian Eastern"]
["AES502E/000A/004A","Bacton Gas Terminal to Ostend Coastal Management Scheme","Essex Norfolk and Suffolk","Anglian Eastern"]
["AES504E/003A/003B","Barling Marsh Embankment & Outfall works","Essex Norfolk and Suffolk","Anglian Eastern"]
["AEC504I/001A/015A","Barsham Pump Replacement and AWS installation","Essex Norfolk and Suffolk","Anglian Eastern"]
["AEO000F/000A/001A","Basildon (North West Billericay) Surface Water Scheme","Essex Norfolk and Suffolk","Anglian Eastern"]
["AES503C/007A/002A","Bawdsey / Deben Estuary Mouth Works 2021","Essex Norfolk and Suffolk","Anglian Eastern"]
["AES503C/000A/003A","Bawdsey Manor and Deben Estuary Mouth Works. ","Essex Norfolk and Suffolk","Anglian Eastern"]
["AEC503E/000A/010A","Beccles - Investigation into flood alleviation ","Essex Norfolk and Suffolk","Anglian Eastern"]
["AES503E/000A/031A","Benacre Pumping Station Options Appraisal And Implementation ","Essex Norfolk and Suffolk","Anglian Eastern"]
["AEC503I/003A/006A","Berney Arms Pumping Station Refurbishment","Essex Norfolk and Suffolk","Anglian Eastern"]
["AEC503I/003A/084A","Blundeston Pump Replacement","Essex Norfolk and Suffolk","Anglian Eastern"]
["AES503E/000A/028A","Blyth Strategy Secondary Defences Buss Creek","Essex Norfolk and Suffolk","Anglian Eastern"]
["AES503E/000A/029A","Blyth Strategy Secondary Defences Reydon","Essex Norfolk and Suffolk","Anglian Eastern"]
["AES503E/000A/030A","Blyth Strategy Secondary Defences Walberswick","Essex Norfolk and Suffolk","Anglian Eastern"]
["AEC505E/000A/031A","Bocking Churchstreet Community Flood Risk Alleviation","Essex Norfolk and Suffolk","Anglian Eastern"]
["AEO000E/000A/593A","Boxford Flood Risk Management Project","Essex Norfolk and Suffolk","Anglian Eastern"]
["AEC505E/000A/030A","Braintree Community Flood Risk Alleviation","Essex Norfolk and Suffolk","Anglian Eastern"]
["AEC504E/000A/021A","Bramfield Flood Risk Management Project","Essex Norfolk and Suffolk","Anglian Eastern"]
["AEC503I/003A/111A","Breydon Pumping Station Replacement","Essex Norfolk and Suffolk","Anglian Eastern"]
["AEC503I/003A/005A","Brograve Pumping Station Replacement of Bridges","Essex Norfolk and Suffolk","Anglian Eastern"]
["AEC503F/000A/003A","Sudbury  Great Cornard flood risk management project","Essex Norfolk and Suffolk","Anglian Eastern"]
["AEC503I/003A/113A","Buckenham Pumping Station Replacement","Essex Norfolk and Suffolk","Anglian Eastern"]
["AEC506E/000A/027A","Bulphan Community Flood Risk Mitigation","Essex Norfolk and Suffolk","Anglian Eastern"]
["AEC505E/000A/021A","Bures Flood Risk Management Project","Essex Norfolk and Suffolk","Anglian Eastern"]
["AEC504I/001A/017A","Burgh Saint Peter Pump Replacement","Essex Norfolk and Suffolk","Anglian Eastern"]
["AEC504I/001A/002A","Butley Pumping Station Refurbishment","Essex Norfolk and Suffolk","Anglian Eastern"]
["AEC503E/000A/040A","Buxton - flood risk management","Essex Norfolk and Suffolk","Anglian Eastern"]
["AEC501E/000A/009A\n","Caister on Sea Flood Risk Mitigation Project","Essex Norfolk and Suffolk","Anglian Eastern"]
["AES502C/000A/015A","Caister sea wall completion","Essex Norfolk and Suffolk","Anglian Eastern"]
["AEC503I/003A/088A","Caldecott Pump Replacement","Essex Norfolk and Suffolk","Anglian Eastern"]
["AEC504E/000A/020A","Carlton cum Kelsale Flood Risk Management Project","Essex Norfolk and Suffolk","Anglian Eastern"]
["AEC506E/000A/029A","Castle Hedingham Community Fluvial Flood Risk Alleviation","Essex Norfolk and Suffolk","Anglian Eastern"]
["AEO000F/000A/004A","Castle Point- New Thundersley","Essex Norfolk and Suffolk","Anglian Eastern"]
["AEC503I/003A/008A","Catfield Pumping Station Replacement","Essex Norfolk and Suffolk","Anglian Eastern"]
["AES503C/009A/002A","Central Felixstowe Coast Protection Works - Spa flood wall 2021.  ","Essex Norfolk and Suffolk","Anglian Eastern"]
["AEO000E/000A/417A","Chalkney Mill Refurbishment ","Essex Norfolk and Suffolk","Anglian Eastern"]
["AEC503I/003A/154A","Chapelfield Drainage Improvements","Essex Norfolk and Suffolk","Anglian Eastern"]
["AEC503I/003A/115A","Chapelfield Pumping Station Replacement","Essex Norfolk and Suffolk","Anglian Eastern"]
["AEC504I/001A/003A","Chillesford Pumping Station Refurbishment","Essex Norfolk and Suffolk","Anglian Eastern"]
["AES504E/000A/034A\n","Cinder Path, Chalkwell Station to Leigh High Street","Essex Norfolk and Suffolk","Anglian Eastern"]
["AEC505E/000A/033A","Clacton Community Fluvial Flood Risk Alleviation","Essex Norfolk and Suffolk","Anglian Eastern"]
["AES504C/000A/007A","Clacton Holland on Sea Management Plan Implementation Phase 2 (Zone A)","Essex Norfolk and Suffolk","Anglian Eastern"]
["AEC505E/000A/024A","Clare - Investigation into flood alleviation ","Essex Norfolk and Suffolk","Anglian Eastern"]
["AEC501E/000A/008A","Cley - Communities at Risk","Essex Norfolk and Suffolk","Anglian Eastern"]
["AEO000E/000A/406A","Coggeshall and Kelvedon Community Flood Alleviation","Essex Norfolk and Suffolk","Anglian Eastern"]
["AEC505E/000A/034A","Colchester Community FLuvial Flood Risk Alleviation","Essex Norfolk and Suffolk","Anglian Eastern"]
["AEC501E/000A/006A","Corpusty and Saxthorpe - Communities at Risk","Essex Norfolk and Suffolk","Anglian Eastern"]
["AEC504E/000A/006A","Debenham Flood Alleviation Scheme","Essex Norfolk and Suffolk","Anglian Eastern"]
["AEC505E/000A/035A","Dedham Community Flood Risk Alleviation","Essex Norfolk and Suffolk","Anglian Eastern"]
["AEC503E/001A/007A","Diss Flood Risk Mitigation Scheme","Essex Norfolk and Suffolk","Anglian Eastern"]
["AEC503I/003A/116A","Doles Pumping Station Replacement","Essex Norfolk and Suffolk","Anglian Eastern"]
["AEO000E/000A/412A","East Terrace Breakwater to Walton on Naze","Essex Norfolk and Suffolk","Anglian Eastern"]
["AEC503I/003A/118A","Eastfield Pumping Station Replacement","Essex Norfolk and Suffolk","Anglian Eastern"]
["AEO000E/000A/409A","Eastwood Brook  - Southend Community Flood Risk Alleviation","Essex Norfolk and Suffolk","Anglian Eastern"]
["AES502E/001A/002A","Eccles to Winterton Coastal Management Stage 2","Essex Norfolk and Suffolk","Anglian Eastern"]
["AES502E/001A/004A","Eccles to Winterton Coastal Management Stage 4 and 5","Essex Norfolk and Suffolk","Anglian Eastern"]
["AEC503E/000A/023A","Fakenham - flood risk management","Essex Norfolk and Suffolk","Anglian Eastern"]
["AEC503C/000A/009A","Felixstowe North -  Works to recharge, improve groynes and part seawall 2027","Essex Norfolk and Suffolk","Anglian Eastern"]
["AES503C/000A/005A","Felixstowe South - Works to renew and raise seawall","Essex Norfolk and Suffolk","Anglian Eastern"]
["AES503C/000A/007A","Felixstowe South - Works to replace old timber / concrete groynes","Essex Norfolk and Suffolk","Anglian Eastern"]
["AES503C/000A/006A","Felixstowe South and Central -Works to recharge Central and South beaches","Essex Norfolk and Suffolk","Anglian Eastern"]
["AEC503E/000A/032A","Filby - flood risk management","Essex Norfolk and Suffolk","Anglian Eastern"]
["AEC503I/003A/119A","Five Mile Pumping Statioin Improvements","Essex Norfolk and Suffolk","Anglian Eastern"]
["AEC505E/000A/028A","Fleet Hall, Rochford Embankment Works","Essex Norfolk and Suffolk","Anglian Eastern"]
["AEC503E/000A/033A","Fleggburgh - flood risk management","Essex Norfolk and Suffolk","Anglian Eastern"]
["AEO000E/000A/594A","Flood Alleviation Scheme Norwich, Oak Lane","Essex Norfolk and Suffolk","Anglian Eastern"]
["AEC505E/000A/036A","Fordstreet Community Flood Risk Alleviation","Essex Norfolk and Suffolk","Anglian Eastern"]
["AEC504E/000A/016A","Framlingham Flood Risk Management Project","Essex Norfolk and Suffolk","Anglian Eastern"]
["AEC504I/001A/006A","Gedgrave Pumping Station Refurbishment","Essex Norfolk and Suffolk","Anglian Eastern"]
["AEC505E/000A/037A","Great Bardfield Community Flood Risk Alleviation","Essex Norfolk and Suffolk","Anglian Eastern"]
["AEC504E/000A/017A","Great Blakenham Flood risk management project","Essex Norfolk and Suffolk","Anglian Eastern"]
["AES504E/003A/004A","Great Wakering","Essex Norfolk and Suffolk","Anglian Eastern"]
["AEC503F/000A/004A","Great Yarmouth Surface Water Mitigation Project","Essex Norfolk and Suffolk","Anglian Eastern"]
["AES502E/002A/002D","Great Yarmouth Tidal Defences - Compartment C - Stage 3 - 2021 to 2026","Essex Norfolk and Suffolk","Anglian Eastern"]
["AES502E/002A/002E","Great Yarmouth Tidal Defences - Compartment C - Stage 4 - 2026 to 2031","Essex Norfolk and Suffolk","Anglian Eastern"]
["AEC503I/003A/096A","Haddiscoe Pump Replacement","Essex Norfolk and Suffolk","Anglian Eastern"]
["AEC504E/000A/014A","Halesworth flood risk management project","Essex Norfolk and Suffolk","Anglian Eastern"]
["AEO000E/002A/192A","Halstead Mill Bypass Gates - Townsford Mill","Essex Norfolk and Suffolk","Anglian Eastern"]
["AEC503E/001A/008A","Harleston Flood Risk Mitigation Scheme","Essex Norfolk and Suffolk","Anglian Eastern"]
["AEC506E/000A/033A","Haverings Grove Community Flood Risk Alleviation","Essex Norfolk and Suffolk","Anglian Eastern"]
["AEC503I/003A/121A","Heigham Holmes Pumping Station Replacement","Essex Norfolk and Suffolk","Anglian Eastern"]
["AEC501E/000A/010A","Hemsby Flood Risk Mitigation Project","Essex Norfolk and Suffolk","Anglian Eastern"]
["AEC503I/003A/122A","Hermitage Pumping Station Improvement","Essex Norfolk and Suffolk","Anglian Eastern"]
["AEO000E/000A/407A","Heybridge Community Flood Risk Alleviation","Essex Norfolk and Suffolk","Anglian Eastern"]
["AEC503I/003A/155A","Hickling Drainage Improvements","Essex Norfolk and Suffolk","Anglian Eastern"]
["AEC503E/000A/025A","Hill Common - flood risk management","Essex Norfolk and Suffolk","Anglian Eastern"]
["AES502C/002A/002A","Hopton to Corton - Hopton Great Yarmouth and Corton - structure management works","Essex Norfolk and Suffolk","Anglian Eastern"]
["AEC503E/000A/011A","Horning Flood risk management scheme","Essex Norfolk and Suffolk","Anglian Eastern"]
["AEC503I/003A/123A","Horning Grove Pumping Station Replacement","Essex Norfolk and Suffolk","Anglian Eastern"]
["AEC503I/003A/125A","Horse Fen Pumping Station Replacement","Essex Norfolk and Suffolk","Anglian Eastern"]
["AEC503E/000A/036A","Horsey - flood risk management","Essex Norfolk and Suffolk","Anglian Eastern"]
["AEC503I/003A/053A","Horsey Boat Dyke Culvert Works","Essex Norfolk and Suffolk","Anglian Eastern"]
["AEC503E/000A/042A","Horsey Corner - Investigation","Essex Norfolk and Suffolk","Anglian Eastern"]
["AEC503I/003A/126A","Horsey Pumping Station Replacement","Essex Norfolk and Suffolk","Anglian Eastern"]
["AEC504E/000A/019A","Hundon flood risk management project","Essex Norfolk and Suffolk","Anglian Eastern"]
["AEC504I/001A/009A","Iken Pumping Station Refurbishment","Essex Norfolk and Suffolk","Anglian Eastern"]
["AES503E/000A/026A","Iken Seawall Refurbishment","Essex Norfolk and Suffolk","Anglian Eastern"]
["AEC503E/000A/022A","Ingham Corner - flood risk management","Essex Norfolk and Suffolk","Anglian Eastern"]
["AEC503I/003A/127A","Irstead Pumping Station Replacement","Essex Norfolk and Suffolk","Anglian Eastern"]
["AES504E/007A/006A","Jaywick Beach Recharge","Essex Norfolk and Suffolk","Anglian Eastern"]
["AES504E/001A/005A","Jewson's Yard (Manningtree) Piling","Essex Norfolk and Suffolk","Anglian Eastern"]
["AEC505E/000A/026A","Lavenham - Flood Risk Investigation","Essex Norfolk and Suffolk","Anglian Eastern"]
["AEC504E/003A/009A","Laxfield Flood Risk Investigation","Essex Norfolk and Suffolk","Anglian Eastern"]
["AEC504F/000A/004A","Leiston Flood Alleviation Scheme","Essex Norfolk and Suffolk","Anglian Eastern"]
["AEC503E/000A/026A","Lenwade - flood risk management","Essex Norfolk and Suffolk","Anglian Eastern"]
["AEC503E/000A/016A","Lessingham - Flood Risk Investigation","Essex Norfolk and Suffolk","Anglian Eastern"]
["AEC501E/000A/005A","Letheringsett - Flood Risk Investigation","Essex Norfolk and Suffolk","Anglian Eastern"]
["AEO000E/002A/500A","Lothingland Hundred System and Structure Appraisals","Essex Norfolk and Suffolk","Anglian Eastern"]
["AEC503I/003A/128A","Ludham Bridge Pumping Station Improvement","Essex Norfolk and Suffolk","Anglian Eastern"]
["AES502C/000A/014A","Management and removal of redundant coastal defences Weybourne to Cart Gap","Essex Norfolk and Suffolk","Anglian Eastern"]
["AEC503I/003A/022A","Management of  Acle Landspring and Pumping Station","Essex Norfolk and Suffolk","Anglian Eastern"]
["AEC503I/003A/004A","Martham Boat Dyke Culvert Replacement","Essex Norfolk and Suffolk","Anglian Eastern"]
["AEC503I/003A/003A","Martham Cess Pumping Station Replacement","Essex Norfolk and Suffolk","Anglian Eastern"]
["AEC503I/003A/129A","Mautby Pumping Station Replacement","Essex Norfolk and Suffolk","Anglian Eastern"]
["AEC504E/003A/008A","Melton Culvert Scheme","Essex Norfolk and Suffolk","Anglian Eastern"]
["AES503E/000A/033A","Minsmere Levels Outfall Refurbishment","Essex Norfolk and Suffolk","Anglian Eastern"]
["AEC501E/000A/007A","Mundesley -- Communities at Risk","Essex Norfolk and Suffolk","Anglian Eastern"]
["AES502C/000A/012A","Mundesley Coast Protection Scheme","Essex Norfolk and Suffolk","Anglian Eastern"]
["AEC505E/000A/023A","Nayland - Investigation into flood alleviation ","Essex Norfolk and Suffolk","Anglian Eastern"]
["AEC506E/000A/022A","Nevendon Brook Borwick Lane","Essex Norfolk and Suffolk","Anglian Eastern"]
["AEC506E/000A/039A","North Benfleet Community Flood Risk Alleviation","Essex Norfolk and Suffolk","Anglian Eastern"]
["AEC501F/000A/004A","North Walsham Sustainable Urban Drainage Retrofit Scheme","Essex Norfolk and Suffolk","Anglian Eastern"]
["AEC503E/000A/008A","Norwich Flood Protection","Essex Norfolk and Suffolk","Anglian Eastern"]
["AEC501F/000A/002A","Norwich: Catton Grove and Sewell Sustainable Urban drainage Retrofit Scheme","Essex Norfolk and Suffolk","Anglian Eastern"]
["AEC503F/000A/002A","Norwich: Drayton Sustainable Urban drainage Retrofit Scheme","Essex Norfolk and Suffolk","Anglian Eastern"]
["AEC501F/000A/001A","Norwich: Nelson and Town Close Sustainable Urban drainage Retrofit Scheme","Essex Norfolk and Suffolk","Anglian Eastern"]
["AEC506E/000A/044A","Old Wickford Road, South Woodham Ferrers PLP Scheme","Essex Norfolk and Suffolk","Anglian Eastern"]
["AES503E/000A/025A","Orford with Gedgrave and Sudbourne Seawall Refurbishment","Essex Norfolk and Suffolk","Anglian Eastern"]
["AEC503E/000A/030A","Ormesby St Michael and Ormesby St Margaret - Flood Risk Investigation","Essex Norfolk and Suffolk","Anglian Eastern"]
["AES502E/000A/003A","Overstrand Coast Protection Scheme","Essex Norfolk and Suffolk","Anglian Eastern"]
["AEO000E/000A/419A","Parkeston Port Long Term Assessment","Essex Norfolk and Suffolk","Anglian Eastern"]
["AEC503E/000A/035A","Pilson Green - flood risk management","Essex Norfolk and Suffolk","Anglian Eastern"]
["AEC503I/003A/130A","Postwick Pumping Station Replacement","Essex Norfolk and Suffolk","Anglian Eastern"]
["AEC503I/003A/132A","Potter Heigham Pumping Station Replacement","Essex Norfolk and Suffolk","Anglian Eastern"]
["AEC503I/003A/109A","Raveningham Pump Replacement and AWS install","Essex Norfolk and Suffolk","Anglian Eastern"]
["AEO000E/000A/159A","Removal of Thames Lighters from Heybridge","Essex Norfolk and Suffolk","Anglian Eastern"]
["AEC503I/003A/133A","Repps Pumping Station Improvement","Essex Norfolk and Suffolk","Anglian Eastern"]
["AEO000E/000A/420A","Rivershouse Mill Refurbishment ","Essex Norfolk and Suffolk","Anglian Eastern"]
["AEO000F/000A/006A","Rochford - Hockley - Surface Water Scheme","Essex Norfolk and Suffolk","Anglian Eastern"]
["AEO000F/000A/017A","Rochford Rayleigh West","Essex Norfolk and Suffolk","Anglian Eastern"]
["AEC506E/000A/021A","Sandford Mill Cottages Defence Repairs  Pump Installation","Essex Norfolk and Suffolk","Anglian Eastern"]
["AEC504E/000A/015A","Saxmundham flood risk management project","Essex Norfolk and Suffolk","Anglian Eastern"]
["AES502C/002A/003A","Scratby Coast Protection Scheme (was Scratby Rock Berm Extension)","Essex Norfolk and Suffolk","Anglian Eastern"]
["AES504E/000A/033A","Seawick Sea Defence","Essex Norfolk and Suffolk","Anglian Eastern"]
["AEC503I/003A/134A","Seven Mile Pumping Station Replacement, Reedham","Essex Norfolk and Suffolk","Anglian Eastern"]
["AEC501F/000A/006A","Sheringham Sustainable Urban Drainage Retrofit Scheme","Essex Norfolk and Suffolk","Anglian Eastern"]
["AES504F/000A/008A","Shoebury Common Flood Defence Improvements","Essex Norfolk and Suffolk","Anglian Eastern"]
["AEC504I/001A/024A","Short Dam Pump Automatic Weedscreen","Essex Norfolk and Suffolk","Anglian Eastern"]
["AEC505E/000A/047A","Sible Hedingham Community Flood Risk Alleviation","Essex Norfolk and Suffolk","Anglian Eastern"]
["AES503E/000A/027A","Snape","Essex Norfolk and Suffolk","Anglian Eastern"]
["AEC503I/003A/137A","Somerton North Pumping Station Replacement","Essex Norfolk and Suffolk","Anglian Eastern"]
["AEC503I/003A/139A","Somerton South Pumping Station Replacement","Essex Norfolk and Suffolk","Anglian Eastern"]
["AEC503E/000A/017A","St Olaves - Flood Risk Investigation","Essex Norfolk and Suffolk","Anglian Eastern"]
["AEO000E/000A/410A","Stanford-le-Hope Surface Water Flood Alleviation Scheme","Essex Norfolk and Suffolk","Anglian Eastern"]
["AEC501E/000A/002A","Stiffkey - Flood Risk Investigation","Essex Norfolk and Suffolk","Anglian Eastern"]
["AEC503I/003A/142A","Stokesby Pumping Station Replacement","Essex Norfolk and Suffolk","Anglian Eastern"]
["AEC504E/000A/013A","Stowmarket flood risk management project","Essex Norfolk and Suffolk","Anglian Eastern"]
["AEC505E/000A/025A","Stratford St. Mary - Flood Alleviation Scheme","Essex Norfolk and Suffolk","Anglian Eastern"]
["AEO000E/000A/559A","Structure Review for Stour","Essex Norfolk and Suffolk","Anglian Eastern"]
["AEC503I/003A/143A","Stubb Pumping Station Replacement","Essex Norfolk and Suffolk","Anglian Eastern"]
["AEC504I/001A/013A","Sudbourne Pumping Station Refurbishment","Essex Norfolk and Suffolk","Anglian Eastern"]
["AES503E/003A/003A","Thorpeness erosion response works 2015","Essex Norfolk and Suffolk","Anglian Eastern"]
["AES503E/000A/032A","Thorpeness Hundred Outfall Refurbishment","Essex Norfolk and Suffolk","Anglian Eastern"]
["AEC503E/000A/029A","Thurne - flood risk management","Essex Norfolk and Suffolk","Anglian Eastern"]
["AEC503I/003A/145A","Thurne Pumping Station Improvement","Essex Norfolk and Suffolk","Anglian Eastern"]
["AEO000E/000A/411A","Tilbury Town Surface Water Flood Alleviation","Essex Norfolk and Suffolk","Anglian Eastern"]
["AEC503I/003A/148A","Tunstall Pumping Station Replacement","Essex Norfolk and Suffolk","Anglian Eastern"]
["AES504E/000A/031A","Walton on Naze Nature Reserve Counter Wall","Essex Norfolk and Suffolk","Anglian Eastern"]
["AEC503I/003A/149A","Wayford Bridge Pumping Station Replacement","Essex Norfolk and Suffolk","Anglian Eastern"]
["AES504E/000A/030A","West Clacton to Jaywick Sea defences","Essex Norfolk and Suffolk","Anglian Eastern"]
["AEC504I/001A/027A","Wheatacre Pump Replacement","Essex Norfolk and Suffolk","Anglian Eastern"]
["AEC504E/000A/018A","Wickham Market - Investigation into flood ","Essex Norfolk and Suffolk","Anglian Eastern"]
["AEC501E/000A/003A","Wiveton - Flood Risk Investigation","Essex Norfolk and Suffolk","Anglian Eastern"]
["AES504C/000A/006A","Works arising from Southend Strategy","Essex Norfolk and Suffolk","Anglian Eastern"]
["AEO000E/000A/391A","Works arrising from Chelmsford City Surface Water Management Plan","Essex Norfolk and Suffolk","Anglian Eastern"]
["AEO000E/000A/389A","Works arrising from Colchester Town Surface Water Management Plan","Essex Norfolk and Suffolk","Anglian Eastern"]
["AEO000E/000A/390A","Works arrising from Maldon Surface Water Management Plan","Essex Norfolk and Suffolk","Anglian Eastern"]
["AEC503E/000A/039A","Worthing - flood risk management","Essex Norfolk and Suffolk","Anglian Eastern"]
["AEO000E/002A/499A","Wrentham System Appraisal - Structures and Channel","Essex Norfolk and Suffolk","Anglian Eastern"]
["AEC503E/001A/009A","Wymondham Flood Risk Mitigation Scheme","Essex Norfolk and Suffolk","Anglian Eastern"]
["","In year project opportunities","Essex Norfolk and Suffolk","Anglian Eastern"]
["","Posts","Essex Norfolk and Suffolk","Anglian Eastern"]
["","revenue maintenance support","Essex Norfolk and Suffolk","Anglian Eastern"]
["AEC503E/000A/012A","Potter Heigham, Bastwick, Martham Ferry and Repps - Flood Risk Management Project","Essex Norfolk and Suffolk","Anglian Eastern"]
["AEC503E/000A/013A","Hoveton and Wroxham - Flood Risk Management Project","Essex Norfolk and Suffolk","Anglian Eastern"]
["AEC503E/000A/014A","Brundall Flood risk management scheme","Essex Norfolk and Suffolk","Anglian Eastern"]
["AEC501E/001A/005A","South Creake - Flood Alleviation","Essex Norfolk and Suffolk","Anglian Eastern"]
["AEC505E/000A/051A","Witham Community Flood Risk Alleviation","Essex Norfolk and Suffolk","Anglian Eastern"]
["AEC506E/000A/034A","Heybridge (near Ingatestone) Community Flood Risk Alleviation","Essex Norfolk and Suffolk","Anglian Eastern"]
["AEC503E/001A/005A","Bungay Flood Alleviation Scheme","Essex Norfolk and Suffolk","Anglian Eastern"]
["AEC505E/000A/040A","Great Yeldham Community Flood Risk Alleviation","Essex Norfolk and Suffolk","Anglian Eastern"]
["AEC501E/001A/006A","Weybourne  - Flood Alleviation Scheme","Essex Norfolk and Suffolk","Anglian Eastern"]
["AES503C/000A/008A","Felixstowe North.  Works to recharge, improve groynes and part seawall 2017.","Essex Norfolk and Suffolk","Anglian Eastern"]
["AEC503I/003A/013A","Broads IDB Pumping StationTelemetry Improvements","Essex Norfolk and Suffolk","Anglian Eastern"]
["AEC503I/003A/099A","Langley Double Pump Replacement and Automatic Weedscreen Installation","Essex Norfolk and Suffolk","Anglian Eastern"]
["AEC505E/000A/042A","Little Waltham Community Flood Risk Alleviation","Essex Norfolk and Suffolk","Anglian Eastern"]
["AEC505E/000A/038A","Great Dunmow Community Flood Risk Alleviation","Essex Norfolk and Suffolk","Anglian Eastern"]
["AEC506E/000A/041A","Rawreth and Rawreth Shot  Community Flood Risk Alleviation","Essex Norfolk and Suffolk","Anglian Eastern"]
["AEC504I/001A/001A","Bawdsey Pumping Station Refurbishment","Essex Norfolk and Suffolk","Anglian Eastern"]
["AEO000E/000A/064A","Anglian Regional Habitat Creation Programme (ARHCP)","Essex Norfolk and Suffolk","Anglian Eastern"]
["AEC505E/004A/001A","Chelmsford Flood Alleviation Scheme","Essex Norfolk and Suffolk","Anglian Eastern"]
["AEC503I/003A/114A","Cantley Pumping Station Replacement","Essex Norfolk and Suffolk","Anglian Eastern"]
["AEC505E/000A/027A","Cavendish - Communities at Risk","Essex Norfolk and Suffolk","Anglian Eastern"]
["AEC501F/000A/005A","Cromer Sustainable Urban Drainage Retrofit Scheme","Essex Norfolk and Suffolk","Anglian Eastern"]
["AEC503I/003A/101A","Langley Monks Pump Automatic Weedscreen","Essex Norfolk and Suffolk","Anglian Eastern"]
["AEO000E/000A/395A","Limpenhoe Pump Automatic Weedscreen","Essex Norfolk and Suffolk","Anglian Eastern"]
["AEC503I/003A/136A","Somerton North Pumping Station Automatic Weedscreen","Essex Norfolk and Suffolk","Anglian Eastern"]
["AEC503I/003A/138A","Somerton South Pumping Station Automatic Weedscreen","Essex Norfolk and Suffolk","Anglian Eastern"]
["AEC503I/003A/069A","Thurne Boat Dyke Culvert Replacement","Essex Norfolk and Suffolk","Anglian Eastern"]
["AEC503I/003A/147A","Tonnage Pumping Station Replacement","Essex Norfolk and Suffolk","Anglian Eastern"]
["AEC503I/003A/072A","Upton Boat Dyke Culvert Replacement","Essex Norfolk and Suffolk","Anglian Eastern"]
["AEO000E/000A/592A","Works arising from the South Essex Surface Water Management Plan ","Essex Norfolk and Suffolk","Anglian Eastern"]
["THE001E/000A/012A","Thames Estuary Asset Management 2100 Programme","Essex Norfolk and Suffolk","Anglian Eastern"]
["","Canvey Island, standby generators, May Avenue and St Annes pumping station","Essex Norfolk and Suffolk","Anglian Eastern"]
["","GiA Contribution towards dredging of Canvey Lake","Essex Norfolk and Suffolk","Anglian Eastern"]
["AEO000E/000A/341A","Works arising from Canvey Island IUD ","Essex Norfolk and Suffolk","Anglian Eastern"]
["ANS401E/001C/001A","Saltfleet to Gibraltar Point Strategy Works Arising","Lincs and Northants","Anglian Northern"]
["ANC403I/002A/002A","Telemetry Upgrade Upper Witham","Lincs and Northants","Anglian Northern"]
["ANC403I/002A/010A","Pyewipe Pumping Station Refurbishment","Lincs and Northants","Anglian Northern"]
["ANC403E/004A/001A","Boston Haven Works","Lincs and Northants","Anglian Northern"]
["ANC403I/002A/034A","Hobhole Refurbishment Programme","Lincs and Northants","Anglian Northern"]
["ANO000E/000A/380A","Welland & Nene Property Level Protection","Lincs and Northants","Anglian Northern"]
["ANC405I/001A/049A","Donningtons Pumping Station Refurbishment","Lincs and Northants","Anglian Northern"]
["ANS401E/001B/001A","Lincshore 2010 - 2015","Lincs and Northants","Anglian Northern"]
["ANC403F/000A/005A","Lincoln - Stamp End: Flood Risk and Drainage Improvement Scheme","Lincs and Northants","Anglian Northern"]
["ANC403I/005A/028A","Sempringham Fen Pumping Station Refurbishment","Lincs and Northants","Anglian Northern"]
["ANC403F/000A/023A","Newton Nr Haceby - Surface Water Flood Risk Improvement Works","Lincs and Northants","Anglian Northern"]
["ANC403E/000A/058A","Horncastle Improvements ","Lincs and Northants","Anglian Northern"]
["ANC404I/000A/006A","Culverted Watercourse Re-lining","Lincs and Northants","Anglian Northern"]
["ANC403I/002A/009A","Oxpasture Pumping Station Refurbishment","Lincs and Northants","Anglian Northern"]
["ANC402E/000A/027A","Louth Improvements ","Lincs and Northants","Anglian Northern"]
["ANC403F/000A/004A","Washingborough - Keeble Drive/Malvern Avenue: Flood Risk and Drainage Improvement Scheme","Lincs and Northants","Anglian Northern"]
["ANC403E/002A/003A","Potential Works Arising from Upper Witham Strategy Review","Lincs and Northants","Anglian Northern"]
["ANC403E/003C/001A","Potential Works Arising from Witham Opportunity Study - Lower","Lincs and Northants","Anglian Northern"]
["ANC404E/000A/057A","Welland Flood Banks refurbishment","Lincs and Northants","Anglian Northern"]
["ANC403I/002A/003A","Aubourn Pumping Station Refurbishment","Lincs and Northants","Anglian Northern"]
["ANC403I/003A/006A","Bardney Abbey Road Pumping Station Refurbishment","Lincs and Northants","Anglian Northern"]
["ANC403I/003A/007A","Bardney Fen , Pumping Station Refurbishment","Lincs and Northants","Anglian Northern"]
["ANC403I/003A/008A","Bardney Manor Farm, Pumping Station Refurbishment","Lincs and Northants","Anglian Northern"]
["ANO000E/000A/423A","Barlings Eau Wetland creation","Lincs and Northants","Anglian Northern"]
["ANC403I/002A/014A","Benington Pumping Station","Lincs and Northants","Anglian Northern"]
["ANC401I/000A/002A","Bentley Farm Pumping Station replacement","Lincs and Northants","Anglian Northern"]
["ANC405F/000A/004A","Berry Lane, Wootton - Surface Water Flood Risk Improvement Works","Lincs and Northants","Anglian Northern"]
["ANC403I/002A/041A","Billinghay Pumping Station Refurbishment","Lincs and Northants","Anglian Northern"]
["ANC403E/005A/001A","Black Sluice Catchment Works","Lincs and Northants","Anglian Northern"]
["ANC403I/002A/040A","Blankney Pumping Station Refurbishment","Lincs and Northants","Anglian Northern"]
["ANC403E/004A/002A","Boston Barrage/Barrier Works","Lincs and Northants","Anglian Northern"]
["ANC403I/002A/004A","Boultham Pumping Station - Phase 2","Lincs and Northants","Anglian Northern"]
["ANC404E/000A/001A","Bourne Eau Health and Safety Works","Lincs and Northants","Anglian Northern"]
["ANC402I/000A/028A","Boygrift Pumping Station Refurbishment","Lincs and Northants","Anglian Northern"]
["ANC403I/003A/001A","Branston Fen Engine Drain Culvert Replacement","Lincs and Northants","Anglian Northern"]
["ANC403I/003A/002A","Branston Fen Pumping Station Refurbishment","Lincs and Northants","Anglian Northern"]
["ANO000E/000A/462A","Brant River Restoration Flood Alleviation)CSF)Slowing the Flow Scheme","Lincs and Northants","Anglian Northern"]
["ANC401I/000A/003A","Brimmer Beck Pumping Station refurbishment","Lincs and Northants","Anglian Northern"]
["ANC403I/002A/035A","Broxholme Pumping Station","Lincs and Northants","Anglian Northern"]
["ANC401I/000A/006A","Candley Beck Pumping Station replacement","Lincs and Northants","Anglian Northern"]
["ACC451I/004A/139A","Chalk Lane Sluice - Refurbishment","Lincs and Northants","Anglian Northern"]
["ANC403I/002A/042A","Chapel Hill Pumping Station Refurbishment","Lincs and Northants","Anglian Northern"]
["ANC405I/001A/071A","Clay Lake Pumping Station Refurbishment","Lincs and Northants","Anglian Northern"]
["ANC403I/003A/009A","Conningsby Ings Pumping Stations Refurbishment","Lincs and Northants","Anglian Northern"]
["ANC403I/002A/032A","Culverted Watercourse Lining","Lincs and Northants","Anglian Northern"]
["ANC403I/005A/014A","Damford Pumping Station Flood Resilience","Lincs and Northants","Anglian Northern"]
["ANC405I/001A/030A","Dawsmere Pumping Station Refurbishment","Lincs and Northants","Anglian Northern"]
["ANC405I/001A/066A","Denhams Pumping Station Refurbishment","Lincs and Northants","Anglian Northern"]
["ANC403F/000A/021A","Digby - Surface Water Flood Risk Improvement Works","Lincs and Northants","Anglian Northern"]
["ANC403I/002A/043A","Digby Pumping Station Refurbishment","Lincs and Northants","Anglian Northern"]
["ANC403I/003A/010A","Dogdyke Pumping Station Refurbishment","Lincs and Northants","Anglian Northern"]
["ANC405I/001A/061A","Dog-in-a-doublet Pumping Station Refurbishment old and new","Lincs and Northants","Anglian Northern"]
["ANC405F/000A/011A","Duck End & Freeman's Lane, Denford - Surface Water Flood Risk Improvement Works","Lincs and Northants","Anglian Northern"]
["ANC403I/003A/016A","Duckpool & Stixwould Pumping Station Refurbishment","Lincs and Northants","Anglian Northern"]
["ANC404E/000A/058A","East & West Fen Catchwater Slowing the Flow Attenuation Scheme","Lincs and Northants","Anglian Northern"]
["ANC405F/000A/007A","East Street, Long Buckby - Surface Water Flood Risk Improvement Works","Lincs and Northants","Anglian Northern"]
["ANC405F/000A/010A","Elmington A605 - Surface Water Flood Risk Improvement Works","Lincs and Northants","Anglian Northern"]
["ANC403I/002A/044A","Farroway Pumping Station Refurbishment","Lincs and Northants","Anglian Northern"]
["ANC404I/000A/004A","Five Towns Sluice Refurbishment","Lincs and Northants","Anglian Northern"]
["ANC405I/001A/056A","Fleet Fen Pumping Station Refurbishment","Lincs and Northants","Anglian Northern"]
["ANC405I/001A/033A","Fleet Haven Pumping Station Refurbishment","Lincs and Northants","Anglian Northern"]
["ANC403E/000A/074A","Fossbank Floodwall works, Lincoln","Lincs and Northants","Anglian Northern"]
["ANO000E/000A/430A","Foston Beck Slowing the Flow Attenuation/CSF Scheme","Lincs and Northants","Anglian Northern"]
["ANC404E/000A/055A","Greatford Flood Alleviation Scheme","Lincs and Northants","Anglian Northern"]
["ANC405F/000A/013A","Grendon Flood Risk Management scheme","Lincs and Northants","Anglian Northern"]
["ANC405F/000A/005A","Hall Yard, Kings Cliffe - Surface Water Flood Risk Improvement Works","Lincs and Northants","Anglian Northern"]
["ANC405E/000A/101A","Harpers Brook Flood Alleviation Scheme","Lincs and Northants","Anglian Northern"]
["ANC403I/002A/045A","Heighington Pumping Station Refurbishment","Lincs and Northants","Anglian Northern"]
["ANC403I005A037A","Helpringham Fen Pumping Station Refurbishment","Lincs and Northants","Anglian Northern"]
["ANC403I/002A/016A","Hobhole Pumping Station","Lincs and Northants","Anglian Northern"]
["ANC405I/001A/051A","Holbeach Bank Pumping Station Refurbishment","Lincs and Northants","Anglian Northern"]
["ANC403I/005A/043A","Horbling Fen Pumping Station Pump Capacity Increase","Lincs and Northants","Anglian Northern"]
["ANC403F/000A/026A","Horncastle - Surface Water Flood Risk Improvement Works","Lincs and Northants","Anglian Northern"]
["ANC402I/000A/027A","Howdales Pumping Station Refurbishment","Lincs and Northants","Anglian Northern"]
["ANC405I/001A/060A","Hundreds Pumping Station Refurbishment","Lincs and Northants","Anglian Northern"]
["ANO000E/000A/475A","Isolated Properties Property Level Protection","Lincs and Northants","Anglian Northern"]
["ANC403F/000A/020A","Keelby - Surface Water Flood Risk Improvement Works","Lincs and Northants","Anglian Northern"]
["ANC403I/003A/003A","Kirkby on Bain - Surface Water Flood Risk Improvement Works","Lincs and Northants","Anglian Northern"]
["ANC403I/003A/012A","Kirkstead Pumping Station Refurbishment","Lincs and Northants","Anglian Northern"]
["ANC403I/002A/017A","Lade Bank Pumping Station","Lincs and Northants","Anglian Northern"]
["ANC403I/005A/039A","Langrick Road Boston pipe replacement","Lincs and Northants","Anglian Northern"]
["ANC405I/001A/052A","Lawyers Pumping Station Refurbishment","Lincs and Northants","Anglian Northern"]
["ANC403E/000A/075A","Leasingham - Surface Water Flood Risk Improvement Works","Lincs and Northants","Anglian Northern"]
["ACC451I/004A/143A","Lighthouse Sluice - Refurbishment","Lincs and Northants","Anglian Northern"]
["ANC403F/000A/019A","Lincoln - Bunkers Hill - Surface Water Flood Risk Improvement Works","Lincs and Northants","Anglian Northern"]
["ANC405I/001A/055A","Little Holland Pumping Station Refurbishment","Lincs and Northants","Anglian Northern"]
["ANC403I/002A/019A","Littlemoor Lane Pumping Station","Lincs and Northants","Anglian Northern"]
["ANO000E/000A/476A","Local Communities at Risk - Surface Water Flood Risk Improvements","Lincs and Northants","Anglian Northern"]
["ANC405I/001A/048A","Lords Pumping Station Refurbishment","Lincs and Northants","Anglian Northern"]
["ANC405I/001A/053A","Lutton Leam Sluice Refurbishment","Lincs and Northants","Anglian Northern"]
["ACC451I/004A/140A","Main Sluice - Refurbishment","Lincs and Northants","Anglian Northern"]
["ANC403I/005A/031A","Maltings Lane Donington Pipe replacement","Lincs and Northants","Anglian Northern"]
["ANC404E/000A/044A","Market Harborough Defences","Lincs and Northants","Anglian Northern"]
["ANC405F/000A/015A","Market Harborough Town Centre","Lincs and Northants","Anglian Northern"]
["ANC403I/003A/013A","Marsh Lane Pumping Stations Refurbishment","Lincs and Northants","Anglian Northern"]
["ANC403E/000A/064A","Maud Foster Sluice Apron Refurbishment","Lincs and Northants","Anglian Northern"]
["ANC403I/002A/046A","Metheringham Pumping Station Refurbishment","Lincs and Northants","Anglian Northern"]
["ANC403F/000A/025A","Middle Rasen - Surface Water Flood Risk Improvement Works","Lincs and Northants","Anglian Northern"]
["ANO000E/000A/465A","Mow Beck CSF/Slowing the Flow Scheme","Lincs and Northants","Anglian Northern"]
["ANC405E/000A/045A","Nether Heyford Flood Alleviation Scheme","Lincs and Northants","Anglian Northern"]
["ANC405I/001A/068A","Newborough Pumping Station Refurbishment","Lincs and Northants","Anglian Northern"]
["ANC403I/002A/047A","Nocton Pumping Station Refurbishment","Lincs and Northants","Anglian Northern"]
["ANC403I/005A/040A","North Forty Foot drain revetments","Lincs and Northants","Anglian Northern"]
["ANC405I/001A/057A","Peartree Hill Pumping Station Refurbishment","Lincs and Northants","Anglian Northern"]
["ANC405I/001A/067A","Postland Pumping Station Refurbishment","Lincs and Northants","Anglian Northern"]
["ANC403I/002A/049A","Ringmoor Pumping Station Refurbishment","Lincs and Northants","Anglian Northern"]
["ANO000E/000A/458A","River Bain CSF/Slowing the Flow Scheme","Lincs and Northants","Anglian Northern"]
["ANO000E/000A/466A","River Bain Wetland Creation Scheme","Lincs and Northants","Anglian Northern"]
["ANC403F/000A/022A","Ruskington - Surface Water Flood Risk Improvement Works","Lincs and Northants","Anglian Northern"]
["ANC402I/000A/001A","Saltfleet Pumping Station Replacement","Lincs and Northants","Anglian Northern"]
["ANC403I/002A/023A","Sand Syke Pumping Station Refurbishment","Lincs and Northants","Anglian Northern"]
["ANC403I/002A/050A","Sandhill Beck Pumping Station Rehabilitation Scheme ","Lincs and Northants","Anglian Northern"]
["ANC403F/000A/027A","Scopwick - Surface Water Flood Risk Improvements ","Lincs and Northants","Anglian Northern"]
["ANC403I/003A/005A","SFF Pumping Station outfalls","Lincs and Northants","Anglian Northern"]
["ANC403I/003A/014A","Shortferry & Fiskerton Pumping Stations Rehabilitation Scheme ","Lincs and Northants","Anglian Northern"]
["ANC405E/003A/005A","Skew Bridge & Raunds Hog Dyke Culvert Improvement","Lincs and Northants","Anglian Northern"]
["ANO000E/000A/459A","South Forty Foot Catchment Slowing the Flow Attenuation Scheme","Lincs and Northants","Anglian Northern"]
["ANC401I/000A/012A","South Kelsey Pumping Station replacement","Lincs and Northants","Anglian Northern"]
["ANC403I/005A/044A","Southrey Pumping Station Refurbishment","Lincs and Northants","Anglian Northern"]
["ANC404E/005A/003A","Spalding Defences","Lincs and Northants","Anglian Northern"]
["ANC403I/003A/015A","Stainfield Fen, Pumping Stations Refurbishment","Lincs and Northants","Anglian Northern"]
["ANC404E/000A/056A","Stamford Flood Walls Refurbishment","Lincs and Northants","Anglian Northern"]
["ANO000E/000A/463A","Steeping Catchment Slowing the Flow Attenuation Scheme","Lincs and Northants","Anglian Northern"]
["ANC405I/001A/058A","Sutton Bridge Sluice replacement","Lincs and Northants","Anglian Northern"]
["ANC405I/001A/050A","Sutton St James Pumping Station Refurbishment","Lincs and Northants","Anglian Northern"]
["ANC403I/005A/015A","Swaton Resilience Scheme","Lincs and Northants","Anglian Northern"]
["ANC405F/000A/014A","Sywell Flood Risk Management Scheme","Lincs and Northants","Anglian Northern"]
["ANC402I/000A/029A","Theddlethorpe Pumping Station Refurbishment","Lincs and Northants","Anglian Northern"]
["ANC403F/000A/024A","Timberland - Surface Water Flood Risk Improvement Works","Lincs and Northants","Anglian Northern"]
["ANC403I/002A/051A","Timberland Pumping Station Refurbishment","Lincs and Northants","Anglian Northern"]
["ANC402E/000A/030A","Toynton St Peter - Surface Water Flood Risk Improvements ","Lincs and Northants","Anglian Northern"]
["ANC405I/001A/069A","Tydd Pumping Station Refurbishment","Lincs and Northants","Anglian Northern"]
["ANO000E/000A/460A","Upper Witham Catchment Slowing the Flow Attenuation Scheme","Lincs and Northants","Anglian Northern"]
["ANC401I/000A/014A","Waddingham Pumping Station replacement","Lincs and Northants","Anglian Northern"]
["ANC402E/000A/018A","Wainfleet Relief Channel ","Lincs and Northants","Anglian Northern"]
["ANC403I/002A/039A","Westborough FAS","Lincs and Northants","Anglian Northern"]
["ANO000E/000A/467A","Westborough River Restoration Flood Alleviation Scheme","Lincs and Northants","Anglian Northern"]
["ANC402E/000A/031A","Whaplode - Surface Water Flood Risk Improvements ","Lincs and Northants","Anglian Northern"]
["ANC405I/001A/054A","Wisemans Pumping Station Refurbishment","Lincs and Northants","Anglian Northern"]
["ANC403I/003A/017A","Woodhall Pumping Station Refurbishment","Lincs and Northants","Anglian Northern"]
["ANC405E/000A/105A","Wootton Brook Flood Risk Management","Lincs and Northants","Anglian Northern"]
["ANS402E/003A/001A","Works Arising from Wash Banks Strategy","Lincs and Northants","Anglian Northern"]
["ANC404I/000A/003A","Risegate Eau Sluice Refurbishment","Lincs and Northants","Anglian Northern"]
["ANC403I/002A/048A","North Kyme Pumping Station Refurbishment","Lincs and Northants","Anglian Northern"]
["YOS399E/001A/006A","Humber - Donna Nook","Lincs and Northants","Anglian Northern"]
["ANO000E/000A/212A","Northern Area Reservoirs Statutory Obligations","Lincs and Northants","Anglian Northern"]
["ANC403I/003A/011A","Greetwell, Pumping Stations Refurbishment","Lincs and Northants","Anglian Northern"]
["ANO000E/000A/429A","Managing water above Nettleham","Lincs and Northants","Anglian Northern"]
["ANC403I/002A/038A","Thorpe Pumping Station Environmental/Efficiency Scheme","Lincs and Northants","Anglian Northern"]
["ANC405I/001A/043A","Westmere Pumping Station and Sluice Refurbishment","Lincs and Northants","Anglian Northern"]
["ANC405E/000A/048A","Reservoirs: Whittlesey Washes Probable Maximum Flow Works","Lincs and Northants","Anglian Northern"]
["ANC405I/001A/070A","Stewards House Drain Improvements","Lincs and Northants","Anglian Northern"]
["ANC403I/002A/015A","Boston East Pumping Station","Lincs and Northants","Anglian Northern"]
["ANC405E/000A/102A","Brook Drain Flood Risk Management Peterborough","Lincs and Northants","Anglian Northern"]
["ANC405I/001A/062A","Cross Guns Pumping Station Refurbishment","Lincs and Northants","Anglian Northern"]
["ANC405I/001A/046A","Hundred of Wisbech Channel Conveyance Improvements","Lincs and Northants","Anglian Northern"]
["ANC405I/001A/063A","Mouth Lane Pumping Station Refurbishment","Lincs and Northants","Anglian Northern"]
["ANC405I/001A/065A","Poplars Pumping Station Refurbishment","Lincs and Northants","Anglian Northern"]
["ANC405E/000A/098A","Wansford Flood Alleviation Scheme","Lincs and Northants","Anglian Northern"]
["ANC405I/001A/064A","Willow Holt Pumping Station Refurbishment","Lincs and Northants","Anglian Northern"]
["ANC405E/002A/003A","Wisbech Defences Phase 2","Lincs and Northants","Anglian Northern"]
["ANC404E/005A/002A","Paston Brook Culverts Improvements","Lincs and Northants","Anglian Northern"]
["ANC401E/000A/018A","Grimsby Flood Alleviation Scheme (Fluvial)","Lincs and Northants","Anglian Northern"]
["ANS399E/001A/020A","Humber Grimsby Docks","Lincs and Northants","Anglian Northern"]
["ANC401F/000A/016A","Barnetby Woodland View Flood Alleviation Scheme","Lincs and Northants","Anglian Northern"]
["ANC401E/000A/004A","Ancholme Valley Improvements and Wetland Creation","Lincs and Northants","Anglian Northern"]
["ANC401I/000A/001A","Appleby Pumping Station replacement","Lincs and Northants","Anglian Northern"]
["ANC401I/000A/004A","Broughton Pumping Station replacement","Lincs and Northants","Anglian Northern"]
["ANC401I/000A/005A","Cadney Pumping Station replacement","Lincs and Northants","Anglian Northern"]
["ANC401I/000A/007A","Fulseas Pumping Station refurbishment","Lincs and Northants","Anglian Northern"]
["ANC401F/000A/014A","Goxhill, Thornton Road Flood Alleviation Scheme","Lincs and Northants","Anglian Northern"]
["ANC401I/000A/008A","Hibaldstow Pumping Station replacement","Lincs and Northants","Anglian Northern"]
["ANS399E/001A/021A","Humber  - Immingham to Freshney sea defence improvements","Lincs and Northants","Anglian Northern"]
["ANS399E/000A/002A","Humber - Barton Cliff to Barton Haven","Lincs and Northants","Anglian Northern"]
["ANS399E/000A/003A","Humber - Barton Haven to New Holland tidal defence improvements","Lincs and Northants","Anglian Northern"]
["ANS399E/001A/024A","Humber - Flood Area 22 Managed Realignment","Lincs and Northants","Anglian Northern"]
["ANS399E/001A/025A","Humber - New Holland to East Halton Skitter","Lincs and Northants","Anglian Northern"]
["ANS399E/001A/008A","Humber - Winteringham Ings & South Ferriby","Lincs and Northants","Anglian Northern"]
["ANC401I/000A/009A","Island Carr Pumping Station replacement","Lincs and Northants","Anglian Northern"]
["ANS401C/000A/001A","Lower Kingsway Sea Wall, Cleethorpes","Lincs and Northants","Anglian Northern"]
["ANC401F/000A/019A","North East Lincolnshire Surface Water  - Peaksfield Avenue","Lincs and Northants","Anglian Northern"]
["ANC401F/000A/015A","North East Lincolnshire Surface Water - Coniston Crescent Flood Alleviation Scheme","Lincs and Northants","Anglian Northern"]
["ANC401F/000A/020A","North East Lincolnshire Surface Water - North Immingham","Lincs and Northants","Anglian Northern"]
["ANC401F/000A/021A","North East Lincolnshire Surface Water - Willingham Street","Lincs and Northants","Anglian Northern"]
["ANC401I/000A/010A","North Kelsey Pumping Station replacement","Lincs and Northants","Anglian Northern"]
["ANS401C/001A/002A","North Promenade Terminal Groyne replacement, Cleethorpes","Lincs and Northants","Anglian Northern"]
["ANC401F/000A/018A","Redbourne Beck Lane/School Lane, Scunthorpe","Lincs and Northants","Anglian Northern"]
["ANC401I/000A/011A","Redbourne Hayes Pumping Station replacement","Lincs and Northants","Anglian Northern"]
["ANS399E/001A/027A","South Ferriby Pointing Doors","Lincs and Northants","Anglian Northern"]
["ANC401I/000A/013A","Thirtyfoot Pumping Station replacement","Lincs and Northants","Anglian Northern"]
["ANC401F/000A/017A","Ulceby Flood Alleviation Scheme","Lincs and Northants","Anglian Northern"]
["ANC401I/000A/015A","Whitton Carr Pumping Station refurbishment","Lincs and Northants","Anglian Northern"]
["ANC401I/000A/016A","Worlaby Pumping Station replacement","Lincs and Northants","Anglian Northern"]
["ANS399E/001A/012A","Humber - Cleethorpes & Humberston","Lincs and Northants","Anglian Northern"]
["ANO000E/000A/438A","Barrow FAS & Wetland Creation Scheme","Lincs and Northants","Anglian Northern"]
["ANS399E/001A/016A","Humber - Halton and Killingholme Marshes","Lincs and Northants","Anglian Northern"]
["ANC403I/002A/053A","Lade Bank Pumping Station Refurbishment","Lincs and Northants","Anglian Northern"]
["SNC001E/000A122A","Clay Coton, Clay Coton Brook, Capital Maintenance Scheme","Staffs Warks and West Mids","English Severn and Wye"]
["SNC001F/000A/071A","Oswestry Flood Surface Water Alleviation Scheme","Shrops Heref Worcs and Glos","English Severn and Wye"]
["SNC001E/001A/010A","Prestbury FAS","Shrops Heref Worcs and Glos","English Severn and Wye"]
["SNC001I/000A/001A","Cambridge, Gloucestershire Flood Alleviation Scheme","Shrops Heref Worcs and Glos","English Severn and Wye"]
["SNC001E/000A/051A","Rural SuDS Pilot - River Frome Stroud Valleys","Shrops Heref Worcs and Glos","English Severn and Wye"]
["SNC001F/000A/023A","Bishops Cleeve, Gloucestershire Flood Alleviation Scheme","Shrops Heref Worcs and Glos","English Severn and Wye"]
["SNC001F/000A/022A","Brockworth, Gloucestershire Surface Water Scheme","Shrops Heref Worcs and Glos","English Severn and Wye"]
["SNC001E/000A154A","Cam,  River Cam, Property Level Protection","Shrops Heref Worcs and Glos","English Severn and Wye"]
["SNC001F/000A/021A","Churchdown Surface Water Scheme","Shrops Heref Worcs and Glos","English Severn and Wye"]
["SNC001E/000A137A","Corn Ham Managed Realignment","Shrops Heref Worcs and Glos","English Severn and Wye"]
["SNC001F/000A/090A","Deans Walk, Property Level Protection, Gloucester","Shrops Heref Worcs and Glos","English Severn and Wye"]
["SNC002","Dimore Outfall repairs","Shrops Heref Worcs and Glos","English Severn and Wye"]
["SNC001E/000A155A","Dudbridge PLP, River Frome","Shrops Heref Worcs and Glos","English Severn and Wye"]
["SNC001E/000A128A","Lodgemore Mill (Strawn) screen refurbishment","Shrops Heref Worcs and Glos","English Severn and Wye"]
["SNC001E/000A156A","Nailsworth Property Level Protection Scheme","Shrops Heref Worcs and Glos","English Severn and Wye"]
["SNC001F/000A/003A","Pilley Cheltenham Flood Alleviation Scheme","Shrops Heref Worcs and Glos","English Severn and Wye"]
["SNC001E/000A/188A","River Severn, Hempstead and Rea, Gloucester, Flood Alleviation Scheme","Shrops Heref Worcs and Glos","English Severn and Wye"]
["SNC001E/000A138A","River Severn, Upper Framilode Flood Alleviation Scheme","Shrops Heref Worcs and Glos","English Severn and Wye"]
["SNC001E/000A140A","River Severn, Westbury-on-Severn Flood Alleviation Scheme","Shrops Heref Worcs and Glos","English Severn and Wye"]
["SNC001E/000A150A","River Wye Property Level Protection","Shrops Heref Worcs and Glos","English Severn and Wye"]
["SNC001F/000A/004A","Southfield, Cheltenham, Flood Alleviation Scheme","Shrops Heref Worcs and Glos","English Severn and Wye"]
["SNC001F/000A/088A","Tewkesbury Road, Longford Property Level Protection","Shrops Heref Worcs and Glos","English Severn and Wye"]
["SNC001F/000A/069A","Upper Hearne Brook FAS (Beeches Road)","Shrops Heref Worcs and Glos","English Severn and Wye"]
["SNC001F/000A/068A","Upper Lydbrook, Flood Alleviation Scheme","Shrops Heref Worcs and Glos","English Severn and Wye"]
["SNC001E/000A/049A","River Severn, Minsterworth FAS Erosion Protection","Shrops Heref Worcs and Glos","English Severn and Wye"]
["SNC001E/000A141A","Alney Island Improvements, River Severn ","Shrops Heref Worcs and Glos","English Severn and Wye"]
["SNC001E/001A/012A","Kempsey FAS Improvements","Shrops Heref Worcs and Glos","English Severn and Wye"]
["SNC001E/001A/018A","Daniels Brook","Shrops Heref Worcs and Glos","English Severn and Wye"]
["SNC001E/001A/021A","Uckinghall","Shrops Heref Worcs and Glos","English Severn and Wye"]
["SNC001E/001A/011A","Horsbere Brook","Shrops Heref Worcs and Glos","English Severn and Wye"]
["SNC001F/000A/047A","Bewdley PLP Scheme","Shrops Heref Worcs and Glos","English Severn and Wye"]
["SNC001F/000A/048A","Kinver, River Stour, Property Level Protection Scheme","Staffs Warks and West Mids","English Severn and Wye"]
["SNC001F/000A/027A","East Waterside near Ryall, Malvern Hills, PLP Scheme","Shrops Heref Worcs and Glos","English Severn and Wye"]
["SNC003F/000A/026A","Aston Cantlow, PLP Scheme","Staffs Warks and West Mids","English Severn and Wye"]
["SNC001F/000A/407A","Ketley Town, Surface Water Flood Alleviation Scheme","Shrops Heref Worcs and Glos","English Severn and Wye"]
["SNC001F/000A/028A","The Grove, Minsterley, Shropshire, Flood Alleviation Scheme","Shrops Heref Worcs and Glos","English Severn and Wye"]
["SNC001E/000A/320A","Barbourne Brook Culvert Improvements","Shrops Heref Worcs and Glos","English Severn and Wye"]
["SNC001F/000A/046A","Wick, Worcestershire, PLP Scheme","Shrops Heref Worcs and Glos","English Severn and Wye"]
["SNC001F/000A/032A","North East Bomere Heath, Shropshire, Flood Alleviation Scheme","Shrops Heref Worcs and Glos","English Severn and Wye"]
["SNC001F/000A/049A","Pooley Lane, Moreton, Surface Water Flood Alleviation Scheme","Staffs Warks and West Mids","English Severn and Wye"]
["SNC001E/000A147A","Gloucester to Tewkesbury River Severn Property Level Protection","Shrops Heref Worcs and Glos","English Severn and Wye"]
["SNC001F/000A/075A","Aston, Near Wem, Surface Water Property Level Protection","Shrops Heref Worcs and Glos","English Severn and Wye"]
["SNC001E/000A127A","Automation of Perdiswell flow balancing structure","Shrops Heref Worcs and Glos","English Severn and Wye"]
["SNC001E/000A/650A","Badsey Brook (Broadway, Childswickham and Murcot) FAS","Shrops Heref Worcs and Glos","English Severn and Wye"]
["SNC001E/001A/016A","Badsey Brook FRM PAR (Wickhamford)","Shrops Heref Worcs and Glos","English Severn and Wye"]
["SNC001E/000A123A","Barton-on-Avon, River Avon, Capital Maintenance Scheme","Staffs Warks and West Mids","English Severn and Wye"]
["SNC001F/000A/063A","Bilton Road, Rugby, Surface Water Flood Alleviation Scheme","Staffs Warks and West Mids","English Severn and Wye"]
["SNC001E/000A158A","Bishops Frome, Herefordshire Property Level Protection, River Frome","Shrops Heref Worcs and Glos","English Severn and Wye"]
["SNC001F/000A/074A","Bitterley Property Level Protection","Shrops Heref Worcs and Glos","English Severn and Wye"]
["SNC001E/000A157A","Blanquettes Estate Property Level Protection, Barbourne Brook","Shrops Heref Worcs and Glos","English Severn and Wye"]
["SNC001F/000A/062A","Bosbury Outfall,  Flood Alleviation Scheme","Shrops Heref Worcs and Glos","English Severn and Wye"]
["SNC001F/000A/083A","Bridge Street, River Clun, Property Level Protection","Shrops Heref Worcs and Glos","English Severn and Wye"]
["SNC001F/000A/058A","Broad Lane/Banner Lane, Brookstray, Flood Alleviation Scheme","Staffs Warks and West Mids","English Severn and Wye"]
["SNC001F/000A/052A","Broadwell, Rugby, Flood Alleviation Scheme","Staffs Warks and West Mids","English Severn and Wye"]
["SNC001E/000A142A","Bromsgrove Tribuataries, Spadesbourne and Battlefield Brook, Bromsgrove","Shrops Heref Worcs and Glos","English Severn and Wye"]
["SNC001E/000A/057A","Butt Lane, Coventry, River Sherbourne, Property Level Protection Scheme","Staffs Warks and West Mids","English Severn and Wye"]
["SNC001F/001A/012A","Cherry Brook, Hope Under Dinmore, Flood Alleviation Scheme","Shrops Heref Worcs and Glos","English Severn and Wye"]
["SNC001F/000A/081A","Clun Bridge, River Clun, Property Level Protection","Shrops Heref Worcs and Glos","English Severn and Wye"]
["SNC001F/000A/061A","Colwall, Flood Alleviation Feasibility","Shrops Heref Worcs and Glos","English Severn and Wye"]
["SNC001F/000A/080A","Coton Hill, property Level Protection, River Severn, Shrewsbury","Shrops Heref Worcs and Glos","English Severn and Wye"]
["SNC001F/000A/013A","Cradley Brook, Cradley, Property Level Protection ","Shrops Heref Worcs and Glos","English Severn and Wye"]
["SNC001F/000A/087A","Craven Arms, Surface Water Flood Alleviation Scheme","Shrops Heref Worcs and Glos","English Severn and Wye"]
["SNC001F/000A/086A","Culmington Property Level Protection Phase 2 ","Shrops Heref Worcs and Glos","English Severn and Wye"]
["SNC001F/000A/079A","Culmington Property Level Protection Phase 3","Shrops Heref Worcs and Glos","English Severn and Wye"]
["SNC001E/000A126A","Dog Lane PS refurbishment","Shrops Heref Worcs and Glos","English Severn and Wye"]
["SNC001F/000A/085A","Dulas, Near Knighton Property Level Protection","Shrops Heref Worcs and Glos","English Severn and Wye"]
["SNC003F/000A/025A","Fenny Compton, Flood Alleviation Scheme","Staffs Warks and West Mids","English Severn and Wye"]
["SNC001F/000A/065A","Five Bridges, River Frome, Flood Alleviation Scheme","Shrops Heref Worcs and Glos","English Severn and Wye"]
["SNC001F/000A/011A","Folly Brook, Eardisley, FAS","Shrops Heref Worcs and Glos","English Severn and Wye"]
["SNC001F/000A/055A","Gaydon, Warwick, Flood Alleviation Scheme","Staffs Warks and West Mids","English Severn and Wye"]
["SNC001F/000A/070A","Gobowen Flood Alleviation Scheme, Ordinary Watercourse Flooding, Shropshire","Shrops Heref Worcs and Glos","English Severn and Wye"]
["SNC001E/000A145A","Halesowen, River Stour, Property level Protection Scheme","Staffs Warks and West Mids","English Severn and Wye"]
["","Hampton Bishop","Shrops Heref Worcs and Glos","English Severn and Wye"]
["SNC001F/000A/067A","Hunters Gate, Surface Water Flood Alleviation Scheme, Much Wenlock","Shrops Heref Worcs and Glos","English Severn and Wye"]
["SNC001F/000A/076A","Kinnerley IPP","Shrops Heref Worcs and Glos","English Severn and Wye"]
["SNC001F/000A/051A","Kites Hardwick, Rugby, River Leam, Property Level Protection Scheme","Staffs Warks and West Mids","English Severn and Wye"]
["SNC001F/000A/066A","Lea Village, Flood Alleviation Scheme, Herefordshire","Shrops Heref Worcs and Glos","English Severn and Wye"]
["SNC001E/000A136A","Leamington, River Leam, Flood Alleviation Scheme","Staffs Warks and West Mids","English Severn and Wye"]
["SNC001F/000A/053A","Lillington, Leamington Spa, Flood Alleviation Scheme","Staffs Warks and West Mids","English Severn and Wye"]
["SNC001F/000A/059A","Mushroom Green Dam, Dudley, Mousesweet Brook, Flood Alleviation Scheme","Staffs Warks and West Mids","English Severn and Wye"]
["SNC001F/000A/072A","Orleton, Flood Alleviation Scheme, Herefordshire","Shrops Heref Worcs and Glos","English Severn and Wye"]
["SNC001F/000A/054A","Pailton, Rugby, Flood Alleviation Scheme","Staffs Warks and West Mids","English Severn and Wye"]
["SNC001F/000A/082A","Pant Glas, Near Oswestry Property Level Protection","Shrops Heref Worcs and Glos","English Severn and Wye"]
["SNC001F/000A/050A","Princethorpe, Rugby, Property Level Protection Scheme","Staffs Warks and West Mids","English Severn and Wye"]
["","Rapid Response Catchments","Shrops Heref Worcs and Glos","English Severn and Wye"]
["SNC001E/000A/054A","River Lugg, Leominster Flood Alleviation Scheme Improvements","Shrops Heref Worcs and Glos","English Severn and Wye"]
["SNC001E/001A/048A","River Teme, Tenbury Wells Community Flood Alleviation Works","Shrops Heref Worcs and Glos","English Severn and Wye"]
["SNC001E/000A/056A","Rowleys Green Lane, Coventry, River Sowe, Property Level Protection Scheme","Staffs Warks and West Mids","English Severn and Wye"]
["TRC003E/000A193A","Saltisford Brook Capital Maintenance Scheme","Staffs Warks and West Mids","English Severn and Wye"]
["SNC001F/000A/089A","Severnside Highley, River Severn, Property Level Protection, Shropshire","Shrops Heref Worcs and Glos","English Severn and Wye"]
["SNC001E/000A151A","Evesham PLP, River Avon","Shrops Heref Worcs and Glos","English Severn and Wye"]
["SNC001F/000A/073A","Shropshire IPP Phase 2 ","Shrops Heref Worcs and Glos","English Severn and Wye"]
["SNC001F/000A/396A","Shyte Brook, Much Wenlock, Flood Alleviation Scheme","Shrops Heref Worcs and Glos","English Severn and Wye"]
["SNK002E/000A001A","Slow the Flow - Shropshire Rivers","Shrops Heref Worcs and Glos","English Severn and Wye"]
["SNC001F/000A/389A","Snitterfield, Bell Brook, Flood Alleviation Scheme","Staffs Warks and West Mids","English Severn and Wye"]
["SNC001E/000A125A","Staffs Warks and West Mids Invest to Save","Staffs Warks and West Mids","English Severn and Wye"]
["SNC001E/000A133A","Stratford-Upon-Avon, Racecourse Brook, Flood Alleviation Scheme","Staffs Warks and West Mids","English Severn and Wye"]
["SNC001F/000A/077A","Temeside, Phase 2, Ludlow, Property Level Protection","Shrops Heref Worcs and Glos","English Severn and Wye"]
["SNC001F/000A/043A","Undefended Properties in the Ironbridge Gorge Indvidual Property Protection","Shrops Heref Worcs and Glos","English Severn and Wye"]
["SNC001E/000A135A","Upper Brookstray, Coventry, Flood Alleviation Scheme","Staffs Warks and West Mids","English Severn and Wye"]
["SNC001F/000A/251A","Wellington, Telford, Flood Alleviation Scheme","Shrops Heref Worcs and Glos","English Severn and Wye"]
["SNC001F/000A/031A","Wesley Brook, Shifnal, Flood Alleviation Scheme","Shrops Heref Worcs and Glos","English Severn and Wye"]
["SNC001F/000A/084A","Westbury Brook, Westbury, Shropshire","Shrops Heref Worcs and Glos","English Severn and Wye"]
["SNC001F/001A/405A","Whaddon, Cheltenham FAS","Shrops Heref Worcs and Glos","English Severn and Wye"]
["SNC001F/000A/060A","Withybrook, Warwickshire Flood Alleviation Scheme","Staffs Warks and West Mids","English Severn and Wye"]
["SNC001E/000A124A","Wootton Wawen Capital Maintenance Scheme","Staffs Warks and West Mids","English Severn and Wye"]
["SNC001E/000A146A","Wordsley, Stourbridge Property level Protection Scheme","Staffs Warks and West Mids","English Severn and Wye"]
["SNC001E/000A134A","Canley, Canley Brook Flood Alleviation Scheme","Staffs Warks and West Mids","English Severn and Wye"]
["SNC001E/000A/055A","Kenilworth, Finham Brook, Property Level Protection Scheme","Staffs Warks and West Mids","English Severn and Wye"]
["SNC001E/000A143A","Ewyas Harold ","Shrops Heref Worcs and Glos","English Severn and Wye"]
["SNC001F/000A/014A","Gosford Brook, Brimfield, Flood Alleviation Scheme","Shrops Heref Worcs and Glos","English Severn and Wye"]
["SNC001E/000A152A","Shrewsbury, River Severn Property Level Protection","Shrops Heref Worcs and Glos","English Severn and Wye"]
["SNC001E/000A139A","Severn Stoke FAS, River Severn","Shrops Heref Worcs and Glos","English Severn and Wye"]
["SNC001E/000A153A","Hunters Way, Droitwich Property Level Protection, Elmbridge Brook","Shrops Heref Worcs and Glos","English Severn and Wye"]
["SNC001F/000A/056A","Ladbroke, Southam, Lot Brook, Flood Alleviation Scheme","Staffs Warks and West Mids","English Severn and Wye"]
["SNC001E/000A148A","Worcester Property Level Protection, River Severn ","Shrops Heref Worcs and Glos","English Severn and Wye"]
["SNC001E/000A149A","Diglis, Worcs Property Level Protection, River Severn","Shrops Heref Worcs and Glos","English Severn and Wye"]
["SNC001F/000A/044A","Coal Brook, Coalbrookdale, Flood Relief Works","Shrops Heref Worcs and Glos","English Severn and Wye"]
["SNC001E/000A129A","Bagley Brook Outfall replacement","Shrops Heref Worcs and Glos","English Severn and Wye"]
["SNC001F/000A/057A","Cherington, Shipston-on-Stour, Flood Alleviation Scheme","Staffs Warks and West Mids","English Severn and Wye"]
["SNC001E/000A/050A","Cleobury Mortimer Pudding Brook Flood Alleviation Scheme","Shrops Heref Worcs and Glos","English Severn and Wye"]
["SNC001F/000A/030A","East Church Stretton Surface and Ordinary Watercourse Flood Relief Works","Shrops Heref Worcs and Glos","English Severn and Wye"]
["SNC001E/000A/052A","Himbleton, Bow Brook, Property Level Protection","Shrops Heref Worcs and Glos","English Severn and Wye"]
["SNC001E/001A/347A","Pershore, Worcestershire, Property Level Protection","Shrops Heref Worcs and Glos","English Severn and Wye"]
["SNC001E/000A132A","Warwick, St Johns Brook, Flood Alleviation Scheme","Staffs Warks and West Mids","English Severn and Wye"]
["SNC001E/000A131A","Shrops Heref Worcs and Glos Invest to Save (Abbey Mill)","Shrops Heref Worcs and Glos","English Severn and Wye"]
["NWC011F/008A/016A","New Mills, Derbyshire Surface Water Mgmt Scheme","Gtr Mancs Mersey and Ches","North West"]
["NWC011E/004A/002A","Black Brook, Chapel-en-le-Frith","Gtr Mancs Mersey and Ches","North West"]
["NWC011E/006A/004A","Hollingworth Clough Brook, Hayfield","Gtr Mancs Mersey and Ches","North West"]
["NWC011E/006A/003A","New Mills, Spinnerbottom Cottages","Gtr Mancs Mersey and Ches","North West"]
["NWC011E/006A/005A","River Sett, Hayfield","Gtr Mancs Mersey and Ches","North West"]
["NWC011E/006A/002A","Salem Cottages, Hyde Bank Road, New Mills","Gtr Mancs Mersey and Ches","North West"]
["NWC011F/008A/017A","Birch Vale, Derbyshire Suface Water Mgmt Scheme","Gtr Mancs Mersey and Ches","North West"]
["NWC008F/000A/086A","Warrington Road/ Mill Lane, St Helens","Gtr Mancs Mersey and Ches","North West"]
["NWC008F/000A/087A","West End Road, St Helens","Gtr Mancs Mersey and Ches","North West"]
["NWC009E/001A/002A","River Calder at Fulledge FRM Scheme","Cumbria and Lancashire","North West"]
["NWO017E/000A/002A","Pendlebury PS Improvements","Gtr Mancs Mersey and Ches","North West"]
["NWC008E/002A/001A","River Mersey Warrington FRM Scheme","Gtr Mancs Mersey and Ches","North West"]
["NWC008E/003A/003A","Leigh East FRM Scheme","Gtr Mancs Mersey and Ches","North West"]
["NWC005E/000A/024A","River Irwell, Salford Asset Management","Gtr Mancs Mersey and Ches","North West"]
["NWC012E/000A/006A","Ince & Frodsham Marshes Asset Review","Gtr Mancs Mersey and Ches","North West"]
["NWS002C/000A/002B","Anchorsholme Coast Protection Scheme","Cumbria and Lancashire","North West"]
["NWC008E/002A/003A","Sankey Bridges, Warrington FRM Scheme","Gtr Mancs Mersey and Ches","North West"]
["NWC013F/000A/001A","Rossall Coastal Defence Improvement Scheme","Cumbria and Lancashire","North West"]
["NWC005E/001A/008A","River Irwell at Ramsbottom FRM Scheme","Gtr Mancs Mersey and Ches","North West"]
["NWC009E/005A/003A","Broadgate & Lower Penwortham Defences","Cumbria and Lancashire","North West"]
["NWC008E/003A/002B","Westleigh Brook FRM Scheme","Gtr Mancs Mersey and Ches","North West"]
["NWC001E/001A/017A","Hey Cop P.S. Pump Replacement, Maghull","Cumbria and Lancashire","North West"]
["NWO016E/004A/100A","Gill Beck, Maryport Emerg Wks","Cumbria and Lancashire","North West"]
["NWC002E/000A/013A","Barepot, Workington","Cumbria and Lancashire","North West"]
["NWC005F/000A/016A","Hidden Watercourses Appraisal","Gtr Mancs Mersey and Ches","North West"]
["NWS003E/000A/002A","Knott End Sea Defences","Cumbria and Lancashire","North West"]
["NWC013E/000A/009A","Upper & Middle Wyre FRM Asset Mgmt Review","Cumbria and Lancashire","North West"]
["NWC009E/002A/002A","The Wrangling, Blackburn","Cumbria and Lancashire","North West"]
["NWC011F/008A/022A","Calve Croft, Sharston, Manchester","Gtr Mancs Mersey and Ches","North West"]
["NWC005F/000A/018A","Manchester Restoration of Open Channels of Ordinary Watercourses","Gtr Mancs Mersey and Ches","North West"]
["NWC005E/005A/009A","River Irwell, Bury South","Gtr Mancs Mersey and Ches","North West"]
["NWC005F/000A/024A","Bolton Critical Culvert Rehabilitation","Gtr Mancs Mersey and Ches","North West"]
["NWC004E/000A/015A","Stockdalewath, River Roe","Cumbria and Lancashire","North West"]
["NWC004E/000A/016A","Warwick Bridge, Trout Beck","Cumbria and Lancashire","North West"]
["NWC005F/000A/001A","Calder Avenue, Littleborough Flood Alleviation Scheme","Gtr Mancs Mersey and Ches","North West"]
["NWC005E/003A/001A","Salford Flood Alleviation Improvements","Gtr Mancs Mersey and Ches","North West"]
["NWC012E/002A/001A","Northwich Town Centre","Gtr Mancs Mersey and Ches","North West"]
["NWC010E/000A/003A","Skirting Beck, Egremont","Cumbria and Lancashire","North West"]
["NWC006E/000A/002A","Ulverston FRM Scheme","Cumbria and Lancashire","North West"]
["NWC003E/001A/002A","Croston FRM Scheme, River Yarrow","Cumbria and Lancashire","North West"]
["NWC004E/000A/014A","Millhouse, River Caldew","Cumbria and Lancashire","North West"]
["NWC001F/000A/047A","Four Acres, Maghull Asset Management Plan","Gtr Mancs Mersey and Ches","North West"]
["NWC009E/000A/017A","Jacks Key Reservoir Improvements, Darwen","Cumbria and Lancashire","North West"]
["NWC002E/000A/012A","Gategill Beck, Threlkeld","Cumbria and Lancashire","North West"]
["NWC007F/000A/001A","Morecambe Wave Reflection Wall Phases 1 - 3","Cumbria and Lancashire","North West"]
["NWC012F/000A/027A","A530 Bradfield Green, Crewe","Gtr Mancs Mersey and Ches","North West"]
["NWC012F/000A/025A","Tinkers Clough, Princess Street, Bollington","Gtr Mancs Mersey and Ches","North West"]
["NWC001F/000A/012C","Formby Strategic Flood Risk Management Programme","Gtr Mancs Mersey and Ches","North West"]
["NWC001E/001A/005A","Crossens Pumping Station Refurbishment","Cumbria and Lancashire","North West"]
["NWO001E/000A/006A","Property Level Protection Programme","Gtr Mancs Mersey and Ches","North West"]
["NWC009E/002A/003A","Waterfall, Blackburn FRM Scheme","Cumbria and Lancashire","North West"]
["NWC014E/000A/003A","Mill Brook, Tattenhall","Gtr Mancs Mersey and Ches","North West"]
["NWC003E/001A/006A","The Spinney Culvert, Wigan","Cumbria and Lancashire","North West"]
["NWC009F/000A/013A","Darwen Surface Water Management Plan","Cumbria and Lancashire","North West"]
["NWC008E/002A/006A","Dallam Brook, Warrington","Gtr Mancs Mersey and Ches","North West"]
["NWC008E/000A/009A","Clipsley Bk Culvert, Haydock","Gtr Mancs Mersey and Ches","North West"]
["NWC007E/000A/001A","River Conder at Galgate","Cumbria and Lancashire","North West"]
["NWC009F/000A/002B","Marton Mere Pumping Station and Spillway","Cumbria and Lancashire","North West"]
["NWC008F/000A/088A","Liverpool Debris screens and access","Gtr Mancs Mersey and Ches","North West"]
["NWC006E/000A/001A","Kendal, River Kent","Cumbria and Lancashire","North West"]
["NWC012F/000A/028A","Cheshire Asset Inspection/CCTV Survey","Gtr Mancs Mersey and Ches","North West"]
["NWC005E/005A/010A","Astley Bridge, Bolton","Gtr Mancs Mersey and Ches","North West"]
["NWC001F/000A/043A","Sefton Strategic Surface Water Management Plan Delivery Programme","Gtr Mancs Mersey and Ches","North West"]
["NWC008E/002A/002A","Penketh Brook, Warrington","Gtr Mancs Mersey and Ches","North West"]
["NWC009F/000A/028A","Hurlston Brook, Ormskirk West Study","Cumbria and Lancashire","North West"]
["NWC005F/000A/034A","Heywood Surface Water Management Programme","Gtr Mancs Mersey and Ches","North West"]
["NWC010E/000A/012A","Mill Beck, Barrow in Furness","Cumbria and Lancashire","North West"]
["NWC008E/003A/006A","Hindley Group","Gtr Mancs Mersey and Ches","North West"]
["NWC003F/000A/010A","Coffin Lane Brook, Ashton, Wigan","Gtr Mancs Mersey and Ches","North West"]
["NWC008F/000A/002C","West Kirby Flood Alleviation Scheme","Gtr Mancs Mersey and Ches","North West"]
["NWC011E/003A/014A","Cringle Bk, Ladybarn","Gtr Mancs Mersey and Ches","North West"]
["NWC009E/002A/001A","River Darwen, Darwen","Cumbria and Lancashire","North West"]
["NWC013E/000A/003A","Hillylaid Pool, Thornton","Cumbria and Lancashire","North West"]
["NWS004C/000A/014A","Maryport Flood and Coastal Protection Scheme","Cumbria and Lancashire","North West"]
["NWS003C/000A/002S","Wyre Dune and Beach Management Scheme","Cumbria and Lancashire","North West"]
["NWC012F/000A/041A","Mobberley Brook and tributaries, Wilmslow","Gtr Mancs Mersey and Ches","North West"]
["NWC005F/000A/033A","Ainsworth Rd/Water St, Radcliffe, Bury ","Gtr Mancs Mersey and Ches","North West"]
["NWC005F/000A/023A","Bolton Culvert Improvements","Gtr Mancs Mersey and Ches","North West"]
["NWC005F/000A/025A","Pencil Brook - River Beal , Shaw Oldham","Gtr Mancs Mersey and Ches","North West"]
["NWC003F/000A/005A","Horwich Town Centre Flood Alleviation","Gtr Mancs Mersey and Ches","North West"]
["NWS001C/000A/008B","Crosby Marine Lake to Formby Point Strategy Delivery Programme","Gtr Mancs Mersey and Ches","North West"]
["NWC005E/002A/008A","River Roch, Rochdale & Littleborough","Gtr Mancs Mersey and Ches","North West"]
["NWC002E/000A/016A","Scale Beck, Workington","Cumbria and Lancashire","North West"]
["NWC008F/000A/001C","Wallasey Embankment, Wirral","Gtr Mancs Mersey and Ches","North West"]
["NWC009F/000A/036A","Wyre Ordinary Watercourse Study","Cumbria and Lancashire","North West"]
["NWC009F/000A/034A","South Ribble Ordinary Watercourse Study","Cumbria and Lancashire","North West"]
["NWC005F/000A/037A","Gore Avenue Groundwater, Salford","Gtr Mancs Mersey and Ches","North West"]
["NWC009F/000A/029A","Burnley Ordinary Watercourse Study ","Cumbria and Lancashire","North West"]
["NWC005F/000A/035A","Groundwater Study - Castlewood Road, Kersal","Gtr Mancs Mersey and Ches","North West"]
["NWC009F/000A/033A","Pendle Ordinary Watercourse Study ","Cumbria and Lancashire","North West"]
["NWS004C/000A/011A","Whitehaven Coastal Erosion and Flooding Protection","Cumbria and Lancashire","North West"]
["NWC001E/001A/012A","Downholland Bk, Formby","Cumbria and Lancashire","North West"]
["NWC004E/000A/017A","Appleby Flood Gate Replacement","Cumbria and Lancashire","North West"]
["NWC009F/000A/027A","Burnley Road East, Rossendale","Cumbria and Lancashire","North West"]
["NWC006F/000A/003A","Ulverston Urban Drainage","Cumbria and Lancashire","North West"]
["NWC009F/000A/023A","Bacup Old Brook, Higher Clough","Cumbria and Lancashire","North West"]
["NWS003E/000A/010A","Arnside Embankment","Cumbria and Lancashire","North West"]
["NWC005F/000A/036A","Trevor Road, Winton, Salford","Gtr Mancs Mersey and Ches","North West"]
["NWC009F/000A/031A","Lancaster Ordinary Watercourse Study ","Cumbria and Lancashire","North West"]
["NWC008F/000A/050A","Mab Lane Surface Water Culvert, Liverpool","Gtr Mancs Mersey and Ches","North West"]
["NWC008F/000A/060A","Wirral Surface Water Mgmt Scheme","Gtr Mancs Mersey and Ches","North West"]
["NWC012F/000A/048A","Cheshire East ordinary waterourse capital maintenance","Gtr Mancs Mersey and Ches","North West"]
["NWC008F/000A/074A","Salerno Drive, Knowsley","Gtr Mancs Mersey and Ches","North West"]
["NWC012F/000A/046A","Weetwood Common, Tarporley","Gtr Mancs Mersey and Ches","North West"]
["NWC008F/000A/045A","Knowsley Village Land Drainage Investigation","Gtr Mancs Mersey and Ches","North West"]
["NWC005F/000A/017A","Manchester Trash Screen and Culvert Rehabilitation","Gtr Mancs Mersey and Ches","North West"]
["NWC012F/000A/033A","Hooton Green, Ellesmere Port","Gtr Mancs Mersey and Ches","North West"]
["NWC012F/000A/042A","Tributaries of Poynton Brook, Poynton","Gtr Mancs Mersey and Ches","North West"]
["NWC012F/000A/034A","Howey Lane, Frodsham","Gtr Mancs Mersey and Ches","North West"]
["NWC010F/000A/004A","Gosforth, West Cumbria","Cumbria and Lancashire","North West"]
["NWC008F/000A/049A","Upper Brook Surface Water Mgmt, Liverpool","Gtr Mancs Mersey and Ches","North West"]
["NWC012F/000A/037A","Excalibur Brook, Alsager","Gtr Mancs Mersey and Ches","North West"]
["NWC008F/000A/048A","Lower Tue Brook Culvert, Liverpool","Gtr Mancs Mersey and Ches","North West"]
["NWC002F/001A/005A","Parton fluvial and surface water flooding investigation","Cumbria and Lancashire","North West"]
["NWC002F/001A/001A","Penrith Road, Keswick","Cumbria and Lancashire","North West"]
["NWC012E/000A/007A","Keckwick Brook, Wharford Farm, Runcorn","Gtr Mancs Mersey and Ches","North West"]
["NWC008F/000A/064A","Heath Lane, Croft, Warrington","Gtr Mancs Mersey and Ches","North West"]
["NWO006E/000A/003A","Ulverston, Dragley Beck Rydal Road","Cumbria and Lancashire","North West"]
["NWC004E/000A/029A","Cummersdale, Carlisle","Cumbria and Lancashire","North West"]
["NWC008F/000A/057A","Warrington Culverted Ordinary Watercourse Improvements","Gtr Mancs Mersey and Ches","North West"]
["NWC008F/000A/083A","Padgate Lane, Padgate, Warrington","Gtr Mancs Mersey and Ches","North West"]
["NWC008F/000A/082A","Hillfoot Crescent, Stockton Heath, Warrington","Gtr Mancs Mersey and Ches","North West"]
["NWC008F/000A/084A","Stocks Lane, Penketh, Warrington","Gtr Mancs Mersey and Ches","North West"]
["NWC005F/000A/040A","Broomes Park, Royton, Oldham","Gtr Mancs Mersey and Ches","North West"]
["NWC008F/000A/071A","Burford Lane, Lymm Telemetry","Gtr Mancs Mersey and Ches","North West"]
["NWC010F/000A/003A","Low Beckside, Kirkby in Furness","Cumbria and Lancashire","North West"]
["NWC004E/000A/019A","Gosling Sike, Carlisle","Cumbria and Lancashire","North West"]
["NWC006E/000A/011A","Grange-Over-Sands, Windermere Road","Cumbria and Lancashire","North West"]
["NWC008F/000A/065A","Grappenhall, Warrington","Gtr Mancs Mersey and Ches","North West"]
["NWC008E/002A/007A","Thelwall, Warrington","Gtr Mancs Mersey and Ches","North West"]
["NWC004F/000A/004A","Gamblesby, River Eden","Cumbria and Lancashire","North West"]
["NWC009F/000A/026A","Cribden Clough, Clough End, Haslingden","Cumbria and Lancashire","North West"]
["NWC010F/000A/002A","Ravenglass, Cumbria","Cumbria and Lancashire","North West"]
["NWC008F/000A/073A","Warrington Ordinary Watercourse Asset Identification Survey","Gtr Mancs Mersey and Ches","North West"]
["NWC008F/000A/066A","Orford, Warrington","Gtr Mancs Mersey and Ches","North West"]
["NWC008F/000A/077A","Warrington Road, Knowsley","Gtr Mancs Mersey and Ches","North West"]
["NWC008E/002A/009A","Eastford Road, Warrington","Gtr Mancs Mersey and Ches","North West"]
["NWC005F/000A/042A","Sumner Street, Shaw, Oldham","Gtr Mancs Mersey and Ches","North West"]
["NWS002C/00A/011C","Fairhaven and Church Scar Coast Protection Scheme","Cumbria and Lancashire","North West"]
["NWC005F/000A/041A","Patridge Way, Chadderton, Oldham","Gtr Mancs Mersey and Ches","North West"]
["NWC009F/000A/014A","Old Gate Drive, Blackburn","Cumbria and Lancashire","North West"]
["NWC008F/000A/070A","Warrington Road, Walton","Gtr Mancs Mersey and Ches","North West"]
["NWC005F/000A/044A","Merton Avenue, Medlock Vale, Oldham","Gtr Mancs Mersey and Ches","North West"]
["NWC001F/000A/002A","Abbey Brook (The Pines Estate), Ormskirk","Cumbria and Lancashire","North West"]
["NWC009F/000A/030A","Chorley Ordinary Watercourse Study ","Cumbria and Lancashire","North West"]
["NWC002F/001A/002A","Elliot Park, Keswick","Cumbria and Lancashire","North West"]
["NWC009F/000A/047A","Birch Hall, Darwen","Cumbria and Lancashire","North West"]
["NWS004C/000A/017A","Fairways, Seascale Attenuation Scheme","Cumbria and Lancashire","North West"]
["NWC009F/000A/021A","Boundary Edge Brook, Rossendale","Cumbria and Lancashire","North West"]
["NWC005F/000A/027A","Churchfields, Dobcross, Oldham","Gtr Mancs Mersey and Ches","North West"]
["NWC014F/000A/001A","Liverpool Road, Neston, Ellesmere Port","Gtr Mancs Mersey and Ches","North West"]
["NWS001C/000A/016A","Rock Park Esplanade Restoration, Birkenhead","Gtr Mancs Mersey and Ches","North West"]
["NWC008E/003A/002C","Common Lane Bk, Leigh","Gtr Mancs Mersey and Ches","North West"]
["NWC007F/000A/006C","Cote Beck, Halton Flow Control","Cumbria and Lancashire","North West"]
["NWC011F/008A/018A","Blakelow Road, Macclesfield","Gtr Mancs Mersey and Ches","North West"]
["NWC009F/000A/035A","West Lancashire Ordinary Watercourse Study","Cumbria and Lancashire","North West"]
["NWC006E/000A/008A","Grasmere, River Rothay","Cumbria and Lancashire","North West"]
["NWC011E/003A/006A","High Lane Brook, Hazel Grove","Gtr Mancs Mersey and Ches","North West"]
["NWC011E/003A/002A","Sinderland Brook, Partington","Gtr Mancs Mersey and Ches","North West"]
["NWC009E/005A/002A","Grimsargh, Preston","Cumbria and Lancashire","North West"]
["NWO017E/000A/006A","Lyth Valley Drainage Investigation","Cumbria and Lancashire","North West"]
["NWC011E/003A/005A","Chorlton Brook, Cheadle","Gtr Mancs Mersey and Ches","North West"]
["NWC009E/001A/004A","River Calder, Padiham","Cumbria and Lancashire","North West"]
["NWO017E/000A/004A","Waver Wampool Drainage Investigation","Cumbria and Lancashire","North West"]
["NWS001C/000A/004C","Meols Parade Coast Protection, Wirral","Gtr Mancs Mersey and Ches","North West"]
["NWC005F/000A/030A","Shaw, Oldham, Surface Water Management","Gtr Mancs Mersey and Ches","North West"]
["NWC010E/000A/004A","Poaka Beck, Dalton-in-Furness","Cumbria and Lancashire","North West"]
["NWC009F/000A/032A","Ribble Valley Ordinary Watercourse Study ","Cumbria and Lancashire","North West"]
["NWS003E/000A/007A","Arrad Marsh/Canal Foot, Ulverston","Cumbria and Lancashire","North West"]
["NWC008E/003A/007A","Alder Forest, Eccles","Gtr Mancs Mersey and Ches","North West"]
["NWC009F/000A/024A","Hardman Brook/Hall Carr Brook, Rawtenstall ","Cumbria and Lancashire","North West"]
["NWC009F/000A/019A","Folly Clough, Stacksteads, Rossendale","Cumbria and Lancashire","North West"]
["NWC004F/000A/010A","Cumrew, Cumbria","Cumbria and Lancashire","North West"]
["NWO001E/000A/004A","Brampton Beck, Brampton","Cumbria and Lancashire","North West"]
["NWC004E/000A/028A","Soulby, Scandal Beck","Cumbria and Lancashire","North West"]
["NWC006E/000A/016A","Stock Ghyll, Ambleside","Cumbria and Lancashire","North West"]
["NWC005F/000A/045A","Mossley Road, Greenfield Oldham","Gtr Mancs Mersey and Ches","North West"]
["NWC011E/003A/001A","Baguley Brook, Wythenshawe","Gtr Mancs Mersey and Ches","North West"]
["NWC004E/000A/024A","Maulds Meaburn, River Lyvennet","Cumbria and Lancashire","North West"]
["NWC002E/000A/014A","Flimby, Penny Gill","Cumbria and Lancashire","North West"]
["NWC004E/000A/022A","Great Asby, Asby Beck","Cumbria and Lancashire","North West"]
["NWC010E/000A/014A","Soutergate Beck, Kirkby-in-Furness","Cumbria and Lancashire","North West"]
["NWC010E/000A/007A","Harrington, River Wyre","Cumbria and Lancashire","North West"]
["NWC006E/000A/012A","Troutbeck Bridge, Bell Beck","Cumbria and Lancashire","North West"]
["NWC004E/000A/025A","Morland Beck, Morland","Cumbria and Lancashire","North West"]
["NWC009E/001A/006A","Trawden Brook, Trawden","Cumbria and Lancashire","North West"]
["NWC006E/000A/007A","Coniston, Church Beck","Cumbria and Lancashire","North West"]
["NWC004F/000A/007A","Hoff, River Eden ","Cumbria and Lancashire","North West"]
["NWC006E/000A/018A","Milnthorpe, Strands River Bela","Cumbria and Lancashire","North West"]
["NWC004F/000A/011A","Crosby-on-Eden, Cumbria ","Cumbria and Lancashire","North West"]
["NWC009F/000A/038A","Fylde Level 2 Surface Water Management Plan","Cumbria and Lancashire","North West"]
["NWC009F/000A/041A","South Ribble Level 2 Surface Water Management Plan","Cumbria and Lancashire","North West"]
["NWC012F/000A/040A","Valley Brook, Crewe","Gtr Mancs Mersey and Ches","North West"]
["NWC009F/000A/039A","Lancaster Level 2 Surface Water Management Plan","Cumbria and Lancashire","North West"]
["NWC009F/000A/043A","West Lancashire Level 2 SWMP","Cumbria and Lancashire","North West"]
["NWS004C/000A/016A","Seamill Coastal Erosion Protection","Cumbria and Lancashire","North West"]
["NWC004F/000A/006A","Renwick, Cumbria","Cumbria and Lancashire","North West"]
["NWC009F/000A/044A","Wyre Level 2 Surface Water Management Plan","Cumbria and Lancashire","North West"]
["NWC009F/000A/025A","Lumb Brook, West View, Rossendale","Cumbria and Lancashire","North West"]
["NWC009F/000A/042A","Pendle Level 2 Surface Water Management Plan","Cumbria and Lancashire","North West"]
["NWC001E/001A/008A","Hightown Defences, Formby","Cumbria and Lancashire","North West"]
["NWC009F/000A/045A","Thornton Cleveleys Level 3 SWMP","Cumbria and Lancashire","North West"]
["NWC009F/000A/022A","Gib Hill Stream, Goodshaw Chapel","Cumbria and Lancashire","North West"]
["NWC009F/000A/020A","Hurst Brook, Hurst Lane, Rossendale","Cumbria and Lancashire","North West"]
["NWC004E/000A/020A","Crosby Ravensworth, Cumbria","Cumbria and Lancashire","North West"]
["NWS004C/000A/015A","Seascale Coastal Erosion Protection","Cumbria and Lancashire","North West"]
["NWC004E/000A/018A","Bomby and Bampton, River Lowther","Cumbria and Lancashire","North West"]
["NWC002E/000A/002A","Wigton, Station Road","Cumbria and Lancashire","North West"]
["NWC001E/001A/019A","Alt Crossens Drainage Investigations","Cumbria and Lancashire","North West"]
["NWC005E/003A/002A","River Irwell, Kearsley","Gtr Mancs Mersey and Ches","North West"]
["NWC002E/000A/002C","Wigton, Speet Gill","Cumbria and Lancashire","North West"]
["NWC009F/000A/040A","Ribble Valley Level 2 Surface Water Mgmt Plan","Cumbria and Lancashire","North West"]
["NWC010E/000A/013A","Broughton in Furness Culvert Refurbishment","Cumbria and Lancashire","North West"]
["NWC011E/003A/007A","Chorlton Platt Gore, Sale","Gtr Mancs Mersey and Ches","North West"]
["NWC007E/001A/003A","Lower Lancaster Phase III - Lune at Skerton/Halton","Cumbria and Lancashire","North West"]
["NWC005E/002A/001A","River Beal, Shaw","Gtr Mancs Mersey and Ches","North West"]
["NWC001E/001A/009A","Whinney Brook, Maghull","Cumbria and Lancashire","North West"]
["NWC004E/000A/026A","Pooley Bridge, River Eamont","Cumbria and Lancashire","North West"]
["NWC008F/000A/085A","Knowsley Debris Screen Health and Safety Improvements","Gtr Mancs Mersey and Ches","North West"]
["NWC007F/000A/005C","Lucy Brook, Nr Willow Lane Culvert","Cumbria and Lancashire","North West"]
["NWC012F/000A/021A","Newcastle Road, Congleton","Gtr Mancs Mersey and Ches","North West"]
["NWC005E/000A/006A","River Croal, Back Spa Road North, Bolton","Gtr Mancs Mersey and Ches","North West"]
["NWC008E/002A/008A","Sankey Brook, Gemini Embankment","Gtr Mancs Mersey and Ches","North West"]
["NWC011F/008A/019A","Sanctuary Moor, River Lilly, Knutsford","Gtr Mancs Mersey and Ches","North West"]
["NWC010E/000A/015A","Cleator, River Ehen","Cumbria and Lancashire","North West"]
["NWC005E/004A/005A","River Irk, Royton","Gtr Mancs Mersey and Ches","North West"]
["NWC012F/000A/020A","Coppice Road/Wistaston Road, Willaston","Gtr Mancs Mersey and Ches","North West"]
["NWC004E/000A/030A","West Newton, Crookhurst Beck","Cumbria and Lancashire","North West"]
["NWC004E/000A/023A","Lazonby, Harrow Beck","Cumbria and Lancashire","North West"]
["NWC004E/000A/021A","Eamont Bridge, River Eamont","Cumbria and Lancashire","North West"]
["NWC009E/000A/010A","Mearley Brook, Clitheroe","Cumbria and Lancashire","North West"]
["NWC009E/000A/015A","Kirk Beck, Bolton By Bowland","Cumbria and Lancashire","North West"]
["NWC004E/000A/012A","Appleby, Doomgate","Cumbria and Lancashire","North West"]
["NWS002C/000A/009A","South Shore Works Seabee Reprofiling","Cumbria and Lancashire","North West"]
["NWS003C/000A/003C","Roa Island Defence Replacement/Improvement","Cumbria and Lancashire","North West"]
["NWC009F/000A/046A","Blackburn Surface Water Management Plan","Cumbria and Lancashire","North West"]
["NWC004E/000A/027A","Rickerby Park, Carlisle River Eden","Cumbria and Lancashire","North West"]
["NWS004E/000A/001A","Millom Town Sea Defences","Cumbria and Lancashire","North West"]
["NWC012F/000A/018A","Church Lawton and Kidsgrove joint Investigational","Gtr Mancs Mersey and Ches","North West"]
["NWC006E/000A/015A","Haverthwaite, Leven","Cumbria and Lancashire","North West"]
["NWC003E/000A/003A","River Douglas, Horwich","Cumbria and Lancashire","North West"]
["NWC007E/000A/004A","Black Dyke Beck, Carnforth","Cumbria and Lancashire","North West"]
["NWC009F/000A/017A","Padiham Town Walls, Burnley","Cumbria and Lancashire","North West"]
["NWC001E/001A/007A","Banks Watercourse, Nr Southport","Cumbria and Lancashire","North West"]
["NWC009E/000A/005A","River Ribble, Salmesbury","Cumbria and Lancashire","North West"]
["NWC009E/000A/012A","River Calder at Whalley","Cumbria and Lancashire","North West"]
["NWC012E/000A/002A","River Wheelock/ Arclid Brook, Sandbach","Gtr Mancs Mersey and Ches","North West"]
["NWC011E/003A/008A","Gatley Brook, Gatley","Gtr Mancs Mersey and Ches","North West"]
["NWC009E/000A/016A","Park Gate, Leyland","Cumbria and Lancashire","North West"]
["NWC005E/005A/005A","Bus Turning Bridge, Barrow Bridge, Bolton","Gtr Mancs Mersey and Ches","North West"]
["NWC006E/000A/013A","Lindale Beck, Grange-over-Sands","Cumbria and Lancashire","North West"]
["NWC008E/000A/001A","Stewards Brook, Widnes","Gtr Mancs Mersey and Ches","North West"]
["NWC004F/000A/009A","Croglin, Croglin Beck Cumbria","Cumbria and Lancashire","North West"]
["NWC009E/005A/001A","Savick Bk, Preston","Cumbria and Lancashire","North West"]
["NWC008E/001A/003A","Black Brook, St Helens","Gtr Mancs Mersey and Ches","North West"]
["NWC005E/004A/002A","River Irk, Hendham Vale","Gtr Mancs Mersey and Ches","North West"]
["NWC005E/004A/001A","River Medlock, Central Manchester","Gtr Mancs Mersey and Ches","North West"]
["NWC009E/000A/013A","Accrington Culverted Watercourses","Cumbria and Lancashire","North West"]
["NWC007E/000A/003A","Mill House Watercourse Improvements","Cumbria and Lancashire","North West"]
["NWC001E/000A/007A","Simonswood Brook, Kirkby","Cumbria and Lancashire","North West"]
["NWC005E/002A/006A","Shawforth","Gtr Mancs Mersey and Ches","North West"]
["NWC011E/003A/012A","Timperley Brook, Altrincham","Gtr Mancs Mersey and Ches","North West"]
["NWC007E/000A/002A","River Keer & Back Lane, Carnforth","Cumbria and Lancashire","North West"]
["NWC005E/005A/001A","Atherton Brook, Lovers Lane, Howe Bridge","Gtr Mancs Mersey and Ches","North West"]
["NWC002E/000A/011A","Westnewton Beck, Westnewton","Cumbria and Lancashire","North West"]
["NWC001E/000A/009A","Kirkby Brook, Kirkby","Cumbria and Lancashire","North West"]
["NWC005E/002A/005A","River Spodden, Whitworth","Gtr Mancs Mersey and Ches","North West"]
["NWO017E/000A/007A","Dog Clog Drainage Investigation, Merseyside","Gtr Mancs Mersey and Ches","North West"]
["NWC012E/003A/001A","Howty Brook, Congleton","Gtr Mancs Mersey and Ches","North West"]
["NWC005E/002A/004A","Longden End Brook, Littleborough","Gtr Mancs Mersey and Ches","North West"]
["NWC005E/004A/003A","Pin Mill Bridge, Central Manchester","Gtr Mancs Mersey and Ches","North West"]
["NWC011E/003A/009A","Bruntwood Hall Brook, Cheadle","Gtr Mancs Mersey and Ches","North West"]
["NWS004E/000A/006A","Black Beck, Millom","Cumbria and Lancashire","North West"]
["NWC008E/000A/004A","Shakerley Brook, Tyldesley","Gtr Mancs Mersey and Ches","North West"]
["NWC001E/001A/006A","Wham Dyke, Nr Formby","Cumbria and Lancashire","North West"]
["NWC012E/003A/002A","River Dane, Havannah St, Congleton","Gtr Mancs Mersey and Ches","North West"]
["NWC011E/003A/004A","River Mersey, Flixton","Gtr Mancs Mersey and Ches","North West"]
["NWC013E/000A/008A","Pegs Pool & Wardleys Pool, Hambleton","Cumbria and Lancashire","North West"]
["NWC005E/005A/004A","Blackshaw Brook, Bolton","Gtr Mancs Mersey and Ches","North West"]
["NWC008E/000A/002A","Court Hey Brook, Childwall","Gtr Mancs Mersey and Ches","North West"]
["NWC005E/004A/004A","River Irk, Blackley","Gtr Mancs Mersey and Ches","North West"]
["NWO001E/000A/011A","Sandy Brook, Ormskirk","Cumbria and Lancashire","North West"]
["NWS003E/000A/006A","Bardsea Defences","Cumbria and Lancashire","North West"]
["NWC008E/000A/005A","Bowers Brook, Nr Widnes","Gtr Mancs Mersey and Ches","North West"]
["NWC005E/002A/007A","Brightley Brook, Heywood","Gtr Mancs Mersey and Ches","North West"]
["NWC007E/000A/008A","Burrow Beck, Scotforth","Cumbria and Lancashire","North West"]
["NWC013E/000A/001A","Horsebridge Dyke, Poulton-le-Fylde","Cumbria and Lancashire","North West"]
["NWC012F/000A/038A","Dane Catchment, Congleton Town Centre","Gtr Mancs Mersey and Ches","North West"]
["NWC011F/008A/014A","Barlow Fold Road, Romiley","Gtr Mancs Mersey and Ches","North West"]
["NWC011F/008A/012A","Stockport Rd, Romiley","Gtr Mancs Mersey and Ches","North West"]
["NWC011F/008A/015A","Schools Hill, Cheadle","Gtr Mancs Mersey and Ches","North West"]
["NWC011F/008A/013A","Turf Lea Fold Farm, Hazel Grove","Gtr Mancs Mersey and Ches","North West"]
["NWC001E/002A/000A","Alt / Crossens Catchment Future capital","Cumbria and Lancashire","North West"]
["NWC003E/000A/001A","Causeway Pumping Station, Rufford","Cumbria and Lancashire","North West"]
["NWO011E/000A/026A","Critical Bridge Inspection & Repairs","Cumbria and Lancashire","North West"]
["NWC002E/002A/000A","Derwent Catchment Future Capital","Cumbria and Lancashire","North West"]
["NWC003E/002A/000A","Douglas Catchment Future Capital","Cumbria and Lancashire","North West"]
["NWC004E/002A/000A","Eden Catchment Future Capital","Cumbria and Lancashire","North West"]
["NWC006E/001A/000A","Kent/Leven Catchment Future Capital","Cumbria and Lancashire","North West"]
["NWC002E/000A/010A","Ling Beck, Seaton","Cumbria and Lancashire","North West"]
["NWC007E/002A/000A","Lune Catchment Future Capital","Cumbria and Lancashire","North West"]
["NWC013E/000A/002A","New Draught/Sowerby Brook, Myerscough","Cumbria and Lancashire","North West"]
["NWC009E/003A/000A","Ribble Catchment Future Capital","Cumbria and Lancashire","North West"]
["NWC010E/001A/000A","South West Lakes Catchment Future Capital","Cumbria and Lancashire","North West"]
["NWC003E/000A/002A","Wham Ditch Outfall, Rufford","Cumbria and Lancashire","North West"]
["NWC013E/000A/004A","Wyre watercourses (Wyre FRS Implementation )","Cumbria and Lancashire","North West"]
["NWC011E/003A/011A","Black Brook, Heaton Chapel","Gtr Mancs Mersey and Ches","North West"]
["NWC011E/003A/013A","Carrwood Park Brook, Bramhall","Gtr Mancs Mersey and Ches","North West"]
["NWC011E/005A/001A","Delph, Oldham","Gtr Mancs Mersey and Ches","North West"]
["NWC008E/000A/003A","Fishington Brooks, Rixton","Gtr Mancs Mersey and Ches","North West"]
["NWC005E/005A/008A","Heap Bridge, Bury","Gtr Mancs Mersey and Ches","North West"]
["NWC005E/006A/000A","Irwell Catchment Future Capital","Gtr Mancs Mersey and Ches","North West"]
["NWC011E/006A/001A","Marple Bridge, Hollywood End","Gtr Mancs Mersey and Ches","North West"]
["NWC008E/004A/000A","Mersey Estuary Catchment Future Capital","Gtr Mancs Mersey and Ches","North West"]
["NWC011E/002A/001A","Mersey Strategy - 5 yearly Channel, Weir & flood basin refurbishment","Gtr Mancs Mersey and Ches","North West"]
["NWC011E/003A/010A","Poise Brook, Hazel Grove","Gtr Mancs Mersey and Ches","North West"]
["NWC011E/004A/001A","Pott Shrigley Brook, Nr Bollington","Gtr Mancs Mersey and Ches","North West"]
["NWC011E/004A/003A","River Bollin, Macclesfield","Gtr Mancs Mersey and Ches","North West"]
["NWC011E/005A/002A","River Tame, Uppermill","Gtr Mancs Mersey and Ches","North West"]
["NWC011E/004A/004A","Spencer Brook, Prestbury","Gtr Mancs Mersey and Ches","North West"]
["NWC011E/007A/000A","Upper Mersey Catchment Future Capital","Gtr Mancs Mersey and Ches","North West"]
["NWC008E/002A/003C","Sankey Brook - Longford Brook, Warrington FRM Scheme","Gtr Mancs Mersey and Ches","North West"]
["NWC010E/000A/010A","Ennerdale Bridge, Croasdale Beck","Cumbria and Lancashire","North West"]
["NWC013E/000A/005A","Catterall FSR Surveys","Cumbria and Lancashire","North West"]
["NWS002E/000A/001A","Coastal Defence (Cell 11b&11c) Improvement Works","Cumbria and Lancashire","North West"]
["NWS003E/000A/009A","Cockersands Managed Realignment Viability Study","Cumbria and Lancashire","North West"]
["NWC004E/000A/031A","Thacka Beck Pumping Station Investigation, Penrith","Cumbria and Lancashire","North West"]
["NWC013E/001A/000A","Wyre Catchment Future Capital","Cumbria and Lancashire","North West"]
["NWO001E/000A/003A","Local Authority Flood Risk Co-ordinators - Match Funded Posts","Gtr Mancs Mersey and Ches","North West"]
["NWS001E/000A/001A","Mersey Estuary/Liverpool Bay Managed Realignment Viability Study","Gtr Mancs Mersey and Ches","North West"]
["NWO016E/000A/036A","Ops Delivery South LL Programme","Gtr Mancs Mersey and Ches","North West"]
["NWC012E/005A/000A","Weaver/Gowy Catchment Future Capital","Gtr Mancs Mersey and Ches","North West"]
["NWC008E/003A/004A","Astley Brook, Leigh","Gtr Mancs Mersey and Ches","North West"]
["NWC012F/000A/039A","A6 Market Street, Danebank","Gtr Mancs Mersey and Ches","North West"]
["NWC005F/000A/028A","Delph New Road, Oldham","Gtr Mancs Mersey and Ches","North West"]
["NWS004C/000A/009A","St Bees Coastal Erosion Protection","Cumbria and Lancashire","North West"]
["NWC001F/000A/044A","Merseyside Strategic Groundwater Flood Risk Pilot Strategy","Gtr Mancs Mersey and Ches","North West"]
["NWC005F/000A/029A","Dobcross New Road, Oldham","Gtr Mancs Mersey and Ches","North West"]
["NWS004C/000A/018A","Railway Tce, Seascale","Cumbria and Lancashire","North West"]
["NWC011F/008A/020A","Pearl Street, Prestbury","Gtr Mancs Mersey and Ches","North West"]
["NWC006F/000A/002A","Carrus Green, Kendal","Cumbria and Lancashire","North West"]
["NWC009F/000A/037A","Chorley Level 2 Surface Water Management Plan","Cumbria and Lancashire","North West"]
["NWC009F/000A/018A","Church Walk, Medlar with Wesham, Lancashire","Cumbria and Lancashire","North West"]
["NWC005F/000A/043A","Greencroft Meadow, Royton, Oldham","Gtr Mancs Mersey and Ches","North West"]
["NWC002F/001A/004A","Moresby Watercourse investigation","Cumbria and Lancashire","North West"]
["NWC003E/001A/001A","River Douglas, Wigan FAS Post Construction","Cumbria and Lancashire","North West"]
["NWC002E/001A/001A","Keswick flood Defences Post Construction","Cumbria and Lancashire","North West"]
["NWC006E/000A/014A","Fisher Beck, Ambleside","Cumbria and Lancashire","North West"]
["NWC003F/000A/009A","Bolton Upland Storage Project","Gtr Mancs Mersey and Ches","North West"]
["NWC001F/000A/045A","Sefton Flood Storage and Wet Habitat Creation Programme ","Gtr Mancs Mersey and Ches","North West"]
["NWC012F/000A/026A","A50 Pear Tree Cottages, Brereton","Gtr Mancs Mersey and Ches","North West"]
["NWC012F/000A/035A","Clay Lane, Marton, Winsford","Gtr Mancs Mersey and Ches","North West"]
["NWC003E/001A/005A","Clarington Brook Culvert, Wigan","Cumbria and Lancashire","North West"]
["NWC012F/000A/036A","Littleton, Chester","Gtr Mancs Mersey and Ches","North West"]
["NWC002E/000A/015A","Braithwaite Embankment Refurbishment","Cumbria and Lancashire","North West"]
["NWC008E/000A/010A","Rainford Brook, Beech Gardens Rainford","Gtr Mancs Mersey and Ches","North West"]
["NWC005F/000A/019A","Blackley New Road Residential Area Flooding ","Gtr Mancs Mersey and Ches","North West"]
["NWC012F/000A/047A","Betton, Shropshire ","Gtr Mancs Mersey and Ches","North West"]
["NWC012F/000A/022A","Bridgewater and Lockgate, Runcorn","Gtr Mancs Mersey and Ches","North West"]
["NWC012F/000A/003A","Compass Close, Runcorn","Gtr Mancs Mersey and Ches","North West"]
["NWC005F/000A/020A","King William IV Fishing Lake Outfall and Overflow Replacement ","Gtr Mancs Mersey and Ches","North West"]
["NWC008F/000A/044A","Runcorn & Widnes Culvert Study","Gtr Mancs Mersey and Ches","North West"]
["NWC012F/000A/045A","The Rookery, Kidsgrove","Gtr Mancs Mersey and Ches","North West"]
["NWC012F/000A/023A","Pitville Terrace, Widnes Flood Alleviation Scheme","Gtr Mancs Mersey and Ches","North West"]
["NWC012F/000A/043A","Daresbury Expressway Subway Flood Mitigation, Runcorn","Gtr Mancs Mersey and Ches","North West"]
["NWC012F/000A/044A","Kidsgrove Central FAS","Gtr Mancs Mersey and Ches","North West"]
["NWC011F/008A/004A","Stockport Road Marple Culvert Rehabilitation","Gtr Mancs Mersey and Ches","North West"]
["NWC011F/008A/021A","Rusholme and Moss Side Surface Water Management Scheme","Gtr Mancs Mersey and Ches","North West"]
["NWC011F/008A/009A","Shaw, Cringle, Ley and Willow Brook","Gtr Mancs Mersey and Ches","North West"]
["NWC009E/000A/018A","River Ribble, Settle","Cumbria and Lancashire","North West"]
["NWC007E/000A/007A","Jenkin Beck, Ingleton","Cumbria and Lancashire","North West"]
["NWC007E/000A/006A","River Wenning, Bentham","Cumbria and Lancashire","North West"]
["NWC014E/000A/004A","Finchetts Gutter, Chester (reservoir)","Gtr Mancs Mersey and Ches","North West"]
["NOC306E/000A/009A","Neasham Village Flood Protection & Reservoir Safety works ","Northumberland Durham and Tees","Northumbria"]
["NOC303E/000A/001A","Morpeth Flood Alleviation Scheme","Northumberland Durham and Tees","Northumbria"]
["NOC305E/000A/009A","Stanhope River Wear Flood Alleviation Scheme","Northumberland Durham and Tees","Northumbria"]
["NOC305F/000A/005A","Lanchester Surface Water","Northumberland Durham and Tees","Northumbria"]
["NOS301C/000A/061A","Seahouses Main Pier Rehabilitation","Northumberland Durham and Tees","Northumbria"]
["NOS302F/000A/004A","Headland Walls and Blocksands combined for PAR, Hartlepool","Northumberland Durham and Tees","Northumbria"]
["NOC301F/000A/005A","Chathill SW Flood Alleviation Scheme","Northumberland Durham and Tees","Northumbria"]
["NOC304F/000A/024A","Haltwhistle Flood Alleviation Scheme","Northumberland Durham and Tees","Northumbria"]
["NOC304F/000A/033A","Ovingham SW Flood Alleviation Scheme","Northumberland Durham and Tees","Northumbria"]
["NOC304F/000A/030A","Newcastle Local Flood Alleviation Schemes","Northumberland Durham and Tees","Northumbria"]
["NOS301C/000A/017A","Southern Promenade Sea Wall Repair - Appraisal, Design and Construction, Whitely Bay","Northumberland Durham and Tees","Northumbria"]
["NOS301C/000A/006A","Central Promenade Appraisal, Design And Construction, North Tyneside ","Northumberland Durham and Tees","Northumbria"]
["NOC304F/000A/039A","Shiremoor, Appraisal, Design and Construction ","Northumberland Durham and Tees","Northumbria"]
["NOC306E/001A/001A","Port Clarence and Greatham South Flood Alleviation Scheme","Northumberland Durham and Tees","Northumbria"]
["NOS302C/000A/006A","Skinningrove Coastal Protection Works","Northumberland Durham and Tees","Northumbria"]
["NOC306E/000A/031A","Browns Bridge (Lustrum Beck)","Northumberland Durham and Tees","Northumbria"]
["NOC304F/000A/010A","Appletree Gardens Flood Alleviation Scheme","Northumberland Durham and Tees","Northumbria"]
["NOC304E/000A/021A","Brunton Park, Ouseburn Flood Alleviation Scheme","Northumberland Durham and Tees","Northumbria"]
["NOC304F/000A/045A","Saltwell Road South","Northumberland Durham and Tees","Northumbria"]
["NOC305F/000A/006A","Witton Gilbert Flood Alleviation Scheme","Northumberland Durham and Tees","Northumbria"]
["NOS306C/000A/001A","Hartlepool Marina Study and Construction (North Pier)","Northumberland Durham and Tees","Northumbria"]
["NOC306E/000A/032A","Darlington Town Centre Fringe Flood Alleviation Scheme","Northumberland Durham and Tees","Northumbria"]
["NOC304F/000A/026A","Killingworth, Longbenton, and Forest Hall Surface Water Separation and SuDS Phases 2 and 3, Appraisal, Design and Construction","Northumberland Durham and Tees","Northumbria"]
["NOC306F/000A/014A","Whale Hill Ironstone Culvert","Northumberland Durham and Tees","Northumbria"]
["NOC305F/000A/022A","Castlefields, Bournmoor","Northumberland Durham and Tees","Northumbria"]
["NOC305F/000A/023A","Cherry Banks, Chester le Street","Northumberland Durham and Tees","Northumbria"]
["NOC305F/000A/025A","Craigland Villas, Sacriston","Northumberland Durham and Tees","Northumbria"]
["NOC305F/000A/026A","Dene Crescent, Sacriston","Northumberland Durham and Tees","Northumbria"]
["NOC304F/000A/017A","Dipton SW Flood Management Works","Northumberland Durham and Tees","Northumbria"]
["NOC305F/000A/027A","Dunelm Walk, Leadgate","Northumberland Durham and Tees","Northumbria"]
["NOC305F/000A/028A","Hardwick Road, Sedgefield","Northumberland Durham and Tees","Northumbria"]
["NOC305F/000A/030A","Hillmeads, Nettlesworth","Northumberland Durham and Tees","Northumbria"]
["NOC305F/000A/032A","Kingfisher Close, Esh Winning","Northumberland Durham and Tees","Northumbria"]
["NOC305F/000A/013A","New Brancepeth and Ushaw Moor SW Flood Management Works","Northumberland Durham and Tees","Northumbria"]
["NOC305F/000A/014A","North West Durham PLP","Northumberland Durham and Tees","Northumbria"]
["NOC305F/000A/015A","Pelton Flood Alleviation Scheme","Northumberland Durham and Tees","Northumbria"]
["NOS302C/000A/002A","Seaham (North) Promenade Coastal Works","Northumberland Durham and Tees","Northumbria"]
["NOC304F/000A/040A","Shotley Bridge SW Flood Management Works","Northumberland Durham and Tees","Northumbria"]
["NOC305E/000A/029A","Chester-le-Street Deculvert","Northumberland Durham and Tees","Northumbria"]
["NOC305E/000A/048A","Dene Beck Culvert Remedials","Northumberland Durham and Tees","Northumbria"]
["NOC305E/000A/052A","Lanchester","Northumberland Durham and Tees","Northumbria"]
["NOC306E/000A/025A","Staindrop Flood Alleviation Scheme","Northumberland Durham and Tees","Northumbria"]
["NOC305E/000A/050A","Stanhope - Unthank Mill ","Northumberland Durham and Tees","Northumbria"]
["NOC305E/000A/018A","Tindale Beck Flood Alleviation Scheme","Northumberland Durham and Tees","Northumbria"]
["NOC305F/000A/018A","Wolsingham Culvert Works","Northumberland Durham and Tees","Northumbria"]
["NOC304E/000A/036A","Acomb (Red Burn) Flood Alleviation Scheme","Northumberland Durham and Tees","Northumbria"]
["NOC304E/000A/048A","Prudhoe","Northumberland Durham and Tees","Northumbria"]
["NOC301F/000A/003A","Alnwick East SW Flood Alleviation Scheme","Northumberland Durham and Tees","Northumbria"]
["NOS301C/000A/016A","Beadnell North Sea Wall Improvements","Northumberland Durham and Tees","Northumbria"]
["NOC304F/000A/011A","Blenkinsopp Flood Alleviation Scheme","Northumberland Durham and Tees","Northumbria"]
["NOS301C/000A/026A","Boulmer Coast Protection Scheme","Northumberland Durham and Tees","Northumbria"]
["NOS301C/000A/064A","Craster Coast Protection Scheme","Northumberland Durham and Tees","Northumbria"]
["NOS301C/000A/065A","Little Shore Improvement Works","Northumberland Durham and Tees","Northumbria"]
["NOC301F/000A/009A","Lowick Flood Mitigation Works","Northumberland Durham and Tees","Northumbria"]
["NOS301C/000A/029A","Meggies Burn Outfall Erosion Study","Northumberland Durham and Tees","Northumbria"]
["NOS301C/000A/033A","Newbiggin Point Coast Protection Scheme","Northumberland Durham and Tees","Northumbria"]
["NOC303F/000A/007A","Ponteland SuDS","Northumberland Durham and Tees","Northumbria"]
["NOC301F/000A/008A","Red Row Property Level Protection","Northumberland Durham and Tees","Northumbria"]
["NOC301F/000A/006A","Rothbury SW Flood Alleviation Scheme","Northumberland Durham and Tees","Northumbria"]
["NOS301C/000A/066A","Seaton Sluice Harbour Improvements","Northumberland Durham and Tees","Northumbria"]
["NOC301F/000A/007A","Shilbottle SW Flood Alleviation Scheme","Northumberland Durham and Tees","Northumbria"]
["NOS301C/000A/020A","Warkworth Harbour North Pier Geophysical and Ground Investigations","Northumberland Durham and Tees","Northumbria"]
["NOO000E/000A/919A","Local Levy Programme Manager and NRFCC Advisor","Northumberland Durham and Tees","Northumbria"]
["NOC306E/000A/043A","Oxney Flatts Floodbank","Northumberland Durham and Tees","Northumbria"]
["NOC306F/000A/028A","Jesmond Gardens","Northumberland Durham and Tees","Northumbria"]
["NOC306F/000A/029A","Riverston Close","Northumberland Durham and Tees","Northumbria"]
["NOS302C/000A/022A","Seaton Carew Southern Management Unit ","Northumberland Durham and Tees","Northumbria"]
["NOC306F/000A/030A","Tynebrook Avenue ","Northumberland Durham and Tees","Northumbria"]
["NOC306E/001A/009A","Marton West Beck - Middlesbrough","Northumberland Durham and Tees","Northumbria"]
["NOC306F/000A/022A","Cornwall Close","Northumberland Durham and Tees","Northumbria"]
["NOC306F/000A/019A","Middlebeck, Town Farm","Northumberland Durham and Tees","Northumbria"]
["NOC306F/000A/021A","Ormesby High Street","Northumberland Durham and Tees","Northumbria"]
["NOC306F/000A/012A","Saltersgill Fields","Northumberland Durham and Tees","Northumbria"]
["NOC306E/000A/020A","Guisborough Flood Alleviation Scheme","Northumberland Durham and Tees","Northumbria"]
["NOC306F/000A/005A","Charltons Inland Flood Alleviation Scheme","Northumberland Durham and Tees","Northumbria"]
["NOC306F/000A/008A","Fleet Beck and Roger's Dyke Inland Flood Alleviation Scheme","Northumberland Durham and Tees","Northumbria"]
["NOC306F/000A/010A","Hutton Lane Inland Flood Alleviation Scheme","Northumberland Durham and Tees","Northumbria"]
["NOC352F/000A/001A","North Skelton Inland Flood Alleviation Scheme","Northumberland Durham and Tees","Northumbria"]
["NOC306F/000A/026A","St Joseph's Court Property Level protection ","Northumberland Durham and Tees","Northumbria"]
["NOC306F/000A/013A","Tees Dock Road","Northumberland Durham and Tees","Northumbria"]
["NOC306E/000A/052A","Yarm Flood Gate replacement","Northumberland Durham and Tees","Northumbria"]
["NOC306F/000A/023A","Halidon Way, Billingham","Northumberland Durham and Tees","Northumbria"]
["NOC306F/000A/024A","Ings lane","Northumberland Durham and Tees","Northumbria"]
["NOC304E/000A/042A","Blackhall Mill Asset Replacement","Northumberland Durham and Tees","Northumbria"]
["NOC304E/000A/049A","St Omer's Haugh Flood Defence, Gateshead","Northumberland Durham and Tees","Northumbria"]
["NOC304E/000A/039A","Team Valley Flood Alleviation Scheme","Northumberland Durham and Tees","Northumbria"]
["NOC304F/000A/021A","Field Lane / Laburnum Avenue","Northumberland Durham and Tees","Northumbria"]
["NOC304F/000A/023A","Green Lane Gardens","Northumberland Durham and Tees","Northumbria"]
["NOC304F/000A/048A","Heworth","Northumberland Durham and Tees","Northumbria"]
["NOC306F/000A/025A","Ridgeway & Leam Lane, East Gateshead","Northumberland Durham and Tees","Northumbria"]
["NOC304F/000A/046A","Sherburn Park Estate, Rowlands Gill Surface water management scheme","Northumberland Durham and Tees","Northumbria"]
["NOC304E/000A/045A","Forest Hall Culvert Remedials","Northumberland Durham and Tees","Northumbria"]
["NOC304F/000A/016A","Coast Road Drainage Scheme","Northumberland Durham and Tees","Northumbria"]
["NOC304F/000A/019A","Fawdon Flood Alleviation Scheme","Northumberland Durham and Tees","Northumbria"]
["NOC304F/000A/028A","Newcastle Central Motorway Drainage Scheme","Northumberland Durham and Tees","Northumbria"]
["NOC304F/000A/029A","Newcastle Culvert Repairs and Access Improvements","Northumberland Durham and Tees","Northumbria"]
["NOC304F/000A/038A","Scrogg Road Flood Alleviation Scheme","Northumberland Durham and Tees","Northumbria"]
["NOC304F/000A/041A","West Gosforth Flood Alleviation Scheme","Northumberland Durham and Tees","Northumbria"]
["NOC304W/000A/002A","Tyneside Sustainable Sewerage Study - Nuns Moor/Barrack Road","Northumberland Durham and Tees","Northumbria"]
["NOC304F/000A/002A","Briar Vale","Northumberland Durham and Tees","Northumbria"]
["NOC303F/000A/010A","Dudley Appraisal and Design and Construction ","Northumberland Durham and Tees","Northumbria"]
["NOC304F/000A/001A","Fairfield Green","Northumberland Durham and Tees","Northumbria"]
["NOS301C/000A/007A","Fish Quay Appraisal, Design And Construction, North Shields","Northumberland Durham and Tees","Northumbria"]
["NOC304F/000A/003A","Longbenton Letch and Otterburn Close, Forest Hall","Northumberland Durham and Tees","Northumbria"]
["NOC304F/000A/032A","Oak Grove Appraisal, Design and Construction ","Northumberland Durham and Tees","Northumbria"]
["NOS301C/000A/018A","St Mary's Island Ramp and Causeway Appraisal, Design and Construction","Northumberland Durham and Tees","Northumbria"]
["NOS301C/000A/019A","Tynemouth Swimming Pool Appraisal, Design and Construction","Northumberland Durham and Tees","Northumbria"]
["NOC304E/000A/037A","Boldon Flats Improvement Project","Northumberland Durham and Tees","Northumbria"]
["NOC304F/000A/015A","Cleadon Village - Appraisal, Design and Construction","Northumberland Durham and Tees","Northumbria"]
["NOC304F/000A/020A","Fellgate Estate - Appraisal, Design and Construction","Northumberland Durham and Tees","Northumbria"]
["NOC304F/000A/009A","Monkton Village Flood Alleviation Study","Northumberland Durham and Tees","Northumbria"]
["NOC304F/000A/044A","Newmarket Walk South Shields Flood Alleviation Study","Northumberland Durham and Tees","Northumbria"]
["NOC304F/000A/034A","Property Level Protection - Don View (West Boldon) and Newcastle Road (South Shields)","Northumberland Durham and Tees","Northumbria"]
["NOC304F/000A/049A","Property Level Protection - Elberfeld Court, Jarrow","Northumberland Durham and Tees","Northumbria"]
["NOC305E/000A/004A","Fatfield","Northumberland Durham and Tees","Northumbria"]
["NOC305F/000A/020A","Borrowdale Street - surface water flooding","Northumberland Durham and Tees","Northumbria"]
["NOC305F/000A/021A","Cut Throat Dene Watercourse","Northumberland Durham and Tees","Northumbria"]
["NOC305F/000A/012A","Hendon Burn Culvert Capital Maintenance Design & Construction (i.e. strengthening deformed section of culvert)","Northumberland Durham and Tees","Northumbria"]
["NOC305F/000A/029A","Hendon Burn Watercourse","Northumberland Durham and Tees","Northumbria"]
["NOC305F/000A/031A","Holley Park","Northumberland Durham and Tees","Northumbria"]
["NOC305F/000A/017A","Springwell Village - surface water flooding","Northumberland Durham and Tees","Northumbria"]
["NOS302F/000A/012A","Strategy Frontage 1 - South Bents & Seaburn Sea Walls Overtopping Protection","Northumberland Durham and Tees","Northumbria"]
["NOC306F/000A/007A","Cross Beck Inland Flood Alleviation Scheme","Northumberland Durham and Tees","Northumbria"]
["NOC302E/000A/004A","Wooler Water Defence Replacement and Reallignment","Northumberland Durham and Tees","Northumbria"]
["NOC306E/001A/003A","Greatham North ","Northumberland Durham and Tees","Northumbria"]
["NOC306F/000A/020A","Middlesbrough Golf Club dam, Marton West Beck","Northumberland Durham and Tees","Northumbria"]
["NOC304F/000A/031A","Newcastle Quayside Flood Alleviation Scheme","Northumberland Durham and Tees","Northumbria"]
["NOC304W/000A/001A","Tyneside Sustainable Sewerage Study - Broad Chare/Central Motorway Feasibility","Northumberland Durham and Tees","Northumbria"]
["NOC304F/000A/025A","Killingworth, Longbenton, and Forest Hall Surface Water Separation and SuDS Phase 1, Appraisal, Design and Construction.","Northumberland Durham and Tees","Northumbria"]
["NOS301C/000A/010A","Long Sands and Bear's Back Sea Wall Appraisal, Design and Construction, Tynemouth","Northumberland Durham and Tees","Northumbria"]
["NOS301C/000A/012A","Sea Banks Sea Wall - Appraisal Design and Construction, Tynemouth","Northumberland Durham and Tees","Northumbria"]
["NOS302C/000A/013A","Marsden Bay Cliff Erosion Study","Northumberland Durham and Tees","Northumbria"]
["NOC305F/000A/024A","Citywide Culvert Repairs","Northumberland Durham and Tees","Northumbria"]
["NOS302C/000A/050A","Strategy Frontage 3 (Hendon Foreshore Barrier / Stonehill Wall / SW Breakwater)","Northumberland Durham and Tees","Northumbria"]
["NOC306E/000A/055A","Croft (downstream of bridge)","Northumberland Durham and Tees","Northumbria"]
["NOC306E/000A/057A","Great Ayton","Northumberland Durham and Tees","Northumbria"]
["NOC306E/000A/026A","Stokesley Flood Alleviation Scheme","Northumberland Durham and Tees","Northumbria"]
["NOC306F/000A/015A","FMU 01 Upper Tees FRMP","Northumberland Durham and Tees","Northumbria"]
["NOC304F/000A/900A","Integrated Flood Risk Management Study for the Ouseburn Drainage Catchment","Northumberland Durham and Tees","Northumbria"]
["NOC304F/000A/901A","Newcastle City Centre Integrated Flood Risk Management Study","Northumberland Durham and Tees","Northumbria"]
["NOS301C/000A/030A","Blyth South Beach Dune Management Scheme","Northumberland Durham and Tees","Northumbria"]
["NOC305F/000A/900A","Hood Street, St. Johns Chapel","Northumberland Durham and Tees","Northumbria"]
["NOS302C/000A/003A","Seaham Harbour North Pier Coastal Works","Northumberland Durham and Tees","Northumbria"]
["NOC304E/000A/038A","Corbridge Defences","Northumberland Durham and Tees","Northumbria"]
["NOC306F/000A/006A","Clairville Common","Northumberland Durham and Tees","Northumbria"]
["NOC305F/000A/010A","Craigwell Drive - surface water flooding","Northumberland Durham and Tees","Northumbria"]
["NOC305F/000A/011A","Dene Street","Northumberland Durham and Tees","Northumbria"]
["NOS301F/000A/001A","Herd Sands, South Shields - Appraisal, Design & Construction","Northumberland Durham and Tees","Northumbria"]
["NOC306F/000A/031A","Marton West Beck Vegetation Management","Northumberland Durham and Tees","Northumbria"]
["NOC305F/000A/009A","Chester le Street SW Flood Management Works","Northumberland Durham and Tees","Northumbria"]
["NOS301C/000A/073A","Island View Coast Protection Extension [Recovery]","Northumberland Durham and Tees","Northumbria"]
["NOC305F/000A/019A","Bishop Auckland SW Drainage and Culvert Works","Northumberland Durham and Tees","Northumbria"]
["NOS351C/000A/001A","South Bents Sea Wall [Recovery]","Northumberland Durham and Tees","Northumbria"]
["NOC301F/000A/004A","Alwinton Flood Alleviation Scheme","Northumberland Durham and Tees","Northumbria"]
["NOS301C/000A/072A","Seaton Sluice Harbour & Collywell Bay Repairs [Recovery]","Northumberland Durham and Tees","Northumbria"]
["NOC304F/000A/018A","Fairways Estate Flood Alleviation Scheme","Northumberland Durham and Tees","Northumbria"]
["NOC305E/000A/016A","Spring Gardens Urgent Works (reservoir)","Northumberland Durham and Tees","Northumbria"]
["NOC304F/000A/037A","Salkeld Gardens / Valley Drive PLP","Northumberland Durham and Tees","Northumbria"]
["NOC306E/001A/004A","Greatham North East ","Northumberland Durham and Tees","Northumbria"]
["NOS301C/000A/069A","Bears Back Sea Wall, Tynemouth [Recovery]","Northumberland Durham and Tees","Northumbria"]
["NOS301C/000A/067A","Central Promenade, Whitley Bay [Recovery]","Northumberland Durham and Tees","Northumbria"]
["NOS301C/000A/068A","Northern Promenade, Whitley Bay [Recovery]","Northumberland Durham and Tees","Northumbria"]
["NOS301C/000A/070A","South Longsands Promenade, Tynemouth [Recovery]","Northumberland Durham and Tees","Northumbria"]
["NOS351C/000A/002A","Saltburn Sea Wall [Recovery]","Northumberland Durham and Tees","Northumbria"]
["NOC306E/000A/915A","Small Communities - Great Ayton","Northumberland Durham and Tees","Northumbria"]
["NOC306F/000A/900A","Greta Bridge Flood Alleviation Scheme","Northumberland Durham and Tees","Northumbria"]
["NOC305E/000A/057A","Bayhorse Culvert and Trash Screens [SoN]","Northumberland Durham and Tees","Northumbria"]
["NOC305E/000A/023A","Menceforth Cottages, Chester-le-Street PLP","Northumberland Durham and Tees","Northumbria"]
["NOS351E/000A/001A","Package 6 - Northumbria Recovery Works","Northumberland Durham and Tees","Northumbria"]
["NOC306E/000A/917A","Potto","Northumberland Durham and Tees","Northumbria"]
["NOC301E/000A/906A","Warkworth Flood Alleviation Scheme","Northumberland Durham and Tees","Northumbria"]
["NOS301C/000A/032A","Low Hauxley","Northumberland Durham and Tees","Northumbria"]
["NOC303F/000A/009A","Morpeth SW Flood Alleviation Scheme","Northumberland Durham and Tees","Northumbria"]
["NOC304E/000A/917A","NRFCC Community Flood Engagement Officers","Northumberland Durham and Tees","Northumbria"]
["NOO000E/000A/092A","Development of LLFA Project Bids","Northumberland Durham and Tees","Northumbria"]
["NOC306F/000A/018A","Hurworth Property Protection","Northumberland Durham and Tees","Northumbria"]
["NOC306F/000A/027A","Project Downpour","Northumberland Durham and Tees","Northumbria"]
["NOC306E/001A/008A","Greatham Creek Emergency Works","Northumberland Durham and Tees","Northumbria"]
["NOS302C/000A/051A","Block Sands Phase 1 Study and Construction, Hartlepool","Northumberland Durham and Tees","Northumbria"]
["NOC306E/000A/058A","Hurworth Asset Recovery (formerly Hurworth Place)","Northumberland Durham and Tees","Northumbria"]
["NOC306F/000A/017A","Hardwick Property Level Protection Scheme","Northumberland Durham and Tees","Northumbria"]
["NOC306F/000A/011A","Pioneering Maintenance Tees Valley Ordinary Watercourses","Northumberland Durham and Tees","Northumbria"]
["NOC304F/000A/013A","South View, Clara Vale","Northumberland Durham and Tees","Northumbria"]
["NOC304F/000A/014A","Brandling Park Flood Alleviation Scheme","Northumberland Durham and Tees","Northumbria"]
["NOC303F/000A/008A","Green Lane, Dudley Appraisal, Design and Construction","Northumberland Durham and Tees","Northumbria"]
["NOS301C/000A/071A","Southern Promenade [Recovery]","Northumberland Durham and Tees","Northumbria"]
["NOS301C/000A/008A","Trinity Road Sea Wall Project Appraisal, Design and Construction, Whitley Bay","Northumberland Durham and Tees","Northumbria"]
["NOO000E/000A/949A","Flood Risk Work on Ordinary Watercourses using Young Offenders","Northumberland Durham and Tees","Northumbria"]
["NOC304F/000A/035A","Reay Crescent - Appraisal, Design and Construction ","Northumberland Durham and Tees","Northumbria"]
["SWC014E/000A/025A","Braunton Flood Defence Improvements FDGiA","Devon and Cornwall","South West"]
["SWO007E/000A/025A","Devon and Cornwall Floods 2012","Devon and Cornwall","South West"]
["SWC013E/000A/072A","Tiverton FDS Wall Repairs","Devon and Cornwall","South West"]
["SWC014E/000A/039A","Rolle Quay FD Repair","Devon and Cornwall","South West"]
["SWS005C/000A/049A","Porth Hellick Dune Management Works, St Mary's - no funding required","Devon and Cornwall","South West"]
["SWS005C/000A/052A","Porth Loo Dune Management Plan, St Mary's - no funding required","Devon and Cornwall","South West"]
["SWC012F/000A/06CA","New Feniton Flood Alleviation Scheme","Devon and Cornwall","South West"]
["SWC015F/000A/079A","Salcombe Town Tidal Gates","Devon and Cornwall","South West"]
["SWS006F/000A/060A","Flood Recovery Project 2012 St. Peter's Road, Plymouth, new trash screen and culvert improvements","Devon and Cornwall","South West"]
["SWS005C/000A/051A","Porth Mellon Dune Management Plan, St Mary's","Devon and Cornwall","South West"]
["SWS006F/000A/061A","Flood Recovery Project 2012 Stoggy Lane, Plympton, Plymouth, new trash screen, headwall and highway drainage improvements","Devon and Cornwall","South West"]
["SWC014C/000A/071A","Bucks Mills Slipway Reconstruction","Devon and Cornwall","South West"]
["SWS006F/000A/035A","Tory Brook Court, Plympton,surface water capacity improvements","Devon and Cornwall","South West"]
["SWC015F/000A/031A","Paignton Flood Alleviation Scheme","Devon and Cornwall","South West"]
["SWC015F/000A/028A","Brixham Flood Alleviatioon Scheme","Devon and Cornwall","South West"]
["SWC015F/000A/030A","Coastal Defences in Torbay","Devon and Cornwall","South West"]
["SWO007E/000A/069A","13/14 Combined Flood Event Repairs","Devon and Cornwall","South West"]
["SWC010F/000A/103A","A39 Perranworthal Leat Improvements","Devon and Cornwall","South West"]
["SWC010F/000A/104A","A390 Tregrehan Stream culvert improvements","Devon and Cornwall","South West"]
["SWC015F/000A/078A","Adelphi Road Flood Alleviation Scheme (Property Level Protection)","Devon and Cornwall","South West"]
["SWS006F/000A/038A","Alexandra Close, Plymstock, surface water flood protection","Devon and Cornwall","South West"]
["SWC013E/000A/094A","Alphin Brook Operational Improvements","Devon and Cornwall","South West"]
["SWC014E/000A/065A","Anchorwood Barnstaple FD Improvements","Devon and Cornwall","South West"]
["SWC011F/000A/094A","Arnold's Point Stage 2 - Flood wall construction","Devon and Cornwall","South West"]
["SWC015E/000A/071A","Ashburton Flood Defence Improvements","Devon and Cornwall","South West"]
["SWC012F/000A/062A","Axminster Millbrook","Devon and Cornwall","South West"]
["SWC013E/000A/076A","Bampton Scheme Upstream Improvements","Devon and Cornwall","South West"]
["SWC010E/000A/040A","Barripper flow distribution","Devon and Cornwall","South West"]
["SWC011E/000A/105A","Bathpool flood bank refurbishment","Devon and Cornwall","South West"]
["SWS006C/000A/065A","Beesands - Coastal Defences","Devon and Cornwall","South West"]
["SWS006F/000A/037A","Bernice Terrace, Lipson Vale, surface water capacity improvements","Devon and Cornwall","South West"]
["SWC014E/000A/059A","Bishops Tawton Flood Defence Scheme","Devon and Cornwall","South West"]
["SWC009E/000A/085A","Bodmin Town Leat culvert repairs","Devon and Cornwall","South West"]
["SWC015E/000A/061A","Bovey Tracey","Devon and Cornwall","South West"]
["SWC012F/000A/059A","Branscombe Flood improvements","Devon and Cornwall","South West"]
["SWC014F/000A/070A","Braunton Flood Improvements","Devon and Cornwall","South West"]
["SWC011E/000A/106A","Bridgerule Flood bank re-furbishment","Devon and Cornwall","South West"]
["SWC009C/000A/055A","Bude Breakwater Refurbishment","Devon and Cornwall","South West"]
["SWC009E/000A/032A","Bude flood defence and river restoration project (inc HMWB mitigation measures)","Devon and Cornwall","South West"]
["SWC011E/000A/045A","Calstock flood defence improvements and habitat creation (inc HMWB mitigation measures)","Devon and Cornwall","South West"]
["SWC010E/000A/037A","Carbis Bay - St Margarets Hotel culvert","Devon and Cornwall","South West"]
["SWC011E/000A/008A","Cawsand fluvial","Devon and Cornwall","South West"]
["SWS006E/000A/063A","Chaddlewood screen upgrade","Devon and Cornwall","South West"]
["SWS006F/000A/067A","Chaddlewood Stream Overland Flow Route","Devon and Cornwall","South West"]
["SWC011F/000A/083A","Chaddlewood Stream, Plympton, Plymouth, capacity improvements","Devon and Cornwall","South West"]
["SWO007F/000A/049A","Chapel Square, Mevagissey Culvert Improvements","Devon and Cornwall","South West"]
["SWC015F/000A/015A","CHUDLEIGH - BRIDGELANDS BRIDGE FLOOD MANAGEMENT","Devon and Cornwall","South West"]
["SWC014E/000A/064A","Clawton Flood bank refurbishment","Devon and Cornwall","South West"]
["SWC014F/000A/052A","Cliff Stabilisation Scheme, Bucks Mills","Devon and Cornwall","South West"]
["SWC013E/000A/092A","Clyst St Mary Flood Defence Improvements","Devon and Cornwall","South West"]
["SWC015F/000A/081A","Cockington Flood Alleviation Scheme","Devon and Cornwall","South West"]
["SWC012F/000A/061A","Colaton Raleigh Flood Improvements","Devon and Cornwall","South West"]
["SWC015F/000A/060A","Collaton St Mary Flood Alleviation Scheme","Devon and Cornwall","South West"]
["SWS006F/000A/036A","College Road, Keyham and College Road Primary School, surface water capacity improvements","Devon and Cornwall","South West"]
["SWC015F/000A/058A","COMBEINTEIGNHEAD, SHALDON  FLOODS 2012 REMEDIAL WORKS - CULVERT REPLACEMENT ","Devon and Cornwall","South West"]
["SWC015F/000A/059A","COOMBE VALLEY DAM - FLOOD STORAGE IMPROVEMENTS.","Devon and Cornwall","South West"]
["SWC010E/000A/098A","Copperhouse Gate Refurbishment","Devon and Cornwall","South West"]
["SWC010C/000A/048A","Coverack sea walls refurbishment","Devon and Cornwall","South West"]
["SWS006F/000A/029A","Cranmere Road, Eggbuckland, additional highway drainage","Devon and Cornwall","South West"]
["SWC009C/000A/048A","Crooklets Beach Sea Defence Refurbishment","Devon and Cornwall","South West"]
["SWC011F/000A/118A","Dark St Lane, Plympton. Culvert improvements","Devon and Cornwall","South West"]
["SWC013F/000A/085A","DAWLISH WATER, DAWLISH FLOODS 2012 - FLOOD DEFENCE IMPROVEMENTS","Devon and Cornwall","South West"]
["SWO005F/000A/058A","Devon County Council PLP","Devon and Cornwall","South West"]
["SWO005E/000A/055A","Devon Tidal Gate Refurbishments","Devon and Cornwall","South West"]
["SWO004E/000A/052A","Devon Web Cam Operational Improvements","Devon and Cornwall","South West"]
["SWC011C/000A/055A","Downderry Coast Protection Works Phase 2","Devon and Cornwall","South West"]
["SWC011E/000A/107A","Drakewalls stream culvert inlet screen refurbishments","Devon and Cornwall","South West"]
["SWS006F/000A/027A","Drunken Bridge Hill, Plympton, addional highway drainage","Devon and Cornwall","South West"]
["SWC014E/000A/061A","East The Water, Bideford","Devon and Cornwall","South West"]
["SWC011F/000A/091A","Embankment Road adj Haywoods, pumping and attenuation improvements","Devon and Cornwall","South West"]
["SWC011F/000A/090A","Embankment Road opp Heles Terrace, additional highway drainage capacity","Devon and Cornwall","South West"]
["SWC013E/000A/045A","Exe Estuary Habitat Delivery","Devon and Cornwall","South West"]
["SWC013F/000A/099A","Exeter Flood Surface Water Improvements","Devon and Cornwall","South West"]
["SWS006E/000A/051A","Exmouth Tidal Defence Scheme","Devon and Cornwall","South West"]
["SWS005E/000A/014A","Falmouth tidal","Devon and Cornwall","South West"]
["SWS006F/000A/031A","Fellowes Place/ Edgcumbe Avenue, Stoke, surface water capacity improvements","Devon and Cornwall","South West"]
["SWS006F/000A/020A","Flood Recovery Project 2012 Cobb Lane, Plymstock , additional highway drainage","Devon and Cornwall","South West"]
["SWS006F/000A/056A","Flood Recovery Project 2012 Honicknowle Lane, Plymouth, new trash screen and headwall","Devon and Cornwall","South West"]
["SWS006F/000A/058A","Flood Recovery Project 2012 Laira Avenue, Laira, Plymouth, additional highway drainage capacity and culvert improvements","Devon and Cornwall","South West"]
["SWS006F/000A/059A","Flood Recovery Project 2012 Longbrook Street, Plympton, Plymouth, watercourse capacity improvements","Devon and Cornwall","South West"]
["SWS006F/000A/062A","Flood Recovery Project 2012 The Gypsy and Traveller Site, The Ride, Plymouth, new watercourse culvert and tidal outfall.","Devon and Cornwall","South West"]
["SWS006F/000A/054A","Forder Valley surface water flood improvements","Devon and Cornwall","South West"]
["SWS005E/000A/036A","Fowey FAS","Devon and Cornwall","South West"]
["SWC010E/000A/043A","Gilberts Coombe","Devon and Cornwall","South West"]
["SWC011E/000A/031A","Gunnislake FAS - Drakewalls Stream","Devon and Cornwall","South West"]
["SWC011E/000A/108A","Halton Quay bank refurbishment","Devon and Cornwall","South West"]
["SWC010C/000A/049A","Halzephron Coastal Adaptation Works","Devon and Cornwall","South West"]
["SWC009C/000A/049A","Hannafore Sea Defence Refurbishment","Devon and Cornwall","South West"]
["SWC010E/000A/038A","Hayle FAS - Foundry Square","Devon and Cornwall","South West"]
["SWC010E/000A/067A","Hayle River flood bank re-alignment and habitat creation (inc HMWB mitigation measures)","Devon and Cornwall","South West"]
["SWC010E/000A/096A","Helston Flood Alleviation Scheme","Devon and Cornwall","South West"]
["SWC015C/000A/082A","Hollicombe Rock Armour","Devon and Cornwall","South West"]
["SWC015F/000A/080A","Hope Cove - fluvial flooding mitigation scheme","Devon and Cornwall","South West"]
["SWC014E/000A/066A","Ilfracombe Sea","Devon and Cornwall","South West"]
["SWC009F/000A/054A","IPP East Cornwall CFMP Area Year 2","Devon and Cornwall","South West"]
["SWC009F/000A/054A","IPP East Cornwall CFMP Area Year 3","Devon and Cornwall","South West"]
["SWC011F/000A/087A","IPP Tamar CFMP Area Year 2","Devon and Cornwall","South West"]
["SWC011F/000A/088A","IPP Tamar CFMP Area Year 3","Devon and Cornwall","South West"]
["SWC010F/000A/088A","IPP West Cornwall CFMP Area Year 2","Devon and Cornwall","South West"]
["SWC010F/000A/089A","IPP West Cornwall CFMP Area Year 3","Devon and Cornwall","South West"]
["SWC014E/000A/069A","Kenwith Operational Improvements","Devon and Cornwall","South West"]
["SWC014E/000A/067A","Kenwith, Bideford","Devon and Cornwall","South West"]
["SWO007F/000A/050A","Keveral Gardens, Seaton Culvert Improvements","Devon and Cornwall","South West"]
["SWC011C/000A/056A","Kingsand Coast Protection Works","Devon and Cornwall","South West"]
["SWS005E/000A/016A","Kingsand tidal","Devon and Cornwall","South West"]
["SWS006F/000A/064A","Kingsbridge Flood Improvements","Devon and Cornwall","South West"]
["SWC010E/000A/077A","Ladock FAS","Devon and Cornwall","South West"]
["SWC010F/000A/106A","Lansdowne Park Homes","Devon and Cornwall","South West"]
["SWC011E/000A/109A","Latchbrook Impoundment dam refurbishment","Devon and Cornwall","South West"]
["SWS006F/000A/054A","Leigham Mill Culvert, Plymouth, culvert works to reduce siltation","Devon and Cornwall","South West"]
["SWC010C/000A/050A","Long Rock Revetment Extension East","Devon and Cornwall","South West"]
["SWC010C/000A/051A","Long Rock Revetment Extension West","Devon and Cornwall","South West"]
["SWC011E/000A/110A","Longbrook culvert desilts/ repairs","Devon and Cornwall","South West"]
["SWS005E/000A/007A","Looe","Devon and Cornwall","South West"]
["SWC009E/000A/035A","Lostwithiel - River Fowey","Devon and Cornwall","South West"]
["SWC009E/000A/034A","Lostwithiel - Tanhouse Stream","Devon and Cornwall","South West"]
["SWS005C/000A/077A","Lower Moors Catchment Management, St Mary's","Devon and Cornwall","South West"]
["SWC013E/000A/088A","Lympstone Strand Trash Screen Refurbishment","Devon and Cornwall","South West"]
["SWS006F/000A/025A","Marshall Road Culvert renewal/relining","Devon and Cornwall","South West"]
["SWC009E/000A/086A","Mawgan Porth scheme refurbishment","Devon and Cornwall","South West"]
["SWS005C/000A/078A","Mermaid Sea Wall Repairs, St Mary's","Devon and Cornwall","South West"]
["SWS005E/000A/037A","Mevagissey - fluvial","Devon and Cornwall","South West"]
["SWS005E/000A/038A","Mevagissey - tidal","Devon and Cornwall","South West"]
["SWC010C/000A/052A","Mevagissey Harbour Victoria Pier Refurbishment","Devon and Cornwall","South West"]
["SWC011F/000A/102A","Millbrook Culvert Improvements Phase 2","Devon and Cornwall","South West"]
["SWS005E/000A/039A","Millbrook tidal barrier","Devon and Cornwall","South West"]
["SWC015F/000A/057A","Modbury Flood Improvements","Devon and Cornwall","South West"]
["SWS006F/000A/066A","Monksbridge Flood Alleviation Scheme","Devon and Cornwall","South West"]
["SWS005E/000A/040A","Newlyn - tidal","Devon and Cornwall","South West"]
["SWC011E/000A/003A","Newport, Launceston","Devon and Cornwall","South West"]
["SWC015E/000A/077A","Newton Abbot and Kingsteignton Flood Defence Improvements","Devon and Cornwall","South West"]
["SWC015E/000A/074A","Newton Abbot Wall Refurbishments","Devon and Cornwall","South West"]
["SWC011F/000A/119A","Norossisick Way Culvert Trash Screen ","Devon and Cornwall","South West"]
["SWC014F/000A/051A","Northam Burrows Landfill Erosion Protection Scheme","Devon and Cornwall","South West"]
["SWC015C/000A/045A","Occombe Valley Watercourse Flood Alleviation Scheme","Devon and Cornwall","South West"]
["SWC012F/000A/07CA","Old Feniton Village Flood Alleviation Scheme","Devon and Cornwall","South West"]
["SWC012E/000A/056A","Otter Reach Improvements, Newton Poppleford","Devon and Cornwall","South West"]
["SWC010E/000A/097A","Padstow Gate Refurbishment","Devon and Cornwall","South West"]
["SWC010E/000A/108A","Padstow Town Stream Harbour refurbishment","Devon and Cornwall","South West"]
["SWC015E/000A/075A","Paignton Green Culvert and Pump Refurbishment","Devon and Cornwall","South West"]
["SWC015E/000A/056A","Palmers Dam Reservoir Safety Measures","Devon and Cornwall","South West"]
["SWC010E/000A/074A","Par Moor Diversion culvert (inc HMWB mitigation measures)","Devon and Cornwall","South West"]
["SWC010C/000A/111A","Par/st. Blazey","Devon and Cornwall","South West"]
["SWC010E/000A/109A","Paul Stream channel/culvert refurbishments","Devon and Cornwall","South West"]
["SWC010C/000A/057A","Penzance Promenade Refurbishment","Devon and Cornwall","South West"]
["SWS005E/000A/012A","Penzance Wherrytown and harbour tidal","Devon and Cornwall","South West"]
["SWC010E/000A/046A","Perranporth (Bolingey River) FDS","Devon and Cornwall","South West"]
["SWC009C/000A/050A","Plaidy Coast Protection Works","Devon and Cornwall","South West"]
["SWC011F/000A/060A","Plymouth , Cattewater ,Elphinstone car park sea wall , renovation","Devon and Cornwall","South West"]
["SWC011F/000A/093A","Plymouth Road Woodford Avenue surface water drainage improvements","Devon and Cornwall","South West"]
["SWC011F/000A/059A","Plymouth, Barbican,Phoenix Wharf , renovation","Devon and Cornwall","South West"]
["SWC011F/000A/060A","Plymouth, Cattewater, Oreston Quay, sea wall, refurbishment","Devon and Cornwall","South West"]
["SWC011F/000A/061A","Plymouth, Hooe Lake, The Green, gabion basket refurbishment","Devon and Cornwall","South West"]
["SWC011F/000A/076A","Plymouth, Mount Batten Pier, climate change assessment","Devon and Cornwall","South West"]
["SWC011F/000A/063A","Plymouth, Stonehouse and Durnford Street, Tidal flood alleviation scheme","Devon and Cornwall","South West"]
["SWC011F/000A/064A","Plymouth, The Barbican , West Pier north side harbour steps, reconstruction","Devon and Cornwall","South West"]
["SWC011F/000A/068A","Plymouth, The Plym , Laira rail bridge , flood alleviation scheme.","Devon and Cornwall","South West"]
["SWC011F/000A/070A","Plymouth, The Sound ,Jennycliff  , cliff stablisation","Devon and Cornwall","South West"]
["SWC011F/000A/073A","Plymouth, The Tamar, Mount Wise sea wall ,refurbrishment","Devon and Cornwall","South West"]
["SWS005E/000A/073A","Polperro trash screen improvements","Devon and Cornwall","South West"]
["SWC010C/000A/105A","Polruan Cliff Stabilisation Works","Devon and Cornwall","South West"]
["SWC011F/000A/116A","Ponsonby Road Culvert Trash Screen","Devon and Cornwall","South West"]
["SWS005C/000A/048A","Porthcressa Sea Wall Repairs, St Marys - no funding required beyond 14-15","Devon and Cornwall","South West"]
["SWC010C/000A/058A","Porthleven Harbour Walls Refurbishment","Devon and Cornwall","South West"]
["SWC010E/000A/076A","Portreath FAS","Devon and Cornwall","South West"]
["SWC010E/000A/107A","Portreath Tunnel patch repairs","Devon and Cornwall","South West"]
["SWC013E/000A/035A","Powderham Banks Improvements","Devon and Cornwall","South West"]
["SWC010C/000A/060A","Praa Sands Coast Defence Works Phase Two","Devon and Cornwall","South West"]
["SWC009F/000A/056A","Prideaux and St Blazey Catchment Improvements","Devon and Cornwall","South West"]
["SWC013F/000A/078A","Red Cow Flood Alleviation","Devon and Cornwall","South West"]
["SWC015F/000A/032A","River Fleet Flood Alleviation Scheme","Devon and Cornwall","South West"]
["SWC011E/000A/032A","River Plym Improvements Project","Devon and Cornwall","South West"]
["SWC011F/000A/115A","Riverside Tidal Flood Protection Scheme","Devon and Cornwall","South West"]
["SWC015E/000A/024A","Salcombe","Devon and Cornwall","South West"]
["SWS006F/000A/024A","Saltash Road, Keyham, surface water capacity improvments","Devon and Cornwall","South West"]
["SWS005E/000A/017A","Saltash tidal","Devon and Cornwall","South West"]
["SWC009E/000A/036A","Sandy River Improvements project","Devon and Cornwall","South West"]
["SWC012C/000A/044A","Seaton Beach and Axmouth Harbour - Beach Management Plan","Devon and Cornwall","South West"]
["SWC012E/000A/055A","Seaton Estuary Improvements","Devon and Cornwall","South West"]
["SWS006F/000A/026A","Shearwood Close, Plympton, additional highway drainage","Devon and Cornwall","South West"]
["SWC012C/000A/044A","Sidmouth Main Beach and Eastern Beach - Beach Management Plan","Devon and Cornwall","South West"]
["SWC009E/000A/084A","St Blazey Stream Desilt","Devon and Cornwall","South West"]
["SWC009E/000A/083A","St Blazey Stream Sheet pile re-furbishment","Devon and Cornwall","South West"]
["SWC010C/000A/063A","St Mawes Sea Wall Refurbishment","Devon and Cornwall","South West"]
["SWS005E/000A/015A","St Mawes tidal","Devon and Cornwall","South West"]
["SWS006F/000A/039A","Stenlake Terrace, Plymouth, surface water capacity improvements","Devon and Cornwall","South West"]
["SWC015F/000A/055A","Stibbs Lane Ivybridge","Devon and Cornwall","South West"]
["SWC015F/000A/054A","STOKEINTEIGNHEAD FLOOD 2012 -  REMEDIAL WORKS ","Devon and Cornwall","South West"]
["SWC015E/000A/053A","Teigngrace Jetty Marsh","Devon and Cornwall","South West"]
["SWC015C/000A/046A","TEIGNMOUTH POINT  COASTAL DEFENCE  WALL REPLACEMENT","Devon and Cornwall","South West"]
["SWS006F/000A/030A","The Broadway/ Dean Cross, Plymstock, surface water capacity improvements","Devon and Cornwall","South West"]
["SWC011F/000A/120A","Tidal flap replacement. Stonehouse, Plymouth","Devon and Cornwall","South West"]
["SWC014E/000A/063A","Tinhay scheme refurbishment","Devon and Cornwall","South West"]
["SWC013E/000A/057A","Tiverton Flood Defence Improvements Scheme","Devon and Cornwall","South West"]
["SWC012E/000A/048A","Topsham Tidal Defence Scheme","Devon and Cornwall","South West"]
["SWC011F/000A/114A","Torpoint Ferry Slipway, Devonport Flood Resilience Improvements","Devon and Cornwall","South West"]
["SWC011E/000A/092A","Tory Brook desilt","Devon and Cornwall","South West"]
["SWC015E/000A/048A","Totnes Steamer Quay Wall Repairs","Devon and Cornwall","South West"]
["SWS005C/000A/080A","Town Beach Flood Defence, St Mary's","Devon and Cornwall","South West"]
["SWS005E/000A/065A","Truro Surface Water Improvements","Devon and Cornwall","South West"]
["SWO007F/000A/052A","Tumble Tyn and Paul Stream Culvert Improvements","Devon and Cornwall","South West"]
["SWC011F/000A/117A","Turnchapel Tidal Flood Defence Scheme","Devon and Cornwall","South West"]
["SWS009F/000A/005A","Linear Flood Defence Scheme, Pebbleridge, Westward Ho! (Phase1)","Devon and Cornwall","South West"]
["SWC012F/000A/058A","Uplyme Flood Resilience Scheme ","Devon and Cornwall","South West"]
["SWC015E/000A/049A","Victoria Stream Improvements, Dartmouth","Devon and Cornwall","South West"]
["SWC011F/000A/085A","Vinery Lane, Plymstock, Ordinary watercourse improvements","Devon and Cornwall","South West"]
["SWC009E/000A/047A","Wadebridge flood defence improvements and habitat creation","Devon and Cornwall","South West"]
["SWS009C/000A/004A","Westward Ho! Sea Defences Investigation Scheme","Devon and Cornwall","South West"]
["SWC010F/000A/064A","Wharf Road sea wall improvements St Ives - option 1 raise sea wall","Devon and Cornwall","South West"]
["SWC010F/000A/064A","Wharf Road sea wall improvements St Ives - option 2 IPP","Devon and Cornwall","South West"]
["SWC013E/000A/036A","Whimple Flood Defence Improvements","Devon and Cornwall","South West"]
["SWC009E/000A/037A","White River flood defence re-alignment and habitat creation (inc HMWB mitigation measures)","Devon and Cornwall","South West"]
["SWC011F/000A/091A","Willow Road, Tavistock","Devon and Cornwall","South West"]
["SWS006F/000A/023A","Wolseley Road, Camels Head, carriageway reprofiling ","Devon and Cornwall","South West"]
["SWC012E/000A/050A","Metcombe","Devon and Cornwall","South West"]
["SWO004E/000A/052A","CCTV installation of Devon and Cornwall FRM assets","Devon and Cornwall","South West"]
["SWC015E/000A/029A","Bayards Cove IPP","Devon and Cornwall","South West"]
["SWC015C/000A/034A","Broadsands Sea Wall, Structural Repairs","Devon and Cornwall","South West"]
["SWS005C/000A/044A","Church Sea Wall Repairs, Old Town, St Mary's","Devon and Cornwall","South West"]
["SWS005C/000A/074A","Dune Management Plan and Works, St Mary's","Devon and Cornwall","South West"]
["SWS005C/000A/075A","Great Pool Sea Defence Repairs, St Agnes","Devon and Cornwall","South West"]
["SWS006C/000A/044A","Haldon & Princess Piers Structural Repairs","Devon and Cornwall","South West"]
["SWS005C/000A/076A","Hell Bay Sea Defence Repairs, Bryher","Devon and Cornwall","South West"]
["SWCO13F/00A/077A","MINCINGLAKE /NORTHBROOK WATERCOURSE FLOOD ALLEVIATION SCHEME","Devon and Cornwall","South West"]
["SWS005E/000A/021A","Newlyn - fluvial","Devon and Cornwall","South West"]
["SWC015E/000A/076A","Paignton Seafront","Devon and Cornwall","South West"]
["SWS005E/000A/022A","Penryn tidal","Devon and Cornwall","South West"]
["SWS006F/000A/033A","Plymouth, Sutton Harbour , Coxside, Lock Gate climate change assessment Stage 1 & Stage 2 Works","Devon and Cornwall","South West"]
["SWC011F/000A/066A","Plymouth, The Cattewater, Teats Hill slipway, refurbishment","Devon and Cornwall","South West"]
["SWS005C/000A/079A","Porthminick Revetment Repairs, St Mary's","Devon and Cornwall","South West"]
["SWC012F/000A/060A","Sidmouth Flood Improvement scheme","Devon and Cornwall","South West"]
["SWC013E/000A/086A","Starcross and Cockwood Tidal Defence Scheme","Devon and Cornwall","South West"]
["SWC011E/000A/104A","Tamerton Foliot Stream Screen refurbishment","Devon and Cornwall","South West"]
["SWO004E/000A/080A","Tywardreath Stream Culvert repairs","Devon and Cornwall","South West"]
["SWC009E/000A/021A","Wadebridge sheet pile wall","Devon and Cornwall","South West"]
["SWC013E/000A/096A","Withycombe and Bapton Wall Refurfishments","Devon and Cornwall","South West"]
["SWC011E/000A/103A","Wooda screen inlet refurbishment","Devon and Cornwall","South West"]
["SWC014E/000A/068A","Wrafton Flood Defence Scheme","Devon and Cornwall","South West"]
["SOC999/000/094A","Safe Management of deteriorating Victorian terminal groyne Splash Point Seaford","Solent and South Downs","Southern"]
["THE001E/000A/012A","Thames Estuary Phase 1 Programme (So)","Kent and South London","Southern"]
["SOC001E/000A/099A","Crayford Town Centre","Kent and South London","Southern"]
["THO999F/049A/001A","Wyncham Stream Catchment","Kent and South London","Southern"]
["SOC001E/000A/102A","Ruxley Gravel Pits Storage Scheme Improvement works","Kent and South London","Southern"]
["SOC001E/000A/103A","Old Bexley Defences Refurbishment/Replacement","Kent and South London","Southern"]
["SOC999/000/019A","Shuttle and Wyncham Stream structures","Kent and South London","Southern"]
["SOC001E/000A/105A","Hall Place Flood Storage Reservoir Improvement works","Kent and South London","Southern"]
["SOC001E/000A/096A","Vitbe Sluice decommission and WFD mitigation","Kent and South London","Southern"]
["SOC001E/000A/104A","Lamorbey Park Flood Storage Reservoir Improvement works","Kent and South London","Southern"]
["SOS004E/001A/012A","Seaford Beach Shingle Recycling 2013/14 - 2017/18","Solent and South Downs","Southern"]
["SOC999/000/067A"," Seaford Beach Shingle Recycling 2023/24-2027/28","Solent and South Downs","Southern"]
["SOC999/000/068A"," Seaford Beach Shingle Recycling 2028/29-2032/33","Solent and South Downs","Southern"]
["SOC999/000/069A"," Seaford Beach Shingle Recycling 2033/34-2037/38","Solent and South Downs","Southern"]
["SOS003E/002A/005A","Bulverhythe Capital Maintenance 2013/14-2017/18","Solent and South Downs","Southern"]
["SOC999/000/040A","Bulverhythe Capital Maintenance 2023/24-2027/28","Solent and South Downs","Southern"]
["SOC999/000/041A","Bulverhythe Capital Maintenance 2028/29-3233","Solent and South Downs","Southern"]
["SOC999/000/042A","Bulverhythe Capital Maintenance 2033/34-37/38","Solent and South Downs","Southern"]
["SOS003E/001A/006A","Pett Shingle Renourishment Ph 2-6","Kent and South London","Southern"]
["SOS003E/002A/003A","PEVENSEY BAY SEA DEFENCES PPP","Solent and South Downs","Southern"]
["SOS005E/009A/001A","Medmerry Managed Realignment","Solent and South Downs","Southern"]
["SOS003E/001A/015B","Lydd Ranges Schemes","Kent and South London","Southern"]
["SOS001E/006A/016A","Sandwich Bay Sea Defences (Deal)","Kent and South London","Southern"]
["SOS003F/005A/020A","Greatstone Dunes Management (2012 - 2016)","Kent and South London","Southern"]
["SOS001E/006A/015A","Sandwich Town Tidal Defences","Kent and South London","Southern"]
["SOS003F/005A/10CA","Hythe to Folkestone Beach Management 2020 - 2025","Kent and South London","Southern"]
["SOS004E/002B/007A","Littlehampton Arun Tidal Defences East Bank","Solent and South Downs","Southern"]
["SOO001E/000A/416A","Greggs Wood Stream Culvert Renovation","Kent and South London","Southern"]
["SOS005C/009A/010A","Medmerry monitoring","Solent and South Downs","Southern"]
["SOS005C/011A/013A","Hurst Spit Beach Management Plan 2013/14 to 2016/17","Solent and South Downs","Southern"]
["SOO001F/000A/058A","Dover FAS","Kent and South London","Southern"]
["SOC003E/001A/020A","Leigh & Lower Beult FAS","Kent and South London","Southern"]
["SOS003F/005A/06AA","Hythe to Folkestone Beach Management 2015 - 2020","Kent and South London","Southern"]
["SOS004C/002A/012A","Worthing - Development, delivery and construction of replacement groynes","Solent and South Downs","Southern"]
["SOO002E/000A/300A","Lower Tidal River Arun Strategy Implementation Phase 1","Solent and South Downs","Southern"]
["SOC009F/000A/001A","Hambledon Groundwater Flood Alleviation Scheme","Solent and South Downs","Southern"]
["SOS003E/000A/014A","Marshlands Tidal Basin Improvements","Kent and South London","Southern"]
["SOS005C/009A/009A","Pagham Harbour Inland Banks Flood Alleviation Scheme","Solent and South Downs","Southern"]
["SOO004E/000A/148A","Warnham Mill Reservoir","Solent and South Downs","Southern"]
["SOS005C/010A/008A","Christchurch Bay Beach Management Plan 2018/19 to 2022/23","Solent and South Downs","Southern"]
["SOO001E/000A/431A","Denge Secondary Defence","Kent and South London","Southern"]
["SOO001E/000A/240A","Buleys Weir","Kent and South London","Southern"]
["SOS006C/000B/001A","Schemes arising from West Wight Coastal Strategy","Solent and South Downs","Southern"]
["SOO002E/000A/020A","Nore Farm Stream, Emsworth FAS","Solent and South Downs","Southern"]
["SOC010F/000A/009A","Winchester Flood Mitigation Study","Solent and South Downs","Southern"]
["SOO001E/000A/418A","Chalkmead Sluice Refurbishment","Kent and South London","Southern"]
["SOO001E/000A/419A","Cheveney Sluice Refurbishment","Kent and South London","Southern"]
["SOS003E/001A/014A","Broomhill Sands Coastal Defence Scheme","Kent and South London","Southern"]
["SOO004F/000A/017A","Whistable FAS","Kent and South London","Southern"]
["SOS006C/000B/002A","Schemes arising from South Wight Coastal Strategy","Solent and South Downs","Southern"]
["SOS001C/006A/028A","Kingsdown Beach Management 2015/16-20/21","Kent and South London","Southern"]
["SOS003E/000A/016A","Bulverhythe Capital Maintenance 2018/19-2022/23","Solent and South Downs","Southern"]
["SOS004C/011A/002A","Works from Brighton Marina to River Adur Flood and Coastal Erosion Risk Management Strategy","Solent and South Downs","Southern"]
["SOS005E/005A/006A","Farlington Marsh Tidal Defence Improvements & Realignment","Solent and South Downs","Southern"]
["SOS003C/000A/11AA","Studd Hill & Hampton Coastal Defence Works","Kent and South London","Southern"]
["SOS004C/000A/0010A"," Seaford Beach Shingle Recycling 2018/19 - 2022/23","Solent and South Downs","Southern"]
["SOS005C/009A/30CA","Implementation of the Selsey, Bracklesham and East Wittering Beach Management  (5yrs 2016/17 to 2020/21)","Solent and South Downs","Southern"]
["SOS004C/002A/017A","Shoreham Western Harbour Arm Flood Defence - Development and construction","Solent and South Downs","Southern"]
["SOC010E/000A/011A","Winchester (R. Itchen) Fluvial Flood Alleviation Scheme","Solent and South Downs","Southern"]
["SOC009E/000A/003A","West Brook South Flood Alleviation Scheme Emsworth","Solent and South Downs","Southern"]
["SOS002F/005A/003B","Herne Bay Sea Defence Works (Beach Management)","Kent and South London","Southern"]
["SOS005F/000A/09AA","Forton Lake (Gosport) Coastal Flood and Erosion Risk Management Scheme","Solent and South Downs","Southern"]
["SOS005C/016A/003A","Hill Head to Portsmouth Harbour Entrance Beach Management Plan","Solent and South Downs","Southern"]
["SOO002E/000A/291A","East Wittering Fluvial and Surface Water Improvements","Solent and South Downs","Southern"]
["SOC008E/000A/017A","Tanyard Stream (Steyning) Culvert Improvements","Solent and South Downs","Southern"]
["SOS005C/000A/009A","Fareham Quay Coastal Flood & Erosion Risk Management Scheme","Solent and South Downs","Southern"]
["SOC006E/000A/0015A","Ringmer FAS","Solent and South Downs","Southern"]
["SOC011E/001A/006A","Bartley (New Forest) Fluvial Flood Alleviation Scheme","Solent and South Downs","Southern"]
["SOC011E/000A/006A","Hythe Coastal Flood Allevation Scheme","Solent and South Downs","Southern"]
["SOS006E/000A/007A","Gunville Stream (Isle of Wight) Flood Alleviation Scheme","Solent and South Downs","Southern"]
["SOC007E/000A/017A","Horsham Warnham Mill Reservoir Sluice Replacement","Solent and South Downs","Southern"]
["SOS004E/001A/008A","Southease Parish and Southease to A27 Tidal Embankment Rebuilds","Solent and South Downs","Southern"]
["SOC004E/000A/018A","Oare FAS","Kent and South London","Southern"]
["SOS003C/004A/07AA","Eastbourne Beach Management - 6 yr Plan (2015/16 - 2020/21) (Yrs 1 to 6)","Solent and South Downs","Southern"]
["SOO004E/000A/083A","Great Bells Farm - RHCP","Kent and South London","Southern"]
["SOS002F/005A/03AA","Herne Bay Sea Defence Works","Kent and South London","Southern"]
["SOS005F/001A/006A","South Hayling Island Beach Management Activities","Solent and South Downs","Southern"]
["SOS005F/004A/006A","Portsea Island - Flood Cell 4: North Portsea Island Coastal Flood and Erosion Risk Management Scheme","Solent and South Downs","Southern"]
["SOS005F/004A/002A","Portsea Island - Flood Cell 1: Southsea Coastal Flood and Erosion Risk Management Scheme","Solent and South Downs","Southern"]
["SOS003E/001A/001A","FCEP4 - Hythe Ranges Scheme","Kent and South London","Southern"]
["SOS005C/011A/021A","Hurst Spit Beach Management Plan 2016/17 to 2020/21","Solent and South Downs","Southern"]
["SOS004E/002A/002A","Shoreham Adur Tidal Walls Scheme","Solent and South Downs","Southern"]
["SOS004E/001A/009A","River Ouse, Newhaven to Seaford Flood Alleviation Scheme","Solent and South Downs","Southern"]
["SOS005C/000B/002A ","River Itchen (West Bank) Flood Alleviation Scheme","Solent and South Downs","Southern"]
["SOS001C/006A/027B","Walmer to Kingsdown Timber Groyne Replacement","Kent and South London","Southern"]
["SOS003F/006A/02AA","Hastings Coastal Defence Works - Stage 2 (Pier to Harbour Arm)","Solent and South Downs","Southern"]
["SOO002E/000A/215A","Tidal Flood Defence Improvements, Wallington Shore Road, Fareham","Solent and South Downs","Southern"]
["SOC999/000/127A","Fairlight Cove Coast Protection Works Stage 3","Kent and South London","Southern"]
["SOS005E/005A/001A","Portchester Castle to Paulsgrove Tidal Defence","Solent and South Downs","Southern"]
["SOS005E/009A/014A","Sidlesham - Pagham harbour inland banks improvements  ","Solent and South Downs","Southern"]
["SOS003E/001A/012A","Romney Sands Coastal Defences","Kent and South London","Southern"]
["SOC008E/001A/012A","Aldingbourne Rife Integrated Flood Risk Management Plan and Works ","Solent and South Downs","Southern"]
["SOC010F/000A/004A ","Tanners Brook/Holly Brook (Southampton) Flood Alleviation Scheme","Solent and South Downs","Southern"]
["SOS001E/000A/009A","Elmley Managed Realignment and Habitat Creation","Kent and South London","Southern"]
["SOS001E/000A/007A","Warden Bay Outfall Refurbishment","Kent and South London","Southern"]
["SOS001C/006A/029A","Deal Beach management 2015-2020","Kent and South London","Southern"]
["SOO002E/000A/301A ","Lower Totton Tidal Flood Alleviation Scheme                                                                                                                                                                                                              ","Solent and South Downs","Southern"]
["SOS003E/001A/023A","Rother Tidal Walls East","Kent and South London","Southern"]
["SOS002C/000A/06CA","East of Epple to Westgate Bay - Sea Wall Refacing Works","Kent and South London","Southern"]
["SOS002E/002A/005A","Barton's Point Shingle Recycling","Kent and South London","Southern"]
["SOC006E/000A/0013A","Middle Ouse WFD Mitigation and Wetland Habitat Creation","Solent and South Downs","Southern"]
["SOS004C/000A/020A","Shoreham and Lancing Coastal Defences  Beach Management Plan","Solent and South Downs","Southern"]
["SOS005F/000A/11AA","Seafield & Alverstoke Coastal Flood & Erosion Risk Management Scheme","Solent and South Downs","Southern"]
["SOC010F/000A/003A","Rolles Brook (Southampton) Flood Alleviation Scheme","Solent and South Downs","Southern"]
["SOO001F/000A/055A","Margate FAS","Kent and South London","Southern"]
["SOS005C/000A/0011A","Eastoke Drainage Improvements CFERM Scheme","Solent and South Downs","Southern"]
["SOC008E/000A/020A","Manhood Peninsula Surface Water Management Plan and Actions","Solent and South Downs","Southern"]
["SOC007E/000A/016A","Lancing Surface Water Management Plan and Actions","Solent and South Downs","Southern"]
["SOC005E/000A/0010A","Pevensey Levels Desilting","Solent and South Downs","Southern"]
["SOC004E/000A/011A","Tillingham sluice replacement","Kent and South London","Southern"]
["SOS003F/006A/03AA","Hastings Coastal Defence Works - Stage 3 (SW Outfall to Pier)","Solent and South Downs","Southern"]
["SOC008E/001A/013A","Arundel Tidal Defence Improvements Phase 1 - Low level raising","Solent and South Downs","Southern"]
["SOC005E/000A/006A","Tidal Cuckmere River Restoration","Solent and South Downs","Southern"]
["SOS003F/000A/010A","Hythe FAS","Kent and South London","Southern"]
["SOC007E/000A/014A","Patcham FAS","Solent and South Downs","Southern"]
["SOS004C/003A/014A","Capital Recycling West of R. Arun","Solent and South Downs","Southern"]
["SOO003F/000A/007A","Arun Partnership Watercourse Management (East of District)","Solent and South Downs","Southern"]
["SOC001E/000A/106A","Ebbsfleet Culvert Refurbishment/Replacement","Kent and South London","Southern"]
["SOC007E/000A/010A","Carden Avenue (Brighton) Surface Water Scheme","Solent and South Downs","Southern"]
["SOS002E/007A/001A","Kite Farm Diversion Channel","Kent and South London","Southern"]
["SOC012E/000A/007A","Monktonmead Brook pumping station and outfall improvements, Ryde, Isle of Wight","Solent and South Downs","Southern"]
["SOO002E/000A/296A","Ferring Rife Embankment Improvements","Solent and South Downs","Southern"]
["SOO002E/000A/299A","Angmering Fluvial and Surface Water Flood Improvement Scheme","Solent and South Downs","Southern"]
["SOC008E/000A/026A","Loxwood Flood Risk Management Scheme","Solent and South Downs","Southern"]
["SOC009E/000A/005A","Highfield Close (Waterlooville) Trash Screen Replacement","Solent and South Downs","Southern"]
["SOS005C/009A/015A","Development and implementation of the Selsey, Bracklesham and East Wittering Beach Mangement","Solent and South Downs","Southern"]
["SOO001F/000A/057A","Edenbridge FAS","Kent and South London","Southern"]
["SOC004E/000A/005A","Romney Main Conveyance Improvements","Kent and South London","Southern"]
["SOS004C/003A/021A","Middleton On Sea FCRM Scheme","Solent and South Downs","Southern"]
["SOC003E/000A/029A","Avebury Avenue","Kent and South London","Southern"]
["SOC003E/001A/005A","East Peckham FAS","Kent and South London","Southern"]
["SOC999/000/060A","Pevensey Sea Defences","Solent and South Downs","Southern"]
["SOC999/000/125A","Hamstreet FAS","Kent and South London","Southern"]
["SOS005C/000A/0015A","Old Portsmouth Tidal FCRM Scheme","Solent and South Downs","Southern"]
["SOC999/000/065A","Seaford Beach Shingle Renourishment 2021/22","Solent and South Downs","Southern"]
["SOS003F/005A/18CA","Hythe to Folkestone Beach Recharge","Kent and South London","Southern"]
["SOS002C/004A/02CA","Tankerton Coast Protection Works","Kent and South London","Southern"]
["SOC999/000/072A","St Mary Bourne Flood Alleviation Scheme","Solent and South Downs","Southern"]
["SOO001F/000A/056A","Hildenborough Flood Alleviation","Kent and South London","Southern"]
["SOS005F/004A/005A","Portsea Island - Flood Cell 3: Eastney Lake Coastal Flood and Erosion Risk Management Scheme","Solent and South Downs","Southern"]
["SOC999/000/095A","Saltdean to Peacehaven Beach Accesses","Solent and South Downs","Southern"]
["SOS005C/011A/022A","Hurst Spit Beach Management Plan 2021/22 to 2025/26","Solent and South Downs","Southern"]
["SOC001E/001A/010A","Dartford Flood Alleviation Scheme","Kent and South London","Southern"]
["SOC005E/000A/008A","Hailsham (Knockhatch Stream Extension) Flood Alleviation and River Restoration Scheme","Solent and South Downs","Southern"]
["SOC999/000/052A","Keyhaven Sea Wall Improvements","Solent and South Downs","Southern"]
["SOS005F/004A/008A","Portsea Island - Flood Cell 6: Continental Ferry Port Coastal Flood and Erosion Risk Management Scheme","Solent and South Downs","Southern"]
["SOC999/000/080A","Bishops Waltham (R.Hamble)  Surface Water Flood Alleviation","Solent and South Downs","Southern"]
["SOC012E/000A/0010A","Lukely Brook (Isle of Wight) Flood Alleviation Scheme","Solent and South Downs","Southern"]
["SOO004E/000A/123A","Solent freshwater habitat - Regional Habitat Creation Programme","Solent and South Downs","Southern"]
["SOC999/000/090A","Totton Surface Water Flood Alleviation","Solent and South Downs","Southern"]
["SOC999/000/066A","Seaford Beach Shingle Renourishment 2036/37","Solent and South Downs","Southern"]
["SOC999/000/044A","Cheriton (Upper Itchen) Flood Alleviation Scheme","Solent and South Downs","Southern"]
["SOC999/000/053A","Kings Sombourne (Test Valley) PLP","Solent and South Downs","Southern"]
["SOC999/000/074A","Sutton Scotney (R. Dever) Flood Alleviation Scheme","Solent and South Downs","Southern"]
["SOS005F/005A/009A","Brockhampton Quay, Broadmarsh Landfill Revetment ","Solent and South Downs","Southern"]
["SOS005C/011A/023A","Milford-on-Sea Scheme plus Beach Management Plan 2020/21 to 2024/25","Solent and South Downs","Southern"]
["SOC012E/000A/0011A","River Medina (Newport) Flood Alleviation Scheme","Solent and South Downs","Southern"]
["SOS005C/011A/001A","Barton Coast Defence Scheme Phase 1","Solent and South Downs","Southern"]
["SOC999/000/084A","Hampshire Local Groundwater Management Programme","Solent and South Downs","Southern"]
["SOC999/000/087A","New Forest Small Scale Flood Alleviation Works","Solent and South Downs","Southern"]
["SOC999/000/078A","Warsash Coastal Flood & Erosion Risk Management Scheme (PLP)","Solent and South Downs","Southern"]
["SOC999/000/091A","Twyford Village Surface Water Flood Alleviation","Solent and South Downs","Southern"]
["SOC999/000/079A","Habitat Creation at Stoke, Hayling Island.","Solent and South Downs","Southern"]
["SOC999/000/081A","Bourne Rivulet Groundwater Alleviation","Solent and South Downs","Southern"]
["SOC999/000/083A","Copythorne Surface Water Flood Alleviation Works","Solent and South Downs","Southern"]
["SOC999/000/057A","Marchwood (Southampton) Fluvial Flood Alleviation Scheme","Solent and South Downs","Southern"]
["SOC999/000/077A","Swanick Coastal Flood & Erosion Risk Management Scheme (PLP)","Solent and South Downs","Southern"]
["SOS005C/000A/0010A","Harbour View to Cador Drive (Portchester) Coastal Flood & Erosion Risk Management Scheme","Solent and South Downs","Southern"]
["SOC009E/000A/004A","Emsworth Millpond Property level Protection Scheme","Solent and South Downs","Southern"]
["SOC999/000/058A","Newhaven East Defence Improvements Next Investment","Solent and South Downs","Southern"]
["SOC999/000/085A","Hursley Village Surface Water Flood Alleviation","Solent and South Downs","Southern"]
["SOC011E/001A/002A","Brockenhurst (Lymington River) Flood Alleviation Scheme","Solent and South Downs","Southern"]
["SOC008E/000A/027A","Petersfield Flood Alleviation Scheme","Solent and South Downs","Southern"]
["SOC999/000/082A","Chandler's Ford (School Lane) Surface Water Flood Alleviation Scheme","Solent and South Downs","Southern"]
["SOC999/000/093A","Peacehaven Sea Walls Improvements","Solent and South Downs","Southern"]
["SOC011E/001A/004A","Milford on Sea River Bank Refurishment","Solent and South Downs","Southern"]
["SOC999/000/076A","West Dean, River Dun, Flood Improvements","Solent and South Downs","Southern"]
["SOC999/000/092A","Upper Clatford (Andover) Surface Water Flood Alleviation Scheme","Solent and South Downs","Southern"]
["SOS005F/004A/003A","Portsea Island - Flood Cell 7: HM Naval Base Coastal Flood and Erosion Risk Management Scheme","Solent and South Downs","Southern"]
["SOC999/000/089A","Pitt Village (nr Winchester) Drainage Improvements","Solent and South Downs","Southern"]
["SOS005F/004A/004A","Portsea Island - Flood Cell 2: Fraser Battery Coastal Flood and Erosion Risk Management Scheme","Solent and South Downs","Southern"]
["SOS004C/003A/008A","Bognor Regis Coastal Recharge and Beach Management","Solent and South Downs","Southern"]
["SOC006E/000A/005A","North Street & Talbot Terrace, Lewes, Flood Alleviation Scheme (Sussex Ouse Strategy)","Solent and South Downs","Southern"]
["SOC999/000/086A","Hythe Surface Water Flood Alleviation Scheme","Solent and South Downs","Southern"]
["SOS005E/006A/002A","Titchfield Haven Sea Wall Repairs","Solent and South Downs","Southern"]
["SOC008E/000A/021A","Almodington flood risk bypass channel","Solent and South Downs","Southern"]
["SOC999/000/088A","New Milton Surface Water Flood Alleviation","Solent and South Downs","Southern"]
["SOC005E/000A/007A","Tumblers Bay, R. Cuckmere (Upper Dicker) Asset Change Project","Solent and South Downs","Southern"]
["SOC999/000/054A","Lewes Town Centre West FAS","Solent and South Downs","Southern"]
["SOS005F/004A/007A","Portsea Island - Flood Cell 5: Tipner","Solent and South Downs","Southern"]
["SOC007E/000A/012A","Mile Oak (Hove) Surface Water Scheme","Solent and South Downs","Southern"]
["SOO002E/000A/174A","Lymington Tidal Walls Repair near Lymington Yacht Club","Solent and South Downs","Southern"]
["SOC999/000/059A","Newhaven to Southease Tidal Embankment Inprovements Next Investment","Solent and South Downs","Southern"]
["SOC004F/000A/001A","Etchingham Flood Alleviation Scheme","Kent and South London","Southern"]
["SOC007E/000A/013A","Moulsecoomb Primary School (Brighton) FAS","Solent and South Downs","Southern"]
["SOS005F/000A/10AA","Gosport Waterfront (Unit 14&15) CFERM Scheme","Solent and South Downs","Southern"]
["SOC999/000/071A","Southease to A27 Tidal Embankment Improvements Next Investment (Legal Requirement)","Solent and South Downs","Southern"]
["SOC999/000/070A","Southease Tidal Embankment Improvements Next Investment (Legal Requirement)","Solent and South Downs","Southern"]
["SOC999/000/096A","Telscombe Cliffs Coast Protection Scheme","Solent and South Downs","Southern"]
["SOS004E/001A/011A","Denton Island (Newhaven) FAS","Solent and South Downs","Southern"]
["SOC999/000/075A","Sutton's Hall Weir, R. Ouse (nr Isfield) Enhancements","Solent and South Downs","Southern"]
["SOC999/000/126A","Culverts (Damigos Road and Shorne and Higham) Refurbishment/Replacement","Kent and South London","Southern"]
["SOC999/000/010A"," Brede Automatic Weir Replacement and Fish Pass. South East of Udimore, East Sussex.","Kent and South London","Southern"]
["SOC999/000/009A","Aldington Flood Storage Reservoir","Kent and South London","Southern"]
["SOC999/000/003A","Aylesford and Ditton Tidal Defences","Kent and South London","Southern"]
["SOC999/000/012A","Camber Sands Maintenance ","Kent and South London","Southern"]
["SOC999/000/004A","Chatham Town Centre Tidal FAS","Kent and South London","Southern"]
["SOC999/000/015A","Great Stour Flood Wall Repairs from Grove Ferry to Sandwich","Kent and South London","Southern"]
["SOC999/000/016A","Hackling and Worth Minnis pumping station refurbishment","Kent and South London","Southern"]
["SOC999/000/017A","Hothfield Flood Storage Reservoir","Kent and South London","Southern"]
["SOC999/000/005A","New Hythe Tidal FAS","Kent and South London","Southern"]
["SOC999/000/020A","Northern Sea Wall and Pegwell Bay to Deal shingle recharge","Kent and South London","Southern"]
["SOC999/000/021A","Northern Sea Wall Managed Realignment","Kent and South London","Southern"]
["SOC999/000/013A","River Dour Desilting at Bridge Street","Kent and South London","Southern"]
["SOC999/000/014A","River Dour Weedscreen Replacement","Kent and South London","Southern"]
["SOC999/000/027A","Robertsbridge Flood Alleviation Scheme Remedials. Robertsbridge, East Sussex.","Kent and South London","Southern"]
["SOC999/000/006A","Rochester Tidal FAS","Kent and South London","Southern"]
["SOC999/000/028A","Rye Harbour Farm Remedials. Rye, East Sussex.","Kent and South London","Southern"]
["SOC999/000/029A","Rye Town Walls West Remedials","Kent and South London","Southern"]
["SOC999/000/030A","Seasalter Pumping Station","Kent and South London","Southern"]
["SOC999/000/022A","South Thames Estuary and Marshes Water Level Management Plan Study","Kent and South London","Southern"]
["SOC999/000/032A","Stour pumping stations refurbishments","Kent and South London","Southern"]
["SOC999/000/033A","Stourmouth Pumping Station Study","Kent and South London","Southern"]
["SOC999/000/007A","Swale Flood Gate replacement","Kent and South London","Southern"]
["SOC999/000/008A","Wouldham Tidal FAS","Kent and South London","Southern"]
["SOC999/000/031A","Berm Surface Replacement - Stone Bay Broadstairs","Kent and South London","Southern"]
["SOC999/000/011A","Broadstairs Harbour Flood Defence Scheme","Kent and South London","Southern"]
["SOC999/000/038A","Billingshurst (Upper Arun)  Fluvial Asset Refurbishment Scheme","Solent and South Downs","Southern"]
["SOC999/000/055A","Liss (R.Rother) Flood Alleviation Scheme","Solent and South Downs","Southern"]
["SOC999/000/034A","River Arun and Rother Catchment Property Level Flood Protection Measures","Solent and South Downs","Southern"]
["SOC999/000/064A","Rowner (Gosport) Flood Alleviation Scheme","Solent and South Downs","Southern"]
["SOC999/000/104A","Thorney Island Coastal Habitat Creation Scheme","Solent and South Downs","Southern"]
["SOC999/000/099A","Totton Fluvial Bartley Water Flood Alleviation Scheme","Solent and South Downs","Southern"]
["SOC006E/000A/0012A","Freshfield River (East Sussex) River Enhancements","Solent and South Downs","Southern"]
["SOC999/000/103A","Bishopstoke (R. Itchen) Property Level Protection","Solent and South Downs","Southern"]
["SOC999/000/110A","Stubbington (Fareham) Flood Risk Mitigation Measures","Solent and South Downs","Southern"]
["SOC999/000/107A","Andover (Shepherds Spring Drain) PLP and Flood Alleviation Scheme","Solent and South Downs","Southern"]
["SOC999/000/101A","Whitchurch (Upper Test) Flood Alleviation Scheme","Solent and South Downs","Southern"]
["SOC999/000/106A","Kings Worthy Flood Alleviation Scheme","Solent and South Downs","Southern"]
["SOC999/000/111A","North Baddesley (Tanner's Brook) PLP","Solent and South Downs","Southern"]
["SOC999/000/108A","Bursledon (Hungerford Stream) Property Level Protection","Solent and South Downs","Southern"]
["SOC999/000/098A","Otterbourne, Otterbourne Stream (Hants) Flood Alleviation scheme","Solent and South Downs","Southern"]
["SOC999/000/109A","Upper Beeding and Steyning (R. Adur) Fluvial Asset Refurbishment Scheme","Solent and South Downs","Southern"]
["SOC999/000/112A","East Meon Property Level Protection","Solent and South Downs","Southern"]
["SOC999/000/105A","Lower Swanwick Property Level Protection","Solent and South Downs","Southern"]
["SOC999/000/100A","Sheet Village, R. Rother (Hants) Property Level Protection","Solent and South Downs","Southern"]
["SOC999/000/102A","Overton (R. Test) Flood Alleviation Scheme","Solent and South Downs","Southern"]
["SOC999/000/036A","Arundel Tidal Defence Improvements Phase 2a - Fitzalan Wall Improvements","Solent and South Downs","Southern"]
["SOC999/000/123A","Swale Tidal Outfall Replacement","Kent and South London","Southern"]
["SOC999/000/062A","River Adur Asset Decommissioning Works","Solent and South Downs","Southern"]
["SOC999/000/035A","Arun and Rother Catchment Asset Decommissioning Works","Solent and South Downs","Southern"]
["SOC999/000/115A","Iwade FAS","Kent and South London","Southern"]
["SOC999/000/037A","Arundel Tidal Defence Improvements Phase 2b – Capital Maintenance","Solent and South Downs","Southern"]
["SOC999/000/124A","River Teise Sluices Refurbishment","Kent and South London","Southern"]
["SOC999/000/122A","Swale Innundation Sluices","Kent and South London","Southern"]
["SOC999/000/121A","Swale Culvert Replacement","Kent and South London","Southern"]
["SOC999/000/116A","Medway City Estate Tidal FAS","Kent and South London","Southern"]
["SOC999/000/026A","Whitstable Flood Defence Works","Kent and South London","Southern"]
["SOC999/000/049A","Ferring Coastal Groyne Replacement and Beach Recharge","Solent and South Downs","Southern"]
["SOC999/000/117A","Scrapsgate Tidal FAS","Kent and South London","Southern"]
["SOC999/000/120A","Strood Riverside Flood Defence Improvements","Kent and South London","Southern"]
["SOC999/000/023A","Reculver Coast Protection Works","Kent and South London","Southern"]
["SOC999/000/039A","Bosham Harbour New In Land Defences","Solent and South Downs","Southern"]
["SOC999/000/024A","Seasalter Coast Protection Works","Kent and South London","Southern"]
["SOC999/000/113A","Gillingham Waterfront FAS","Kent and South London","Southern"]
["SOC999/000/119A","Stoke, Middle Stoke and Lower Stoke FAS","Kent and South London","Southern"]
["SOC999/000/118A","Sittingbourne Milton Creek FAS","Kent and South London","Southern"]
["SOC999/000/048A","Felpham Coastal Sea Wall Refurbishment and Beach Recharge (Second Intervention)","Solent and South Downs","Southern"]
["SOC999/000/001A","Sevenoaks Wildfowl & Wetland Reserve Flood Storage Project","Kent and South London","Southern"]
["SOC999/000/114A","Hoo Marina FAS","Kent and South London","Southern"]
["SOC999/000/047A","Elmer Coastal Defences Recharge (Second Intervention)","Solent and South Downs","Southern"]
["SOC999/000/002A","Westerham Stream Investigation","Kent and South London","Southern"]
["SOC999/000/043A","Burgess Hill (Upper Ouse)  Fluvial Asset Refurbishment Scheme","Solent and South Downs","Southern"]
["SOC999/000/045A","Chichester City (R.Lavant)  Fluvial Asset Refurbishment Scheme","Solent and South Downs","Southern"]
["SOC999/000/050A","Haywards Heath (Upper Ouse) Fluvial Asset Refurbishment Scheme","Solent and South Downs","Southern"]
["SOC999/000/051A","Horsham (R.Arun) Fluvial Asset Refurbishment Scheme","Solent and South Downs","Southern"]
["SOC999/000/046A","Chichester Harbour Property Level Flood Protection Measures","Solent and South Downs","Southern"]
["SOC999/000/073A","Storrington (R.Stor)  Fluvial Asset Refurbishment Scheme","Solent and South Downs","Southern"]
["SOS005C/016A/006A","Hample-Le-Rice Property Level Protection","Solent and South Downs","Southern"]
["SOC999/000/061A","Pulborough Pumping Station Decommissioning Works","Solent and South Downs","Southern"]
["SOS004C/003A/022A","Pagham Beach Erosion Management Option","Solent and South Downs","Southern"]
["SOC010F/000A/001A","Monks Brook (Chandler's Ford) Flood Alleviation Scheme","Solent and South Downs","Southern"]
["SOS003C/000A/16CA","Thanet Groyne Reconstruction/Refurbishment","Kent and South London","Southern"]
["SOO001E/000A/093A","JURY'S GAP REFURBISHMENT","Kent and South London","Southern"]
["SOO001E/000A/375A","Queenborough Creek Barrier upgrade and refurb.","Kent and South London","Southern"]
["SOS002C/000A/015A","Ramsgate Main Beach - Timber Groyne Installation","Kent and South London","Southern"]
["SOS002F/006A/01CA","Whitstable Harbour Flood Defence Works","Kent and South London","Southern"]
["SOC002E/000A/014B","Aylesford Stream FAS, Ashford","Kent and South London","Southern"]
["SOC007E/000A/015A","Hassocks Surface Water Management Plan and Actions","Solent and South Downs","Southern"]
["SOC007E/000A/009A","Bevendean Surface water scheme","Solent and South Downs","Southern"]
["SOC002E-000A-017A","Great Stour Flood Alleviation Schemes","Kent and South London","Southern"]
["SOC009E/000A/002A","West Brook North Flood Alleviation Scheme, Emsworth","Solent and South Downs","Southern"]
["SOC002E/000A/030A","Gorrell Stream Culvert","Kent and South London","Southern"]
["SOS004C/003A/019A","Land Drainage Outfall Improvement Provision (Rustington and East Preston)","Solent and South Downs","Southern"]
["SOC002E/008A/002A","Plenty Brook Culvert","Kent and South London","Southern"]
["SOC003E/001A/009A","Five Oak Green FAS","Kent and South London","Southern"]
["SOS003E/001A/024A","Denge Beach Management  2011-15","Kent and South London","Southern"]
["SOS002C/000A/013A","Minster Sheppey Coast Protection Works","Kent and South London","Southern"]
["SOS006C/000A/06SA","Totland Bay Seawall","Solent and South Downs","Southern"]
["SOS004E/003A/009A","Elmer Beach Management Works","Solent and South Downs","Southern"]
["SOC008E/000A/019A","Billingshurst Surface Water Management Plan and Actions","Solent and South Downs","Southern"]
["SOC010F/000A/0010A","Priory Road (Southampton) River Itchen PLP","Solent and South Downs","Southern"]
["SOC010F/000A/007A","Candover Brook (Preston Candover and Brown Candover) Flood Alleviation Scheme","Solent and South Downs","Southern"]
["SOC010F/000A/008A","Upper Test Villages (Deane and Cole Henley) Flood Alleviation Scheme","Solent and South Downs","Southern"]
["SOS004C/003A/018A","Land Drainage Outfall Extension - Peak Lane, Kingston","Solent and South Downs","Southern"]
["SOO004C/000A/060A","Old Redbridge Lane (Southampton) PLP Scheme","Solent and South Downs","Southern"]
["SOC010E/003A/006A","Romsey Flood Alleviation","Solent and South Downs","Southern"]
["SOC003E/001A/016A","Middle Medway Strategy Stand Alone Defences","Kent and South London","Southern"]
["SOC003E/000A/010B","Paddock Wood FAS","Kent and South London","Southern"]
["SOS004C/003A/008A","Aldwick Groyne Replacement Scheme Ph 10","Solent and South Downs","Southern"]
["SOC005E/000A/0013A","Polegate Flood Alleviation Scheme","Solent and South Downs","Southern"]
["SOC006E/000A/0010A","Winterbourne Stream (Lewes) Outfall Tidal Doors Replacement","Solent and South Downs","Southern"]
["SOS003C/000A/15CA","Westgate - St Mildred's Bay - Coping/Berm Slab Replacement","Kent and South London","Southern"]
["SOC008E/000A/025A","Lidsey Rife (Bognor Regis) Boat Ramps","Solent and South Downs","Southern"]
["SOC011E/000A/005A","Calmore, Calmore Canal (Totton) Flood Alleviation Scheme","Solent and South Downs","Southern"]
["SOS002C/000A/010A","Viking Bay to Dumpton Gap - Berm Slab, Coping and Apron Repairs","Kent and South London","Southern"]
["SOS002C/000A/014A","Broadstairs Harbour - Groyne Refurbishment","Kent and South London","Southern"]
["SOO002E/000A/302A ","Replacement Weedboom, Timsbury, River Test","Solent and South Downs","Southern"]
["SOC008E/000A/024A","Chichester Argos Penstocks","Solent and South Downs","Southern"]
["SOC002E/000A/016A","South Ashford FAS, Ashford","Kent and South London","Southern"]
["SOO001E/000A/374A","Front Brents FAS","Kent and South London","Southern"]
["SOS003C/000A/12CA","Minnis - Grenham Bay - Coping/Berm Slab Replacement","Kent and South London","Southern"]
["SOO001E/000A/421A","Ashford Conveyance Improvements","Kent and South London","Southern"]
["SOC010F/000A/006A","Appleshaw  (Andover) Surface Water Flood Alleviation Scheme","Solent and South Downs","Southern"]
["SOC006E/000A/0011A","Barcombe Mills, R. Ouse PLP","Solent and South Downs","Southern"]
["SOS005E/000A/008A","Solent intertidal habitat - Regional Habitat Creation Programme","Solent and South Downs","Southern"]
["SOS004F/000A/001A","Ovingdean to Saltean (Defence Length 2) Project","Solent and South Downs","Southern"]
["SOS003F/000A/011A","Downs Road, Folkestone Surface Water ","Kent and South London","Southern"]
["SOC009F/000A/003A","Lavant Valley (Finchdean and Rowlands Castle) Surface Water Flood Alleviation Scheme","Solent and South Downs","Southern"]
["SOC006E/000A/0014A","North Malling, R. Ouse (Lewes) Property Level Protection","Solent and South Downs","Southern"]
["SOS005C/011A/17AA","Milford-on-Sea Scheme plus Beach Management Plan 2016/17 to 2019/20","Solent and South Downs","Southern"]
["SOC010E/000A/012A","Romsey (R. Test) Fluvial Flood Alleviation Scheme","Solent and South Downs","Southern"]
["SOO004C/000A/006A","East Stream, Pevensey Levels (IDB) Drainage Improvements","Solent and South Downs","Southern"]
["SOS004F/000A/001B","Ovingdean to Saltean (Defence Length 3) Project","Solent and South Downs","Southern"]
["SOS004F/000A/002A","Brighton Marina to Newhaven West Beach Management","Solent and South Downs","Southern"]
["SOS005C/000A/0014A","Selsmore and Mengham CFERM Scheme","Solent and South Downs","Southern"]
["SOS004C/003A/007A","Littlehampton Arun West Bank Improvements","Solent and South Downs","Southern"]
["SOO004C/000A/003A","Bourne Stream, Eastbourne Improvements Implementation Work","Solent and South Downs","Southern"]
["SOC003E/000A/025A","Conyer FAS","Kent and South London","Southern"]
["SOC006F/000A/003A","Meeching Valley, Newhaven Flood Alleviation Implementation Work ","Solent and South Downs","Southern"]
["SOO004C/000A/005A","Crowhurst Flood Alleviation Scheme","Solent and South Downs","Southern"]
["SOS004C/003A/008B","Aldwick Groyne Replacement Scheme Ph 11","Solent and South Downs","Southern"]
["SOC012E/001A/001A","Embankment Road, Bembridge, Tidal Flood Defence","Solent and South Downs","Southern"]
["SOC006E/000A/0016A","R. Uck/Ouse, Isfield Mill, Pimms Lock, Hempstead Mill Asset Management Study","Solent and South Downs","Southern"]
["SOC002E/000A/027A","Kennington Stream Trash Screen","Kent and South London","Southern"]
["SOO002E/00A/303A","Hulbert Road culvert repair Waterlooville","Solent and South Downs","Southern"]
["SOC008E/000A/028A","Provender Mill, R. Arun (Horsham), Tilting Weir Replacement (MEICA)","Solent and South Downs","Southern"]
["SOC002E/008A/004A","Bridge & Patrixbourne Flood Alleviation Options Investigation","Kent and South London","Southern"]
["SOC002E/008A/003A","Littlebourne & Wickhambreaux Flood Alleviation Scheme","Kent and South London","Southern"]
["SOC005E/000A/009A","Milton Lock, R. Cuckmere (Alfriston) Asset Change Project","Solent and South Downs","Southern"]
["SOC005E/000A/005A","St Leonards Flood Alleviation Scheme","Solent and South Downs","Southern"]
["SOO001F/000A/060A","Beult Towns FAS","Kent and South London","Southern"]
["SOS004F/000A/005A","Saltdean to Peacehaven Groyne Refurbishment","Solent and South Downs","Southern"]
["SOS004F/000A/003A","Peacehaven, Groynes 18 & 19: Removal and Improvement","Solent and South Downs","Southern"]
["SOC003E/000A/026A","Copperhouse Lane Flood Defence Improvements","Kent and South London","Southern"]
["SOC008E/000A/023A","Burgess Hill, Cants Lane to Marlborough Drive (Worlds End Stream) Channel Improvements","Solent and South Downs","Southern"]
["SOC002E/008A/005A","Nailbourne Options Investigation","Kent and South London","Southern"]
["SOC003F/000A/001A","Jarvis Brook, Crowborough Flood Alleviation Scheme","Kent and South London","Southern"]
["SOC003E/000A/024A","Jarvis Brook, Crowborough Flood Alleviation Scheme","Kent and South London","Southern"]
["SOO004C/000A/004A","The Gorses, Bexhill Flood Alleviation Scheme","Solent and South Downs","Southern"]
["SOC004E/000A/019A","Ridham Dock Flood Defence Improvements","Kent and South London","Southern"]
["SOO001E/000A/442A","Maytham Tilting Weir Replacement","Kent and South London","Southern"]
["SOC001E/000A/107A","Chipstead Hydraulic Study and Weir Refurbishment","Kent and South London","Southern"]
["SOO001E/000A/447A","Brasted & Sundridge Weir Removal","Kent and South London","Southern"]
["SOC002E/008A/001A","Stonar Cut Refurbishment Works","Kent and South London","Southern"]
["SOC002E/000A/028A","Seabrook Stream Improvements","Kent and South London","Southern"]
["SOS004C/003A/020A","Middleton on Sea Breastworks & Seawall Toe Protection","Solent and South Downs","Southern"]
["SOC004E/000A/016A","Winchelsea Beach Flood Alleviation Scheme","Kent and South London","Southern"]
["SOC004E/000A/017A","Etchingham Flood Alleviation Scheme","Kent and South London","Southern"]
["SOC002E/002A/002A","Lower Stour Conveyance Activities","Kent and South London","Southern"]
["SOC004E/000A/010A","Brede automatic weir and fish pass replacement","Kent and South London","Southern"]
["SOS004C/000A/021A","Pagham Beach Shingle Regrading","Solent and South Downs","Southern"]
["SOC004E/000A/020A","Dymchurch Sea Wall Access Remedials","Kent and South London","Southern"]
["SOC002E/000A/018A","Minster Pumping Station Automatic Weed Screen","Kent and South London","Southern"]
["SOC004E/000A/004A","River Rother Restoration Study","Kent and South London","Southern"]
["SOS002C/005A/02AA","Hampton to Bishopstone Coast Protection Works","Kent and South London","Southern"]
["SOO002E/000A/187A","Manor Farm, River Test - Regional Habitat Creation Programme","Solent and South Downs","Southern"]
["SOS004C/003A/010A","Arun to Pagham Beach Management Plan","Solent and South Downs","Southern"]
["SOC001E/000A/097A","Upper Westerham Flood Alleviation Scheme","Kent and South London","Southern"]
["SOS004C/002A/014A","Goring-by-sea - Development, delivery and construction of replacement groynes","Solent and South Downs","Southern"]
["SOO001F/000A/059A","Church Street, Deal FAS","Kent and South London","Southern"]
["SOS003E/001A/027A","Pett Shingle Nourishment Phase 7 - 11","Kent and South London","Southern"]
["SOO001E/000A/443A","Swanscombe Peninsula Defence Improvements and Land raising","Kent and South London","Southern"]
["SOC010F/000A/0011A","Pitton Flood Relief Scheme","Solent and South Downs","Southern"]
["SOO001E/000A/456A","Northern Sea Wall","Kent and South London","Southern"]
["THO999F/049A/003A","Crayford Integrated Drainage Study Output Scheme","Kent and South London","Southern"]
["SOC002E/000A/021A","Brewery Sluice Reinstatement","Kent and South London","Southern"]
["THC001E/002A/001A","Banbury FAS","West Thames","Thames"]
["THC999/000/227A","Clifton Weir A Refurbishment","West Thames","Thames"]
["THC002E/000A/023A","High Street, Charwelton","West Thames","Thames"]
["THC999/000/256A","Lower Shiplake Flood Risk Management Scheme","West Thames","Thames"]
["THC036E/001A/033A","Feildes Weir, Hoddesdon - PLC Upgrade/Simplification","Herts and North London","Thames"]
["THC036E/000A/024A","HNL Refurbishment Package: Meadgate Sluices, Hoddesdon, Actuator and Gearbox Replacement","Herts and North London","Thames"]
["THC017E/000A/023A","Aberford Road Oil Interceptor H&S Improvements","Herts and North London","Thames"]
["THC028E/000A/002A","HNL Refurbishment Package: Staples Road Flood Storage Area, Loughton - Telemetry kiosk refurbishment","Herts and North London","Thames"]
["THC034E/000A/003B","Wychdell FSR - Stevenage","Herts and North London","Thames"]
["THC035E/000A/001A","Barton Road, Great Bramingham FAS","Herts and North London","Thames"]
["THC000E/000A/227A","Region wide Radio Frequency Tagging Identification of M & E Assets","Herts and North London","Thames"]
["THC999/000/311A","Rickmansworth FAS","Herts and North London","Thames"]
["THC033E/001A/005A"," Little Hadham A120 Bypass flood storage area","Herts and North London","Thames"]
["THC033E/000A/015A","Amwell Bailey Bridge, Ware - Purchase","Herts and North London","Thames"]
["THC034E/000A/010A","Aston Valley Flood Storage Area, Stevenage - Statutory Remedial Works","Herts and North London","Thames"]
["THC035E/000A/002A","Barnfield West Academy, Poynters Road FAS","Herts and North London","Thames"]
["THC999/000/193A","Berm Bridge, Watham Abbey, Ismailia Flap Valves Replacement","Herts and North London","Thames"]
["THC017E/000A/017A","Central Watford Improvement Works","Herts and North London","Thames"]
["THC999/000/308A","Cheshunt FAS","Herts and North London","Thames"]
["THC999/000/309A","Clavering and Maunden Flood Alleviation Scheme","Herts and North London","Thames"]
["THC037E/000A/001A","Cobbins Brook FAS, Upshire - Remedial Works","Herts and North London","Thames"]
["THC000E/000A/229A","Culvert Remedial Works Feasibility Study","Herts and North London","Thames"]
["THO999F/052A/004A","Darkes Lane Surface Water and Watercourse Flood Risk Modelling","Herts and North London","Thames"]
["THC999/000/310A","Harpenden FAS","Herts and North London","Thames"]
["THO999F/052A/001A","Harpenden Surface Water Flood Risk Scheme Scoping","Herts and North London","Thames"]
["THC000E/000A/224A","Heavy River Improvement Package","Herts and North London","Thames"]
["THO999F/052A/002A","Hertford Surface Water Study","Herts and North London","Thames"]
["THC033E/000A/015A","HNL Refurbishment Package: Amwell Bailey Bridge, Ware - Refurbishment","Herts and North London","Thames"]
["THC036E/001A/035A","HNL Refurbishment Package: Flood Relief Channel Sluices, Nazeing - Replacement Penstocks to Sluice Gates (incl. Richard White; Kiora Sluice & David Stoker)","Herts and North London","Thames"]
["THC999/000/197A","HNL Refurbishment Package: Hardmead Sluice, Ware - Replacement of Flood Control Structure","Herts and North London","Thames"]
["THC036E/001A/036A","HNL Refurbishment Package: Hardmead Sluice, Ware - Replacement of Penstocks to Sluice Gate","Herts and North London","Thames"]
["THC036E/001A/034A","HNL Refurbishment Package: LFRC Control Structures, Ware to Enfield Island - Gantry Hoist Replacement Package","Herts and North London","Thames"]
["THC000E/000A/215A","HNL Refurbishment Package: Rammey Sluice, Waltham Abbey - Replacement of Flood Control Structure","Herts and North London","Thames"]
["THC033E/000A/017A","HNL Refurbishment Package: Sele Mill Siphon, Hertford - Electrical panel and lighting refurbishment","Herts and North London","Thames"]
["THC034E/001B/001A","Houghton Regis FSA","Herts and North London","Thames"]
["THO999F/045A/001A","Kimpton Groundwater Flood Risk Management Options Study Herts CC","Herts and North London","Thames"]
["THC017E/001A/004A","London Colney Innovation","Herts and North London","Thames"]
["THC018E/000A/017A","London Colney Surface Water and Watercourse Study","Herts and North London","Thames"]
["THO999F/052A/003A","Long Marston and Surrounding Area Surface Water Study","Herts and North London","Thames"]
["THC036E/001A/026A","Nazeing FAS","Herts and North London","Thames"]
["THC036E/001A/037A","Nazeing Lake, Nazeing - Embankment","Herts and North London","Thames"]
["THC036E/001A/038A","Newmans Sluices, Waltham Abbey, Installation of Lorry Access","Herts and North London","Thames"]
["THC034E/000A/011A","Papermill Stream Penstock, Channel and Bridge, Standon - M&E Upgrade & stuctural repairs ","Herts and North London","Thames"]
["THC034E/000A/009A","Puckeridge FAS","Herts and North London","Thames"]
["THC018E/000A/016A","Rickmansworth Combined Flood Risk Study","Herts and North London","Thames"]
["THC999/000/312A","Roydon Flood Alleviation Scheme","Herts and North London","Thames"]
["THC999/000/313A","Spellbrook FAS","Herts and North London","Thames"]
["","Stanstead Abbots flood alleviation","West Thames","Thames"]
["THC033E/000A/014A","Stanstead Mountfitchet FAS","Herts and North London","Thames"]
["THC000E/000A/250A","Takeley - Culvert removal and screen replacement ","Herts and North London","Thames"]
["THC000E/000A/241A","Warrengate Rd Flood Gate Repairs & Traffic Management Improvement","Herts and North London","Thames"]
["THO999F/052A/005A","Watford Combined Surface Water and Fluvial Flood Risk Study","Herts and North London","Thames"]
["AEO000E/000A/392A","Works arising from Halrow Surface Water Management Plan","Herts and North London","Thames"]
["THE001E/000A/012A","Thames Estuary Phase 1 Programme (TTD)","Kent and South London","Thames"]
["THO999F/022A/002A","RB Kingston-Upon-Thames Surbiton Stream refurbishment","Kent and South London","Thames"]
["THC000E/000A/248A","Crayford Marshes Earth Tidal Flood Embankment Stability Study & Works, to east of Slade Green, Erith, Greater London.","Kent and South London","Thames"]
["THC032E/000A/010A","Beddington Park","Kent and South London","Thames"]
["THO999F/046A/002A","Kendall Close / Ullswater Close / Charville Lane","Herts and North London","Thames"]
["THO999F/014A/003A","Mill Hill Circus CDA Option 3 flood storage south of st Josephs College Grounds","Herts and North London","Thames"]
["THC021E/000A/008A","Anton Crescent FSA","Kent and South London","Thames"]
["THC019E/000A/002A","Pinn FAS","Herts and North London","Thames"]
["THC024E/000A/020A","Bury Farm Flood Storage Area and Edgwarebury Park Flood Storage Area Access Track","Herts and North London","Thames"]
["THC023E/000A/011A","HNL Refurbishment Package: Kidds Mill Sluice- Electrical kiosk refurbishment","Herts and North London","Thames"]
["THC029E/001A/012A","Ray Park Embankment Repair, Woodford","Herts and North London","Thames"]
["THO999F/014A/002A","Decoy Brook Catchment (CDA 018) Flood Alleviation Scheme.","Herts and North London","Thames"]
["THC038E/000A/027A","Thames weirs Capital Invesment Plan (CIP) update","West Thames","Thames"]
["THO999F/041A/002B","Westminster North West Strategy","Herts and North London","Thames"]
["THO999F/024A/007A","Loxford Water Seven Kings Surface Water Alleviation Scheme LB Redbridge","Herts and North London","Thames"]
["THC020E/000A/008A","Surbiton Stream Flood Alleviation Scheme","Kent and South London","Thames"]
["THO999F/027A/009A","Central Camberwell Flood Alleviation Scheme","Kent and South London","Thames"]
["THO999F/034A/003A","Tooting & Earlsfield Flood Alleviation Scheme ","Kent and South London","Thames"]
["THO999F/027A/007A","North Peckham Flood Alleviation Scheme","Kent and South London","Thames"]
["THO999F/028A/002A","Wickham Valley Water Course Flood Storage Scheme","Kent and South London","Thames"]
["THO999F/027A/006A","West Camberwell Flood Alleviation Scheme","Kent and South London","Thames"]
["THO999F/013A/002A","Larkspur Close Tottenham SWFAS LB Haringey","Herts and North London","Thames"]
["THO999F/028A/004A","Clothworkers Wood - Wet Woodland Flood Storage Scheme","Kent and South London","Thames"]
["THO999F/040A/006A","East Merton Flood Alleviation Scheme","Kent and South London","Thames"]
["THO999F/044A/001A","Amhurst Road Dalston Lane SWFAS LB Hackney","Herts and North London","Thames"]
["THC030E/000A/002A","Beam Tidal Sluice & Horseshoe Corner, Dagenham - Cladding Removal","Herts and North London","Thames"]
["THC999/000/300A","Beddington Gardens Flood Alleviation Scheme","Kent and South London","Thames"]
["THC000E/000A/217A","Bentley Priory FSA ","Herts and North London","Thames"]
["THC021E/000A/010A","Beverley Brook Tidal Flap valve improvements","Kent and South London","Thames"]
["THC024E/000A/027A","Brentford","Herts and North London","Thames"]
["THC999/000/301A","Burton's Road FAS","Kent and South London","Thames"]
["THC024E/000A/017A","Cannon Brook & Mad Bess Brook FMS","Herts and North London","Thames"]
["THO999F/022A/005A","CDA 08 Acre Road Kingston Flood Alleviation Scheme","Kent and South London","Thames"]
["THO999F/022A/006A","CDA 09 New Malden North Flood Alleviation Scheme","Kent and South London","Thames"]
["THO999F/022A/007A","CDA 18 Hook Kelvin Grove Flood Alleviation Scheme","Kent and South London","Thames"]
["THO999F/010A/008A","CDA 28 Carshalton Centre Flood Alleviation Scheme","Kent and South London","Thames"]
["THO999F/010A/005A","CDA 33 Hackbridge Town Flood Alleviation Scheme","Kent and South London","Thames"]
["THO999F/044A/005A","CDA_029:  Lordship Rd, Grazebrook Road, Stoke Newington","Herts and North London","Thames"]
["THO999F/024A/009A","Chadwell Heath Flood Alleviation Scheme","Herts and North London","Thames"]
["THC036E/000A/018B","Ching Brook Flood Alleviation Scheme","Herts and North London","Thames"]
["THO999F/034A/002A","Clapham Junction Flood Alleviation Scheme","Kent and South London","Thames"]
["THO999F/024A/010A","Clayhall Flood Alleviation Scheme","Herts and North London","Thames"]
["THO999F/040A/005A","Cottenham Park Flood Alleviation Scheme","Kent and South London","Thames"]
["THC024E/000A/029A","Critical Drainage Area 007 - High Street Acton Flood Alleviation Scheme","Herts and North London","Thames"]
["THC022E/000A/034A","Culvert Capacity and Trash Screen Effectiveness Investigation on the Casterbridge and Lee Road Screens","Kent and South London","Thames"]
["THC022E/000A/032A","Culvert Capacity and Trash Screen Effectiveness Investigation on the Quaggy River in the vicinty of Eltham, Greenwich","Kent and South London","Thames"]
["THC022E/000A/033A","Culvert Capacity and Trash Screen Effectiveness Investigation on the Spring Brook, Bromley","Kent and South London","Thames"]
["THC000E/011A/004A","Darent Industrial Estate Fluvial Flood Alleviation Scheme Works","Kent and South London","Thames"]
["THC021E/000A/009A","Derwent Road Flood Storage Area Improvements","Kent and South London","Thames"]
["THO999F/027A/008A","East Camberwell Flood Alleviation Scheme","Kent and South London","Thames"]
["Various","Enfield LA Projects","Herts and North London","Thames"]
["THO999F/051A/001A","FILLEBROOK SURFACE WATER INVESTIGATION","Herts and North London","Thames"]
["THC027E/000A/002A","Fords Pits, Dagenham - Access Improvements ","Herts and North London","Thames"]
["THC032E/001A/006A","Graveney FAS","Kent and South London","Thames"]
["THC024E/000A/016A","Greenford FMS","Herts and North London","Thames"]
["THO999F/044A/003A","Hackney Wick CDA 12 SWFAS LB Hackney","Herts and North London","Thames"]
["THC999/000/302A","Hampton Court Road","Kent and South London","Thames"]
["THC023E/000A/012A","Headstone Flood Alleviation Scheme","Herts and North London","Thames"]
["THC024E/000A/025A","Highgate Flood Alleviation Scheme","Herts and North London","Thames"]
["THC999/000/194A","HNL Refurbishment Package: Coldharbour Lane, Rainham - Flap Valve and Penstock","Herts and North London","Thames"]
["THC024E/000A/031A","HNL Refurbishment Package: Dagenham Brook Flap Valve, Leyton - Replacement of Flap Valve","Herts and North London","Thames"]
["THC999/000/305A","HNL Refurbishment Package: Frog Island Tidal Sluices Penstock Automation","Herts and North London","Thames"]
["THC019E/000A/003A","HNL Refurbishment Package: George V Flood Storage Area, Pinner - Telemetry kiosk refurbishment","Herts and North London","Thames"]
["THC030E/000A/001A","HNL Refurbishment Package: Horseshoe Corner, Dagenham - Replacement Hinges","Herts and North London","Thames"]
["THC036E/001A/039A","HNL Refurbishment Package: Leyton Tidal Flap, Leyton - Modification Works","Herts and North London","Thames"]
["THC000E/000A/251A","HNL Refurbishment Package: Oval Road Pumping Station, Dagenham - Refurbishment","Herts and North London","Thames"]
["THC999/000/306A","HNL Refurbishment Package: Rainham Tidal Sluice, Rainham - Power Supply","Herts and North London","Thames"]
["THC000E/000A/221A","Huntsmoor Weir Site Access Track","Herts and North London","Thames"]
["THC017E/000A/022A","Hydraulic Ram Replacement at Huntsmoor Weir","Herts and North London","Thames"]
["THC029E/000A/005A","Illford, Seven Kings Water Flood Alleviation Scheme ","Herts and North London","Thames"]
["THC024E/000A/024A","Islington Central","Herts and North London","Thames"]
["THC024E/000A/023A","Islington North","Herts and North London","Thames"]
["THC024E/000A/030A","Islington South","Herts and North London","Thames"]
["THC020E/000A/009A","Kingston Town Centre Flood Alleviation Scheme","Kent and South London","Thames"]
["THC999/000/314A","Longford Flood Alleviation Scheme","Herts and North London","Thames"]
["THC000E/000A/249A","Mayes Brook - Clare Gardens and Westrow Drive","Herts and North London","Thames"]
["THC000E/000A/254A","Mayes Brook & Ripple Road, Barking - actuator improvements","Herts and North London","Thames"]
["THO999F/024A/008A","Mayes Brook SWFAS LB Redbridge","Herts and North London","Thames"]
["THC999/000/212A","MOLESEY WEIR \"D\" Replacement","West Thames","Thames"]
["THC036E/001A/029A","Moselle Brook Culvert Refurbishment","Herts and North London","Thames"]
["THC022E/000A/026A","Mottingham Lane Trash Screen Effectiveness Investigation, Quaggy, Bromley","Kent and South London","Thames"]
["THO999F/044A/004A","Norcott Road CDA 19 SWFAS LB Hackney","Herts and North London","Thames"]
["THC024E/000A/028A","North Circular at Brent Cross Flood Alleviation Scheme","Herts and North London","Thames"]
["THO999F/027A/005A","Peckham Rye Flood Alleviation Scheme","Kent and South London","Thames"]
["THC036E/001A/003A","Pymmes Brook Flood Alleviation Scheme","Herts and North London","Thames"]
["THC000E/000A/218A","Queensway Access Ramp & Track","Herts and North London","Thames"]
["THC999/000/195A","Rammey Sluices to Newmans Sluices, Waltham Abbey, Access Track Security Fencing Upgrade","Herts and North London","Thames"]
["THC022E/000A/031A","Ravensbourne (East Branch) at Southborough flood alleviation study","Kent and South London","Thames"]
["THC025E/000A/006A","Ravensbourne Access","Herts and North London","Thames"]
["THO999F/050A/001A","Ravensbourne West branch Integrated flood risk study (inc groundwater mitigation measures) and Main River Culvert improvement works.","Kent and South London","Thames"]
["THC022E/000A/030A","Ravensbourne West Wickham to Shortlands flood alleviation study and works","Kent and South London","Thames"]
["THO999F/028A/003A","RBG Groundwater preperation","Kent and South London","Thames"]
["THC999/000/196A","River Crane Banks Repair/Replacement","Herts and North London","Thames"]
["THC029E/001A/009A","River Roding Strategy - Works from : Woodford Surface Water FAS","Herts and North London","Thames"]
["SOC001E/000A/098A","Riverside Gardens Restoration and Groundwater Study","Kent and South London","Thames"]
["THO999F/022A/004A","Robinhood Way Replacement Trash screen","Kent and South London","Thames"]
["THO999F/040A/001A","Seely Road Flood Alleviation Scheme","Kent and South London","Thames"]
["THO999F/051A/002A","SOUTH CHINGFORD SURFACE WATER INVESTIGATION","Herts and North London","Thames"]
["THC999/000/316A","St Margaret's Community at Risk, Richmond on Thames London Flood Alleviation Scheme ","Herts and North London","Thames"]
["THO999F/026A/003A","Streatham Vale Flood Alleviation Scheme","Kent and South London","Thames"]
["THC038E/000A/026A","Teddington Weir \"A\" ","West Thames","Thames"]
["THC017E/001A/003A","The Common West Drayton Middlesex UB7 7HQ","Herts and North London","Thames"]
["THC024E/000A/018A","Tokyngton & Stonebridge FAS (LB Brent Tokyngton)","Herts and North London","Thames"]
["THC025E/000A/005A","Upminster FAS","Herts and North London","Thames"]
["THC999/000/303A","Waldergrave Road FAS","Kent and South London","Thames"]
["THC032E/001A/005A","Wandle Weirs Investigation","Kent and South London","Thames"]
["THC024E/001A/003A","Wealdstone Brook FAS","Herts and North London","Thames"]
["THO999F/035A/002A","Welcomes Road and Kenley Station surface water flood alleviation scheme, Croydon","Kent and South London","Thames"]
["THC025E/000A/009A","Wennington Branch and Rainham Main Sewers, Rainham - Refurbishment of Sluices ","Herts and North London","Thames"]
["THO999F/041A/001B","Westminster Central Strategy","Herts and North London","Thames"]
["THC022E/000A/027A","Culvert Capacity and Trash Screen  Investigation and replacement / removal Kidbrooke  in the vicinty of Bromley.","Kent and South London","Thames"]
["THO999F/041A/001C","Westminster South Strategy","Herts and North London","Thames"]
["THC036E/001A/030B","Dagenham Brook Flood Alleviation Scheme","Herts and North London","Thames"]
["THC000E/000A/252A","Mereway Sluice, Twickenham - Gate Replacement ","Herts and North London","Thames"]
["THO999F/044A/002A","Wick Road CDA 17 SWFAS LB Hackney","Herts and North London","Thames"]
["THC029E/000A/006A","Woodford Access Improvements - River Roding","Herts and North London","Thames"]
["THO999F/049A/001A","Wyncham Stream Catchment","Kent and South London","Thames"]
["THC023E/000A/010A","Yeading Brook West Flood Storage Area - Decommissioning - Northolt - Middlesex ","Herts and North London","Thames"]
["THC022E/000A/025A","Quaggy at Hither Green flood alleviation study","Kent and South London","Thames"]
["THC029E/001A/002A","Shonks Mill - River Roding FRM Strategy - Works From","Herts and North London","Thames"]
["THC022E/000A/028A","The Beck (East Branch) at Langley Park flood alleviation study","Kent and South London","Thames"]
["THC039E/000A/013A","Jubilee River Monitoring","West Thames","Thames"]
["THC000E/003A/057A","Paddle and Rymer H and S","West Thames","Thames"]
["THC000E/000A/070A","Lower Thames Guard Piles","West Thames","Thames"]
["THC038E/001A/003A","River Thames Scheme - Property Level Protection","West Thames","Thames"]
["THC000E/003A/057B","Paddle  Rymer Package 2","West Thames","Thames"]
["THC007E/001A/002A","Newbury FAS","West Thames","Thames"]
["THO999F/010A/004A","Flood Storage Area at Overton Grange Playing Field","Kent and South London","Thames"]
["THC100E/001A/027A","Chesham Culvert","Herts and North London","Thames"]
["THO999F/017A/009A","Chobham Flood Alleviation Scheme","West Thames","Thames"]
["THC009E/000A/001A","Redhill FAS","Kent and South London","Thames"]
["THO999F/011A/018A","Tull Way FAS","West Thames","Thames"]
["THC044E/001A/007A","Purley on Thames Property Level Protection","West Thames","Thames"]
["THC000E/003A/068A","Godstow Weir B refurbishment","West Thames","Thames"]
["THO999F/020A/005A","Harness Close Surface water Flood Alleviation Scheme","West Thames","Thames"]
["THC014E/001A/005A","River Wey Weir Refurbishment","West Thames","Thames"]
["THC043E/000A/032A","Sandford Weir access path bank repair","West Thames","Thames"]
["THC038E/000A/006A","Penton Hook Restoration","West Thames","Thames"]
["THC009E/000A/002A","Ifield Flood Alleviation Scheme","Kent and South London","Thames"]
["THC007E/000A/005A","Eastbury FAS","West Thames","Thames"]
["THC002E/000A/033A","Northway & Marston Flood Risk Alleviation Scheme","West Thames","Thames"]
["TH0999F/11A/017A","Winterbourne FAS","West Thames","Thames"]
["THC009E/000A/003A","Horley Flood Relief Scheme","Kent and South London","Thames"]
["THC008E/000A/007A","Bagshot Flood Alleviation Scheme       \n","West Thames","Thames"]
["THC014E/000A/010A","Alton Attenuation And Flood Study ","West Thames","Thames"]
["THC043E/000A/035A","Marlow Surface Water Drainage Pre-Feasibility Study","West Thames","Thames"]
["THO999F/016A/007A","Ashenden Road Surface water scheme","West Thames","Thames"]
["THC016E/000A/002A","North Yateley Flood Impact Reduction Project","West Thames","Thames"]
["THC012E/001A/007A","Wey Road, Weybridge Flood Alleviation Scheme","West Thames","Thames"]
["THC003E/000A/005A","Kingsway, Blackwater Flood Alleviation Scheme","West Thames","Thames"]
["THC012E/000A/004A","Wey Meadows Flood Alleviation Scheme","West Thames","Thames"]
["THO999F/011A/021A","Boxford FAS","West Thames","Thames"]
["THC039E/000A/014A","Jubilee River Landscape","West Thames","Thames"]
["THC043E/000A/044A","Abingdon Back Water Flood Risk Management Scheme","West Thames","Thames"]
["THC043E/000A/029A","Abingdon hand radial and walkway support framework replacement.","West Thames","Thames"]
["THC041E/000A/005A","Abingdon River Ock Flood Storage Area","West Thames","Thames"]
["THC041E/000A/006A","Abingdon River Stert Flood Alleviation Scheme","West Thames","Thames"]
["THC041E/000A/007A","Abingdon St. Helen's Wharf Flood Alleviation Scheme","West Thames","Thames"]
["THC008E/001A/002A","Addlestone Flood Alleviation Scheme","West Thames","Thames"]
["THC999/000/278A","Albury Flood Alleviation Scheme","West Thames","Thames"]
["THC000E/000A/246A","Alfold Crossways Flood Alleviation Scheme","West Thames","Thames"]
["THC003E/000A/009A","Ash surface water flood relief scheme","West Thames","Thames"]
["THC999/000/295A","B3014 Fleet Road, Cove","West Thames","Thames"]
["THC002E/000A/034A","Bablock Hythe Static Home Site Flood Risk Management Scheme","West Thames","Thames"]
["THC999/000/276A","Basingstoke Flood Reduction Scheme","West Thames","Thames"]
["THC038E/000A/025A","Bell Weir \"A\" Radial Gate and Actuator Replacement ","West Thames","Thames"]
["THC043E/000A/041A","Benson Flood Risk Management Scheme","West Thames","Thames"]
["THC002E/000A/021A","Bicester Industrial Area Initial Assessment","West Thames","Thames"]
["THC002E/000A/030A","Bicester Town Centre Trash Screen Investigation","West Thames","Thames"]
["THC000E/000A/209A","Bisham  - Flood Alleviation","West Thames","Thames"]
["THC002E/000A/024A","Blackthorn Flood Risk Management Scheme","West Thames","Thames"]
["THC002E/000A/035A","Bloxham (Tadmarton Road) Flood Risk Management Scheme","West Thames","Thames"]
["THO999F/032A/006A","Bookham Flood Alleviation Scheme","West Thames","Thames"]
["THC999/000/266A","Bordon Flood Alleviation Scheme","West Thames","Thames"]
["THC040E/001A/005A","Boundary Brook Catchment (Florence Park) Flood Alleviation","West Thames","Thames"]
["THC999/000/250A","Bourne End - North and South mitigation","West Thames","Thames"]
["THC999/000/201A","BOVENEY WEIR \"A\" REPLACEMENT","West Thames","Thames"]
["THC039E/000A/043A","Boveney Weir Gate Refurbishment","West Thames","Thames"]
["THC999/000/233A","Bradfield flood alleviation scheme","West Thames","Thames"]
["THC999/000/290A","Bramley, Hampshire Flood Investigation Study","West Thames","Thames"]
["THC999/000/202A","BRAY HAND-RADIAL WEIR A Replacement","West Thames","Thames"]
["THC999/000/203A","BRAY MILL WEIR Replacement","West Thames","Thames"]
["THC999/000/230A","Broadoaks Weir Tail Piling - River Wey","West Thames","Thames"]
["SOO001E/000A/445A","Brockham and Strood Green FAS","Kent and South London","Thames"]
["THC999/000/264A","Brook End, Chadlington Flood Risk Management Scheme","West Thames","Thames"]
["THC999/000/253A","Buckinghamshire Temporary Defence Scoping Study","West Thames","Thames"]
["THC004E/000A/002A","Buckskin Lane Flood Aleviation Scheme, Basingstoke","West Thames","Thames"]
["THC999/000/277A","Burpham Flood Alleviation Scheme","West Thames","Thames"]
["THC012E/000A/005A","Byfleet Flood Alleviation Scheme","West Thames","Thames"]
["THC999/000/279A","Camberley (SW) Flood Alleviation Scheme","West Thames","Thames"]
["THC032E/000A/011A","Caterham Bourne Flood alleviation scheme","Kent and South London","Thames"]
["THC999/000/204A","CAVERSHAM WEIR \"A\" Replacement","West Thames","Thames"]
["THC999/000/205A","CAVERSHAM WEIR \"B\" Replacement","West Thames","Thames"]
["THC044E/000A/002A","Caversham Weir \"C\"","West Thames","Thames"]
["THC024E/000A/026A","CDA 001 Aintree Road, Perivale","Herts and North London","Thames"]
["THC024E/000A/022A","CDA 008 Northfield Avenue","Herts and North London","Thames"]
["THC005E/000A/008A","Chalgrove Flood Risk Management Scheme","West Thames","Thames"]
["THC999/000/296A","Chandlers Lane, Yateley","West Thames","Thames"]
["THC000E/000A/208A","CHARVIL FLOOD ALLEVIATION","West Thames","Thames"]
["THC999/000/267A","Chawton Flood Alleviation Scheme ","West Thames","Thames"]
["THC038E/000A/028A","Chertsey Weir Gate Refurbishment","West Thames","Thames"]
["THC017E/000A/018A","Chesham FAS Vale Brook Culvert","Herts and North London","Thames"]
["THC999/000/291A","Cheyne Way Flood Impact Reduction Project","West Thames","Thames"]
["THC008E/001A/003A","Chobham South Flood Attenuation Scheme","West Thames","Thames"]
["THC999/000/297A","Church Lane East, Aldershot","West Thames","Thames"]
["THC043E/000A/030A","Cleeve Weir access modifications ","West Thames","Thames"]
["THC999/000/220A","Cleeve weir rebuild","West Thames","Thames"]
["THC999/000/247A","Cock Marsh - Properties closest to the River Thames","West Thames","Thames"]
["THC017E/000A/021A","Colnbrook - County Ditch & Colne Brook","Herts and North London","Thames"]
["THC999/000/251A","Compton Watercourse Improvement","West Thames","Thames"]
["THC999/000/206A","COOKHAM WEIR \"A\" (Main Weir) Replacement","West Thames","Thames"]
["SOC999/000/018A","Copthorne Stream FAS","Kent and South London","Thames"]
["THC018E/000A/012A","Cores End Initial Assessment","West Thames","Thames"]
["THC999/000/280A","Cranleigh Flood Alleviation Scheme","West Thames","Thames"]
["THC999/000/228A","Culham Weir Structural Refurbishment","West Thames","Thames"]
["THC999/000/304A","Dead River ","Kent and South London","Thames"]
["THC999/000/254A","Deborough and Frogmoor, High Wycombe Surface Water Management Scheme","West Thames","Thames"]
["THC005E/000A/011A","Dorchester Flood Risk Management Scheme","West Thames","Thames"]
["THC999/000/307A","Downstream Stoplog System at Wraysbury Mill","Herts and North London","Thames"]
["THC005E/000A/007A","Drayton St Leonard Flood Risk Management Scheme","West Thames","Thames"]
["THC999/000/281A","Eashing Flood Alleviation Scheme","West Thames","Thames"]
["THC999/000/261A","East Hagbourne Flood Risk Management Scheme","West Thames","Thames"]
["THC999/000/292A","East Horsley Flood Reduction Scheme","West Thames","Thames"]
["THC999/000/234A","Emmbrook Flood Mitigation","West Thames","Thames"]
["THC999/000/246A","Eton Wick Flood Alleviation ","West Thames","Thames"]
["THC999/000/293A","Eversley & Lower Common Flood Alleviation Scheme.","West Thames","Thames"]
["THC999/000/235A","Finchampstead Flood Mitigation","West Thames","Thames"]
["THC999/000/282A","Fleet Brook Balancing Pond Replacement","West Thames","Thames"]
["THC999/000/268A","Fleet Flood Alleviation Scheme","West Thames","Thames"]
["THC999/000/269A","Frimley  Flood Alleviation Scheme","West Thames","Thames"]
["THC999/000/294A","Frimley Fuel Allotments Attenuation Scheme","West Thames","Thames"]
["THC999/000/275A","Frith End Flood Alleviation Scheme","West Thames","Thames"]
["THC014E/001A/006A","Godalming Flood Alleviation Scheme","West Thames","Thames"]
["THC043E/000A/042A","Goring on Thames Flood Risk Management Scheme","West Thames","Thames"]
["THC999/000/229A","Grafton Weir Walkway Refurbishment","West Thames","Thames"]
["THO999F/011A/020A","Grazeley Green","West Thames","Thames"]
["THC999/000/236A","Great Shefford Flood Mitigation","West Thames","Thames"]
["THC999/000/270A","Griffin Stream Flood Reduction Scheme","West Thames","Thames"]
["THC011E/000A/002A","Guildford Flood Alleviation Scheme","West Thames","Thames"]
["THC043E/000A/022A","Hambleden Weir M&E Refurbishment","West Thames","Thames"]
["THC999/000/262A","Henley-on-Thames Flood Risk Management Scheme","West Thames","Thames"]
["THC017E/000A/019A","HNL Refurbishment Package: Ash Offtake at Staines Access & Security Improvements","Herts and North London","Thames"]
["THC007E/000A/015A","Holy Brook Flood Mitigation","West Thames","Thames"]
["THC999/000/237A","Hughenden Flood Mitigation","West Thames","Thames"]
["THC018E/000A/013A","Hughenden Road and Coates Lane, High Wycombe Surface Water Management Scheme","West Thames","Thames"]
["THC999/000/238A","Huntercombe Lane Stream flood mitigation","West Thames","Thames"]
["THC999/000/248A","Hurley Flood Alleviation Scheme","West Thames","Thames"]
["THC043E/000A/023A","Hurley Weir \"A\" Overfall Apron Improvements","West Thames","Thames"]
["THC999/000/207A","HURLEY WEIR \"A\" Replacement","West Thames","Thames"]
["THC999/000/208A","HURLEY WEIR \"B\" (Bathing Pool) Replacement","West Thames","Thames"]
["THC999/000/209A","HURLEY WEIR \"D\" Replacement","West Thames","Thames"]
["THC999/000/239A","Ickford Flood mitigation","West Thames","Thames"]
["THC999/000/221A","Iffley weir C rebuild","West Thames","Thames"]
["THC999/000/222A","Iffley weir D rebuild","West Thames","Thames"]
["THC002E/000A/029A","Islip Flood Risk Management Scheme","West Thames","Thames"]
["THO999F/011A/019A","Lambourn SWMP","West Thames","Thames"]
["THC010E/000A/001A","Leatherhead and Middle Mole FAS","Kent and South London","Thames"]
["THC999/000/298A","Local Groundwater Flood Aleviation - A32 Corridor","West Thames","Thames"]
["THC999/000/240A","Loddon Drive Flood Mitigation","West Thames","Thames"]
["THC999/000/252A","Lower Denford Flood Aleviation Scheme","West Thames","Thames"]
["THC999/000/241A","Lower Earley Flood Mitigation Measures","West Thames","Thames"]
["THC013E/000A/013A","Lower Mole Flood Alleviation Scheme: Penstocks, Access and Flood Wall Repairs","Kent and South London","Thames"]
["THC013E/000A/009A","Lower Mole Safety Booms","Kent and South London","Thames"]
["THC999/000/283A","Lower Road Effingham","West Thames","Thames"]
["THC999/000/265A","Lower Tadmarton Flood Risk Management Scheme","West Thames","Thames"]
["THC039E/000A/039A","Manor Farm Containment Cell Sump Repair","West Thames","Thames"]
["THC999/000/299A","Mapledurwell Flood Aleviation","West Thames","Thames"]
["THC043E/000A/002A","Marlow FAS","West Thames","Thames"]
["THC999/000/210A","MARLOW HAND-RADIAL WEIR \"B\" Replacement ","West Thames","Thames"]
["THC999/000/211A","MARLOW HAND-RADIAL WEIR \"D\" Replacement","West Thames","Thames"]
["THC043E/000A/038A","Medmenham Flood Mitigation measures","West Thames","Thames"]
["THC000E/000A/222A","Mereway Sluice Gate Replacement","Herts and North London","Thames"]
["THC999/000/284A","Middle Bourne Flood Alleviation Scheme","West Thames","Thames"]
["THC003E/000A/008A","Middleton Gardens Flood Alleviation","West Thames","Thames"]
["THC043E/000A/037A","Mill End Flood Alleviation","West Thames","Thames"]
["THC005E/000A/010A","Mill Lane Chalgrove Flood Attenuation Scheme","West Thames","Thames"]
["THC000E/000A/229A","NET Third Party Culvert Refurbishment – Phase 1","Herts and North London","Thames"]
["THC999/000/271A","New Haw Flood Alleviation Scheme","West Thames","Thames"]
["THC002E/000A/025A","New Marston Flood Risk Management Scheme","West Thames","Thames"]
["THC007E/000A/016A","Newbury & Thatcham Property Level Protection","West Thames","Thames"]
["THC000E/000A/247A","North East Thames PLC Upgrades at Various Sites","Herts and North London","Thames"]
["THC039E/000A/042A","Old Windsor House Weir Apron Repairs","West Thames","Thames"]
["THC999/000/213A","OLD WINDSOR WEIR \"B\" Handradial Weir Replacement","West Thames","Thames"]
["THC999/000/214A","OLD WINDSOR WEIR \"B\" Main Radial weir Replacement","West Thames","Thames"]
["THC999/000/285A","Old Woking Flood Alleviation Scheme","West Thames","Thames"]
["THC999/000/257A","Oxfordshire High Risk Dispersed Properties Flood Risk Management Scheme","West Thames","Thames"]
["THC044E/001A/006A","Pangbourne Flood Alleviation","West Thames","Thames"]
["THC043E/000A/031A","Park End Sluice Refurbishment","West Thames","Thames"]
["THO999F/030A/017A","Pednormead End, Brushwood Road and Harding Road, Chesham Surface Water Management Scheme","Herts and North London","Thames"]
["THO999F/015A/002A","Phoenix Green, Flood Alleviation Study","West Thames","Thames"]
["THC018E/000A/010C","Poyle Channel","Herts and North London","Thames"]
["THC044/001C/001A","Reading - Caversham FAS","West Thames","Thames"]
["THO999F/033A/002A","Rectory Road Flood Alleviation Scheme","West Thames","Thames"]
["THC999/000/242A","Remenham Flood Mitigation","West Thames","Thames"]
["THC999/000/272A","Ripley Springs Flood Alleviation Scheme","West Thames","Thames"]
["THC038E/000A/031A","River Ash & Staines Reservoirs Aqueduct","Herts and North London","Thames"]
["THO999F/032A/007A","River Burstow Flood Alleviation Scheme","Kent and South London","Thames"]
["THC007E/000A/008A","River Kennet sluice gate refurbishment at Southcote Mill","West Thames","Thames"]
["THC007E/000A/007A","River Kennet weir and fish pass repair at Burghfield Mill","West Thames","Thames"]
["THC000E/000A/255A","River Loddon at Winnersh FAS","West Thames","Thames"]
["THC038E/000A/030A","River Rythe: Flood Relief Culvert intake screen modification/replacement  ","Kent and South London","Thames"]
["THC999/000/223A","Sandford Weir A Refurbishment","West Thames","Thames"]
["THC018E/000A/015A","Sands (High Wycombe) Surface Water Flood Risk Management","West Thames","Thames"]
["THC999/000/273A","Sandy Lane Ditch Flood Alleviation Scheme ","West Thames","Thames"]
["THC999/000/243A","Scours Lane Mitigation Measures","West Thames","Thames"]
["THC999/000/286A","Send Flood Alleviation Scheme","West Thames","Thames"]
["THC999/000/215A","SHEPPERTON WEIR \"A\"","West Thames","Thames"]
["THC999/000/287A","Shere Flood Alleviation Scheme","West Thames","Thames"]
["THC999/000/224A","Shifford A weir rebuild","West Thames","Thames"]
["THC999/000/258A","Shillingford Flood Risk Management Scheme","West Thames","Thames"]
["THC043E/000A/024A","Shiplake Overspill Weir Walkway replacement","West Thames","Thames"]
["THC039E/000A/035A","Slough FAS","West Thames","Thames"]
["THO999F/032A/008A","Smallfield Flood Alleviation Scheme","Kent and South London","Thames"]
["THC043E/000A/043A","Sonning Eye Flood Investigation","West Thames","Thames"]
["THC999/000/216A","SONNING WEIR \"C\" (Summer House) Replacement","West Thames","Thames"]
["THC999/000/315A","Splash Meadows","Herts and North London","Thames"]
["THC005E/000A/006A","Stadhampton Flood Risk Management Scheme","West Thames","Thames"]
["THC007E/000A/014A","Stanford Dingley Flood Alleviation Scheme","West Thames","Thames"]
["THC043E/000A/036A","Steventon","West Thames","Thames"]
["THC000E/000A/225A","Structural Asset Feasibility & Remedial Works","Herts and North London","Thames"]
["THO999F/034A/001A","SUDS Retrofit study","Kent and South London","Thames"]
["THC999/000/217A","Sunbury Weir \"C\" Replacement","West Thames","Thames"]
["THC043E/000A/027A","Sunbury Weir D Gate and Walkway Refurbishment","West Thames","Thames"]
["THC043E/000A/025A","Sutton Courtenay Flood Risk Management Scheme","West Thames","Thames"]
["THC016E/000A/006A","Swallowfield Flood Mitigation Measures","West Thames","Thames"]
["THO999F/033A/003A","Sycamore Road Flood Alleviation Scheme","West Thames","Thames"]
["THC999/000/274A","Tadley Flood Reduction Study","West Thames","Thames"]
["THC043E/000A/028A","Temple Radial Weir Actuator Improvements","West Thames","Thames"]
["THC043E/000A/026A","Temple Weir \"B\" Hand Radial Gate and Walkway Replacement","West Thames","Thames"]
["THC000E/002A/013A","Thames Lock and Weir Emergency Power","West Thames","Thames"]
["THC011E/001A/002A","The Woking Initial Assessment","West Thames","Thames"]
["THC003E/000A/004A","Tudor and Cricket Hill Stream Flood Reduction Project","West Thames","Thames"]
["THC016E/000A/005A","Twyford Flood Mitigation","West Thames","Thames"]
["THO999F/011A/002C","Waller Drive, Newbury - Property Level Protection Scheme","West Thames","Thames"]
["THC999/000/263A","Wallingford Flood Risk Management Scheme","West Thames","Thames"]
["THC043E/000A/033A","Wargrave Flood Mitigation","West Thames","Thames"]
["THC040E/000A/006A","Watlington","West Thames","Thames"]
["THC007E/000A/017A","Wellington Close & Cromwell Road","West Thames","Thames"]
["THC002E/000A/013B","Wendlebury","West Thames","Thames"]
["THC999/000/244A","Wendover Flood Mitigation","West Thames","Thames"]
["THC002E/000A/028A","Bloxham Flood Alleviation Scheme","West Thames","Thames"]
["THC999/000/288A","West End (South) FAS","West Thames","Thames"]
["THC043E/000A/040A","WEST HAGBOURNE FLOOD ALLEVIATION","West Thames","Thames"]
["THC007E/000A/006A","West Ilsley","West Thames","Thames"]
["THC043E/000A/039A","West Thames Temporary Defences","West Thames","Thames"]
["THC999/000/245A","Weston Turville Flood Mitigation","West Thames","Thames"]
["THC005E/000A/009A","WHEATLEY WEST ATTENUATION  SCHEME","West Thames","Thames"]
["THC999/000/218A","WHITCHURCH WEIR \"A\" Replacement","West Thames","Thames"]
["THC999/000/219A","WHITCHURCH WEIR \"C\" Replacement","West Thames","Thames"]
["THC018E/000A/018A","Misbourne Flood alleviation and water management level strategy","Herts and North London","Thames"]
["THC008E/000A/008A","Windlesham Flood Alleviation Scheme","West Thames","Thames"]
["THC002E/000A/019A","Witney Initial Assessment","West Thames","Thames"]
["THC017E/000A/024A","Wraysbury Offtake Tilting Gate Refurbishment","Herts and North London","Thames"]
["THC999/000/289A","Zebon Copse Fleet Flood Alleviation Scheme","West Thames","Thames"]
["THC999/000/249A","River Loddon Soft Engineering","West Thames","Thames"]
["THE001E/000A/019A","TE2100 Habitat Creation","Kent and South London","Thames"]
["THO999F/006A/015C","Cheney Manor Flood Mitigation Works","West Thames","Thames"]
["THC007E/001A/013A","Great Bedwyn Surface Water Drainage Improvements","West Thames","Thames"]
["THC002E/000A/032A","Bourton on the Water Flood Alleviation Scheme Remediation","West Thames","Thames"]
["THC999/000/225A","Buscot weir A replacement","West Thames","Thames"]
["THC999/000/226A","Buscot weir B","West Thames","Thames"]
["THC999/000/260A","Cirencester Flood Storage Area","West Thames","Thames"]
["THC999/000/255A","Cotswolds District High Risk Dispersed Properties Flood Risk Management Scheme","West Thames","Thames"]
["THC001E/000A/013A","Covingham & Nythe Flood Alleviation Strategy, Swindon, River Cole, Series of Flood Defence Measures","West Thames","Thames"]
["THC001E/000A/012A","Covingham Flood Risk Management Scheme","West Thames","Thames"]
["THC001E/000A/010A","Even Swindon Flood Risk Management Scheme","West Thames","Thames"]
["THC001E/000A/014A","Kingshill Flood Risk Management Scheme","West Thames","Thames"]
["THC001E/000A/011A","Park South and Park North Flood Risk Management Scheme","West Thames","Thames"]
["THC001E/001A/004A","River Churn Strategy Phase two","West Thames","Thames"]
["THO999F/006A/019A","Wanborough Flood Mitigation Scheme","West Thames","Thames"]
["THC999/000/259A","Wiltshire High Risk Dispersed Properties Flood Risk Management Scheme","West Thames","Thames"]
["THC029E/000A/007A","Woodford River Roding Flap Valves Risk Assessment","Herts and North London","Thames"]
["THC029E/000A/008A","Woodford Flood Alleviation Scheme","Herts and North London","Thames"]
["THE001E/001A/045A","Thames Barrier Store & Depot","Kent and South London","Thames"]
["THO999F/011A/011A","Dunstan Park","West Thames","Thames"]
["THE001E/000A/012A","Thames Estuary Phase 1 Programme TTD Operational Area Works","Kent and South London","Thames"]
["THO999F/051A/003A","Chestnuts Showground","Herts and North London","Thames"]
["THC041E/000A/008A","Milton nr Abingdon, Oxon flood alleviation","West Thames","Thames"]
["THC038E/001A/002A","River Thames Scheme - Ecological Surveys","West Thames","Thames"]
["THC040E/001A/007A","Oxford Flood Alleviation Scheme ","West Thames","Thames"]
["TRC003E/002A/002A","Gainsborough Frontage","Derbys Notts and Leics","Trent"]
["TRC003E/008A/001A","Nottingham Trent Left Bank","Derbys Notts and Leics","Trent"]
["TRC003E/000A/076A","Spondon Sluices Decommissioning","Derbys Notts and Leics","Trent"]
["TRC003E/005A/001A","Lower Dove FAS","Staffs Warks and West Mids","Trent"]
["TRC003F/000A/039A","Ock Brook, Ockbrook, Flood Alleviation Study","Derbys Notts and Leics","Trent"]
["TRC003F/000A/042A","River Erewash, Wharf Road, Pinxton, Flood Alleviation Study","Derbys Notts and Leics","Trent"]
["TRC003F/000A/040A","Foston Brook, Scropton, Flood Alleviation Study","Derbys Notts and Leics","Trent"]
["TRC003I/000A/117A","Beckingham Drain, Beckingham Pumping Station Refurbishment","Derbys Notts and Leics","Trent"]
["TRC003F/000A/044A","Eggington Brook, Mickleover, Flood Risk Reduction Scheme","Derbys Notts and Leics","Trent"]
["TRC003F/000A/009A","River Soar, Leicester Northfields Flood Alleviation Scheme","Derbys Notts and Leics","Trent"]
["TRC003E/000A/065A","River Soar, Sharnford, Property Level Protection","Derbys Notts and Leics","Trent"]
["TRC003E/000A/068A","River Trent, North Muskham, Flood Alleviation Scheme","Derbys Notts and Leics","Trent"]
["TRC000E/000A/531A","Leicester FRMS - conveyance works","Derbys Notts and Leics","Trent"]
["TRC004F/000A/053A","River Trent, A57 Newton on Trent, Flood Alleviation Scheme","Derbys Notts and Leics","Trent"]
["TRC003F/000A/055A","Knoll Brook, Barton-under-Needwood, Flood Alleviation Scheme","Staffs Warks and West Mids","Trent"]
["TRC003E/028A/001A","Lower Derwent PAR Package","Derbys Notts and Leics","Trent"]
["TRC003I/000A/007A","Lowfield Drain, Lowfield Pumping Staion Refurbishment","Derbys Notts and Leics","Trent"]
["TRC003I/000A/006A","Egmanton Dyke, Egmanton Mill Dam Improvements","Derbys Notts and Leics","Trent"]
["TRC003F/000A/002A","Walkeringham - Flood Alleviation Scheme","Derbys Notts and Leics","Trent"]
["TRC003F/000A/092A","River Leen Bobbers Mill Flood Alleviation Scheme","Derbys Notts and Leics","Trent"]
["TRC003F/000A/033A","Retford Beck, Grove Lane and Blackstope Lane, Retford, Flood Mitigation Scheme","Derbys Notts and Leics","Trent"]
["TRC003F/000A/074A","Broxtowe Park Brook : Capital Maintenance and Flood Risk Management Scheme","Derbys Notts and Leics","Trent"]
["TRC003F/000A/096A","Bramble Brook Slack Lane and Great Northern Road Culvert Rehabilitation","Derbys Notts and Leics","Trent"]
["TRC003E/000A165A","Gunthorpe, River Trent Flood Defence","Derbys Notts and Leics","Trent"]
["TRC003E/000A184A","Cosby Flood Alleviation Scheme ","Derbys Notts and Leics","Trent"]
["TRC003E/000A195A","Breaston Upstream Storage","Derbys Notts and Leics","Trent"]
["TRC003F/000A/028A","Weston Coyney, Stoke-on-Trent, Surface Water FAS","Staffs Warks and West Mids","Trent"]
["TRC003F/000A/083A","Tottle Brook Flood Alleviation Scheme","Derbys Notts and Leics","Trent"]
["TRC003F/000A/084A","Leicester, Oakland Road Surface Water Flood Alleviation ","Derbys Notts and Leics","Trent"]
["TRC003F/000A/085A","Leicester, Redhill Way Surface Water Flood Alleviation ","Derbys Notts and Leics","Trent"]
["TRC003E/000A167A","River Soar Flood Risk Management Scheme","Derbys Notts and Leics","Trent"]
["TRC003E/000A166A","Willow Brook Flood Alleviation Scheme","Derbys Notts and Leics","Trent"]
["","Cossington Sluices","Derbys Notts and Leics","Trent"]
["TRC003E/000A/063A","Loughborough Flood Risk Management Scheme","Derbys Notts and Leics","Trent"]
["TRC003E/000A173A","Braunstone Brook Flood Alleviation Scheme","Derbys Notts and Leics","Trent"]
["TRC003E/000A169A","Saffron Brook Flood Alleviation Scheme","Derbys Notts and Leics","Trent"]
["TRC003F/000A/035A","Oakerthorpe Brook, Derwent Grove, Alfreton, Flood Alleviation Study","Derbys Notts and Leics","Trent"]
["TRC003I/000A/002A","Blyton Warping Drain, Ravensfleet Pumping Station Refurbishment","Derbys Notts and Leics","Trent"]
["TRC003F/000A/056A","Rollestone on Dove, Surface Water FAS","Staffs Warks and West Mids","Trent"]
["TRC003F/000A/043A","Dam Brook, Breadsall, Flood Alleviation Scheme","Derbys Notts and Leics","Trent"]
["TRC003F/000A/038A","Carr New Brook, Melbourne, Flood Alleviation Project","Derbys Notts and Leics","Trent"]
["TRC003F/000A/073A","Woolsington Close, Strelley: Surface Water Management Scheme","Derbys Notts and Leics","Trent"]
["TRC003F/000A/036A","Repton Brook, Hartshorne, Flood Alleviation Project","Derbys Notts and Leics","Trent"]
["TRC003F/000A/072A","Hucknall Town Centre Flood Alleviation Scheme","Derbys Notts and Leics","Trent"]
["TRC002E/000A/018A","Tidal Trent, Torksey Gate Automation Improvements","Derbys Notts and Leics","Trent"]
["TRC003F/000A/094A","Littleover Brook, Improved conveyance capacity and new flood detention area","Derbys Notts and Leics","Trent"]
["TRC003F/000A/086A","Cuttle Brook, Increased catchment storage","Derbys Notts and Leics","Trent"]
["TRC003F/000A/093A","Cotton Brook (Upper) Culvert Renewal in Peartree Road area","Derbys Notts and Leics","Trent"]
["TRC003E/000A198A","Greythorne Dyke Pumping Station MEICA Refurbishment works","Derbys Notts and Leics","Trent"]
["TRC003I/000A/009A","Sewer Drain, Torksey Pumping Sation Replacement","Derbys Notts and Leics","Trent"]
["TRC003F/000A/098A","Hucknall Titchfield Park Brook","Derbys Notts and Leics","Trent"]
["TRC003F/000A/101A","Nottingham City Council Individual Property Protection Programme","Derbys Notts and Leics","Trent"]
["TRC003F/000A/120A","Broughton Astley, Harborough","Derbys Notts and Leics","Trent"]
["TRC003F/000A/047A","Swithland Brook, Swithland FAS","Derbys Notts and Leics","Trent"]
["TRC003I/000A/022A","Thurgaton Beck Alleviation Scheme","Derbys Notts and Leics","Trent"]
["TRC002E/000A021A","Isle of Axholme, West Stockwith Pumping Station Improvements","Derbys Notts and Leics","Trent"]
["TRC003F/000A/081A","Southwell Flood Alleviation Scheme","Derbys Notts and Leics","Trent"]
["TRC003F/000A/111A","Leicester, Egginton Street Surface Water Flood Alleviation ","Derbys Notts and Leics","Trent"]
["TRC003E/000A154A","Boundary Brook / Stapleford","Derbys Notts and Leics","Trent"]
["TRC003F/000A/114A","Long Whatton and Diseworth Flood Scheme","Derbys Notts and Leics","Trent"]
["TRC003F/000A/080A","Daron Gardens / Edern Gardens, Top Valley","Derbys Notts and Leics","Trent"]
["TRC002I/000A/008A","Marton Pumping Station Refurbishment","Derbys Notts and Leics","Trent"]
["TRC003F/000A/119A","Scraptoft Brook, Scraptoft, Harborough","Derbys Notts and Leics","Trent"]
["TRC003E/000A163A","Day Brook, Old Basford, FAS","Derbys Notts and Leics","Trent"]
["TRC003I/000A/001A","Jenny Hurn Drain, Jenny Hurn Pumping Station Refurbishment","Derbys Notts and Leics","Trent"]
["TRC003I/000A/008A","Cuckstool Dyke, Sutton-on-Trent Improvements","Derbys Notts and Leics","Trent"]
["TRC002I/000A/004A","Heckdyke, 3 Bridges and 4 Bridges Pumping Station Refurbishment","Derbys Notts and Leics","Trent"]
["IMMI001397","Sheepy Magna Flood Risk Reduction Scheme","Staffs Warks and West Mids","Trent"]
["TRC003E/000A164A","Cocker Beck, Lowdham, FAS","Derbys Notts and Leics","Trent"]
["TRC003F/000A/076A","Mapperley Park Surface Water Management Scheme","Derbys Notts and Leics","Trent"]
["TRC003F/000A/078A","Smeath Lane, Clarborough - Culvert Replacement Scheme","Derbys Notts and Leics","Trent"]
["TRC003F/000A/082A","Leicester, Leicester Royal Infirmary Surface Water Flood Alleviation ","Derbys Notts and Leics","Trent"]
["TRC003F/000A/032A","Dunston, River Penk, PLP Scheme","Staffs Warks and West Mids","Trent"]
["TRC003E/000A156A","River Leen, Queens Medical Centre Embankment","Derbys Notts and Leics","Trent"]
["TRC003E/000A160A","Mid Nottinghamshire Catchment Approach","Derbys Notts and Leics","Trent"]
["TRC003E/000A200A","Carlton-on-Trent, River Trent, PLP","Derbys Notts and Leics","Trent"]
["TRC003E/000A179A","Barkby Brook Syston ","Derbys Notts and Leics","Trent"]
["TRC003E/000A/118A","Rearsby Brook, Rearsby, Flood Alleviation Scheme","Derbys Notts and Leics","Trent"]
["TRC003E/000A/525A","Tidal River Trent, Susworth, Defence Improvements","Derbys Notts and Leics","Trent"]
["TRC003E/000A212A","Grace Dieu Brook PLP","Derbys Notts and Leics","Trent"]
["TRC003E/000A183A","Tottle Brook (Main River), Nottingham, PLP","Derbys Notts and Leics","Trent"]
["TRC003E/000A191A","Leen Syphon Screen Replacement","Derbys Notts and Leics","Trent"]
["TRC003E/000A204A","Duffield","Derbys Notts and Leics","Trent"]
["TRC003F/000A/113A","Leicester, Dane Hills Surface Water Flood Alleviation ","Derbys Notts and Leics","Trent"]
["TRC003F/000A/029A","Goms Mill, Stoke-on-Trent, Surface Water FAS","Staffs Warks and West Mids","Trent"]
["TRC003E/000A181A","Hemington Property Level Protection Scheme","Derbys Notts and Leics","Trent"]
["TRC003E/000A197A","Lockington Brook Property Level Protection Scheme","Derbys Notts and Leics","Trent"]
["TRC003E/000A211A","Barrow on Trent PLP","Derbys Notts and Leics","Trent"]
["TRC003E/000A205A","Swarkestone PLP","Derbys Notts and Leics","Trent"]
["TRC003E/000A188A","Willington PLP","Derbys Notts and Leics","Trent"]
["TRC003E/000A201A","Tideswell PLP","Derbys Notts and Leics","Trent"]
["TRC003E/000A209A","Stoney Middleton PLP","Derbys Notts and Leics","Trent"]
["TRC003E/000A182A","Sileby Brook PLP","Derbys Notts and Leics","Trent"]
["TRC003E/000A202A","Ouse Dyke, Gedling, Flood Alleviation Scheme","Derbys Notts and Leics","Trent"]
["TRC003E/000A172A","River Trent, Shardlow ","Derbys Notts and Leics","Trent"]
["TRC003E/000A210A","River Leen, Cloister Street, Nottingham PLP","Derbys Notts and Leics","Trent"]
["TRC003E/000A174A","Ashford & Bakewell","Derbys Notts and Leics","Trent"]
["TRC003E/000A185A","Glenfield Rothley Brook","Derbys Notts and Leics","Trent"]
["TRC003E/000A175A","Melton Brook Flood Alleviation Scheme","Derbys Notts and Leics","Trent"]
["TRC003E/000A213A","Lower Kilburn PLP","Derbys Notts and Leics","Trent"]
["TRC003E/000A215A","Derbys Notts and Leics Invest to Save","Derbys Notts and Leics","Trent"]
["TRC003F/000A/100A","Leicester, Alderman Richard Hallam Surface Water Flood Alleviation ","Derbys Notts and Leics","Trent"]
["TRC003F/000A/097A","Leicester, Hol Brook Surface Water Flood Alleviation ","Derbys Notts and Leics","Trent"]
["TRC003E/000A196A","Broughton Astley PLP","Derbys Notts and Leics","Trent"]
["TRC003E/000A207A","River Meden, Pleasley Vale, PLP ","Derbys Notts and Leics","Trent"]
["TRC003E/000A171A","River Ryton, Worksop, FAS","Derbys Notts and Leics","Trent"]
["TRC003E/000A177A","Newark - Brewers Wharf","Derbys Notts and Leics","Trent"]
["TRC003F/000A/123A","Leicester, Lomond Cresent Surface Water Flood Alleviation ","Derbys Notts and Leics","Trent"]
["TRO003E/000A012A","Culvert Condition Surveys","Derbys Notts and Leics","Trent"]
["TRC003I/000A/003A","South Ings Drain, Susworth Pumping Station Refurbishment","Derbys Notts and Leics","Trent"]
["TRC003I/000A/004A","Jenny Hurn Drain, Whoofer Pumping Station Refurbishment","Derbys Notts and Leics","Trent"]
["TRC003E/000A180A","Woodend & Greenway Flood Embankments Refurbishment","Staffs Warks and West Mids","Trent"]
["TRC003F/000A/089A","Overdale Road Property Level Protection","Staffs Warks and West Mids","Trent"]
["TRC003E/000A/529A","Upper Tame - Titford Culvert","Staffs Warks and West Mids","Trent"]
["TRC003F/000A/382A","Thimblemill Brook, Smethwick, Flood Alleviation Scheme","Staffs Warks and West Mids","Trent"]
["TRC003E/000A/530A","Upper Tame - Holloway Bank","Staffs Warks and West Mids","Trent"]
["TRC003C/000A/061A","Bells Lane, Birmingham, FAS","Staffs Warks and West Mids","Trent"]
["TRC003F/000A/031A","Lower Tean, River Tean, FAS","Staffs Warks and West Mids","Trent"]
["TRC003F/000A/030A","Huntington, Cannock, Surface Water FAS","Staffs Warks and West Mids","Trent"]
["TRC003F/000A/026A","Perton, Surface Water FAS","Staffs Warks and West Mids","Trent"]
["TRC005F/000A/054A","Callow Brook, Rubery Flood Alleviation Scheme","Staffs Warks and West Mids","Trent"]
["TRC003E/000A/060A","Calthorpe (River Rea) FAS","Staffs Warks and West Mids","Trent"]
["TRC003F/000A/001A","Sandyford Brook, Stafford, Intergated Model","Staffs Warks and West Mids","Trent"]
["TRC003E/000A/058A","Stonehouse Brook (River Rea) FAS","Staffs Warks and West Mids","Trent"]
["TRC003E/000A/062A","Northfield (River Rea) FAs","Staffs Warks and West Mids","Trent"]
["TRC004F/000A/129A","Dickens Heath balancing pond improvement works","Staffs Warks and West Mids","Trent"]
["TRC003E/000A/061A","Kings Norton (River Rea) FAS","Staffs Warks and West Mids","Trent"]
["TRC003F/000A/057A","Polesworth,Tamworth, Flood Alleviation Scheme","Staffs Warks and West Mids","Trent"]
["TRC003F/000A/064A","Lodge Hill, Birmingham, FAS","Staffs Warks and West Mids","Trent"]
["TRC003E/000A/518A","Rising Brook, Rugeley,  Town Centre Flood Alleviation Scheme","Staffs Warks and West Mids","Trent"]
["TRC003F/000A/066A","Stretton Surface Water Pumping Station, Clay Mills, Burton on Trent","Staffs Warks and West Mids","Trent"]
["TRC003E/000A/012A","Kelverley Grove flood defence repairs","Staffs Warks and West Mids","Trent"]
["TRC003F/000A/118A","Pensby Close Community Protection","Staffs Warks and West Mids","Trent"]
["TRC003F/000A/065A","Sparkhill, Birmingham, River Cole, Community Protection Scheme","Staffs Warks and West Mids","Trent"]
["TRC003E/000A/031A","Barton-Under-Needwood, Barton brook FAS","Staffs Warks and West Mids","Trent"]
["TRC003F/000A/087A","Village Brook (Endon) FAS","Staffs Warks and West Mids","Trent"]
["TRC003E/000A155A","Endon FAS","Staffs Warks and West Mids","Trent"]
["TRC003E/000A190A","Nuneaton FRC Refurnishment","Staffs Warks and West Mids","Trent"]
["TRC003E/000A/057A","Selly Park South (River Rea) FAS","Staffs Warks and West Mids","Trent"]
["TRC003E/000A161A","Collins Road Sheet Pile Refurbishment","Staffs Warks and West Mids","Trent"]
["TRC003F/000A/088A","Brown Edge FAS","Staffs Warks and West Mids","Trent"]
["TRC003F/000A/090A","Codsall FAS","Staffs Warks and West Mids","Trent"]
["TRC003F/000A/110A","Slade Road Community Protection","Staffs Warks and West Mids","Trent"]
["TRC003F/000A/121A","Bean Croft Property Level Protection","Staffs Warks and West Mids","Trent"]
["TRC003E/000A203A","Fordbridge PLP, River Cole, Fordbridge","Staffs Warks and West Mids","Trent"]
["TRC003E/000A157A","Hobnock Road PLP","Staffs Warks and West Mids","Trent"]
["TRC003E/000A158A","Norton Lane PLP","Staffs Warks and West Mids","Trent"]
["TRC003F/000A/079A","Upper Longdon PLP","Staffs Warks and West Mids","Trent"]
["TRC003F/000A/125A","Acacia crescent, Bilbrook","Staffs Warks and West Mids","Trent"]
["TRC003E/000A206A","Weston PLP, River Trent, Weston","Staffs Warks and West Mids","Trent"]
["TRC003F/000A/124A","Nesfield Close Community Protection","Staffs Warks and West Mids","Trent"]
["TRC003F/000A/122A","Fisher Close Community Protection","Staffs Warks and West Mids","Trent"]
["TRC003E/000A/059A","The Bourn (River Rea) FAS","Staffs Warks and West Mids","Trent"]
["TRC003E/000A/056A","Selly Park North (River Rea) FAS","Staffs Warks and West Mids","Trent"]
["TRC003F/000A/095A","Hamstall Ridware FAS","Staffs Warks and West Mids","Trent"]
["TRC003E/000A159A","Rising Brook FAS, Rising Brook, Stafford","Staffs Warks and West Mids","Trent"]
["TRC003F/000A/102A","Lower Penn FAS","Staffs Warks and West Mids","Trent"]
["TRC003F/000A/127A","Whitacre Heath","Staffs Warks and West Mids","Trent"]
["MIC003E/000A/304A","Branston Culvert Replacement Scheme","Staffs Warks and West Mids","Trent"]
["TRC003E/000A/064A","Marchington Brook, Marchington, Uttoxeter, Flood Alleviation Scheme","Staffs Warks and West Mids","Trent"]
["TRC003F/000A/059A","Fillongley, Coventry, Property Level Protection Scheme","Staffs Warks and West Mids","Trent"]
["TRC003F/000A/060A","Grasmere Road, Birmingham, PLP Scheme","Staffs Warks and West Mids","Trent"]
["TRC003E/000A194A","Monks Bridge Flood Risk Management Scheme","Staffs Warks and West Mids","Trent"]
["TRC003E/000A208A","Norton Green PLP, River Trent, Norton Green","Staffs Warks and West Mids","Trent"]
["TRC003E/000A199A","Dovefields Bank, River Dove, Capital Maintenance Scheme","Staffs Warks and West Mids","Trent"]
["TRC003F/000A/105A","Burton Drainage Routes Follow-up Works","Staffs Warks and West Mids","Trent"]
["TRC003E/000A168A","Digbeth, River Rea FAS","Staffs Warks and West Mids","Trent"]
["TRC003E/000A217A","Staffs Warks and West Mids Invest to Save","Staffs Warks and West Mids","Trent"]
["TRC003E/000A187A","Stapenhill Brook Culverts Capital Maintenance Project","Staffs Warks and West Mids","Trent"]
["TRC003F/000A/107A","Newcastle under Lyme Drainage Routes Follow-up Works","Staffs Warks and West Mids","Trent"]
["TRC003E/000A/021A","Fowlea Brook","Staffs Warks and West Mids","Trent"]
["0","Marsh Lane, Lichfield","Staffs Warks and West Mids","Trent"]
["TRC003E/000A/534A","River Tame, Bromford, Birmingham, Flood Alleviation Scheme","Staffs Warks and West Mids","Trent"]
["TRC003E/007A/001A","Lower Tame - Whitacre Heath, Tamworth and Fazeley","Staffs Warks and West Mids","Trent"]
["TRC003I/000A/187A","River Trent, Amcotts, Crowle Pumped Catchments Capital Works","Derbys Notts and Leics","Trent"]
["TRC002E/000A/015A","Isle of Axholme, Owston Ferry Flood Defence","Derbys Notts and Leics","Trent"]
["TRC002I/000A/005A","Kelfield Sewer, Kelfield Pumped Catchment Capital works","Derbys Notts and Leics","Trent"]
["TRC002E/000A/005A","Isle of Axholme, Bull Hassocks Pumping Station Improvements","Derbys Notts and Leics","Trent"]
["TRC003F/000A/104A","Maltby Surface Water Flood Alleviation","Yorkshire","Trent"]
["TRC002E/000A/007A","Isle of Axholme, Dirtness Pumping Station Improvements","Derbys Notts and Leics","Trent"]
["TRC003F/000A/075A","Paper Mill Dyke Flood Defence Wall","Derbys Notts and Leics","Trent"]
["TRC002I/000A/006A","Ferry Drain, South Street Pumping Refurbishment","Derbys Notts and Leics","Trent"]
["TRC002E/000A/011A","Isle of Axholme, Tunnel Pits Pumping Station Improvements","Derbys Notts and Leics","Trent"]
["TRC003E/000A192A","Keadby Warping Drain Outfall","Derbys Notts and Leics","Trent"]
["TRC002E/000A/006A","Isle of Axholme, Candy Farm Pumping Station Improvements","Derbys Notts and Leics","Trent"]
["TRC002E/000A/008A","Isle of Axholme, Goodcop Pumping Station Improvements","Derbys Notts and Leics","Trent"]
["TRC003I/000A/010A","Godscross Drain, Blaxton Quarry PS replacement","Derbys Notts and Leics","Trent"]
["TRC002E/000A/014A","Isle of Axholme, North Soak Syphon Automatic Weedscreen","Derbys Notts and Leics","Trent"]
["TRC002E/000A/016A","Isle of Axholme, Godnow Bridge Floodwall","Derbys Notts and Leics","Trent"]
["TRC003F/000A/108A","Anston Brook Catchment Flood Risk Reduction, Anston & Dinnington","Yorkshire","Trent"]
["TRC002E/000A/001A","Isle of Axholme Strategy, System Improvements","Derbys Notts and Leics","Trent"]
["TRC003F/000A/052A","Carr Lane Dyke, Parklands Estate, West Butterwick","Derbys Notts and Leics","Trent"]
["TRC003F/000A/109A","Woodsetts Flood Alleviation Scheme","Yorkshire","Trent"]
["TRC002E/000A/017A","Isle of Axholme, River Idle Asset Improvements","Derbys Notts and Leics","Trent"]
["TRC003F/000A/045A","River Torne trib, Rossington, Flood Alleviation Study","Derbys Notts and Leics","Trent"]
["TRC002E/000A/009A","Isle of Axholme, Low Bank Pumping Station Improvements","Derbys Notts and Leics","Trent"]
["TRC002E/000A/012A","Isle of Axholme, Waterton Farm Pumping Station Improvements","Derbys Notts and Leics","Trent"]
["TRC002E/000A/010A","Isle of Axholme, Snow Sewer Pumping Station Improvements","Derbys Notts and Leics","Trent"]
["TRC002E/000A/013A","Isle of Axholme, Woodcarr Pumping Station Improvements","Derbys Notts and Leics","Trent"]
["TRC003F/000A/099A","Bramley Brook Watercourse Improvements","Yorkshire","Trent"]
["TRC003E/000A/527A","Tidal River Trent, Axholme, Defence Improvements","Derbys Notts and Leics","Trent"]
["TRC003F/000A/103A","Brookhouse Dike Flood Alleviation Scheme","Yorkshire","Trent"]
["TRC003F/000A/106A","Maltby Dike Flood Alleviation Scheme","Yorkshire","Trent"]
["TRC002E/000A/002A","Isle of Axholme, Keadby Pumping Station Improvements","Derbys Notts and Leics","Trent"]
["TRC002I/000A/002A","Skyers Drain, Greenholme Pumping Station Refurbishment","Derbys Notts and Leics","Trent"]
["TRC003F/000A/112A","Rossington Flood Alleviation Scheme","Derbys Notts and Leics","Trent"]
["WXC007I/000A/01CA","Parrett Health and Safety Improvements to Structures","Wessex","Wessex"]
["WXC007E/000A/211A","Parrett Barrier Site Investigation / Scheme","wessex","Wessex"]
["WXC006I/000A/05CA","Lower Brue Health and Safety Improvements to Structures (Phase 2)","Wessex","Wessex"]
["WXC006I/000A/02CA","Lower Axe - Health and Safety improvements to structures (Phase 2)","Wessex","Wessex"]
["WXS002C/000A/034A","West Bay Coast Protection Works Beach Management Plan (BMP + Works)","Wessex","Wessex"]
["WXS002C/000A/036A","Lyme Regis Coast Protection Works Beach Management Plan (BMP & Works)","Wessex","Wessex"]
["WXS002C/000A/03CA","Lyme Regis Coast Protection Works Phase IV","Wessex","Wessex"]
["WXC001E/000A/025A","Wareham Coastal Change","Wessex","Wessex"]
["WXS004E/001A/001A","Steart Coastal Management Project","Wessex","Wessex"]
["WXS001C/000A/034A","Bournemouth Beach Management Phase 2 (18% Version)","Wessex","Wessex"]
["WXC001E/000A/033A","Swanage Flood Storage Reservoirs","Wessex","Wessex"]
["WXO004E/000A/060A","Wessex Property Level Protection","Wessex","Wessex"]
["WXC006F/000A/109A","Wrington Flood Relief Scheme","Wessex","Wessex"]
["WXC006I/000A/081A","Lower Brue Urban Drainage Improvements - West Huntspill and Alstone","Wessex","Wessex"]
["WXS004I/001A/051A","Minehead Urban Drainage Improvements","Wessex","Wessex"]
["WXC006I/000a/03CA","Lower Axe Urban Drainage  Improvements - Brent Knoll and East Brent ","Wessex","Wessex"]
["WXC001E/000A/004A","Charminster","Wessex","Wessex"]
["WXC005E/000A/172A","Longmoor Tunnel Refurbishment","Wessex","Wessex"]
["WXC005F/000A/150A","Bath Flood Risk Management Project","Wessex","Wessex"]
["WXS001C/000A/025A","Poole Frontage Management Plan Works - Beach Renourishment 2015 - 2016","Wessex","Wessex"]
["WXS001C/000A/039A","Poole Dolphin Haven Works","Wessex","Wessex"]
["WXS001C/000A/027A","Bournemouth Beach Management Phase 1 (18% Version)","Wessex","Wessex"]
["WXC002F/000A/059A","Warminster Portway Lane","Wessex","Wessex"]
["WXC001F/000A/034A","Dorset PLP","Wessex","Wessex"]
["WXC007E/000A/219A","Curry Moor Reservoir Section 10 Improvements","Wessex","Wessex"]
["WXC006C/000A/152A","Weston Bay beach recycling","Wessex","Wessex"]
["WXC005E/000A/103A","Coombend Culvert and Stream Improvements","Wessex","Wessex"]
["WXS002E/000A/071A","Weymouth Bay Coastal Defences","Wessex","Wessex"]
["WXC007E/000A/218A","Taunton flood alleviation improvements","Wessex","Wessex"]
["WXS002C/000A/096A","Lyme Regis Coast Protection Works Beach Management Plan (BMP & Works) 2017/18 onwards","Wessex","Wessex"]
["WXS002C/000A/097A","West Bay Coast Protection Works Beach Management Plan (BMP + Works) 2017/18 onwards","Wessex","Wessex"]
["WXS001F/000A/036A","Central Poole Flood Defences","Wessex","Wessex"]
["WXS002C/000A/025A","Ringstead Beach Management Plan (BMP & Works)","Wessex","Wessex"]
["WXO004E/000A/102A","Somerset Levels and Moors 20 Year Flood Action Plan implementation","Wessex","Wessex"]
["WXC007E/000A/208A","French Weir Remedials, River Tone","Wessex","Wessex"]
["WXS004E/000A/003A","Pill Pile Wall","Wessex","Wessex"]
["WXS004F/001A/047A","Flood alleviation at Croscombe, Somerset","Wessex","Wessex"]
["WXS003E/001A/003A","Parrett Estuary - Cannington Bends","Wessex","Wessex"]
["WXC002E/00A/054A","Salisbury City Centre FAS","Wessex","Wessex"]
["WXC005E/000A/138A","Brislington Flood Defence Scheme Improvements","Wessex","Wessex"]
["WXS001C/000A/034A","Bournemouth Beach Management Phase 3 (18% Version)","Wessex","Wessex"]
["WXC005F/000A/165A","Orcheston Surface Water Attenuation","Wessex","Wessex"]
["WXC005F/000A/164A","Chitterne Attenuation of Surface Water","Wessex","Wessex"]
["WXC005F/000A/166A","Tilshead Surface Water Attenuation","Wessex","Wessex"]
["WXC002E/000A/039A","Wilton Wylye Flood Bank","Wessex","Wessex"]
["WXC002E/000A/060A","Christchurch Priory Quay","Wessex","Wessex"]
["WXC006E/000A/162A","Kingston Seymour Asset Improvements","Wessex","Wessex"]
["WXC005E/000A/139A","Bradford -on-Avon Flood Defence Scheme","Wessex","Wessex"]
["WXC002E/000A/061A","Christchurch Willow Way / Riverside","Wessex","Wessex"]
["WXC008E/000A/036A","Roadwater Improvements","Wessex","Wessex"]
["WXS001F/000A/038A","Sterte Pumping Station","Wessex","Wessex"]
["WXC001E/000A/039A","Maiden Newton Improvements","Wessex","Wessex"]
["WXC004E/000A/093A","Bridport","Wessex","Wessex"]
["WXC001E/000A/040A","Dorchester FDS Improvements","Wessex","Wessex"]
["WXC008E/000A/032a","Stolford Flood Defence Scheme","Wessex","Wessex"]
["WXC006E/000A/149A","River Brue Fish Passage Improvements","Wessex","Wessex"]
["WXC005E/000A/137A","Frome Scheme Improvements - Wallbridge","Wessex","Wessex"]
["WXC006E/000A/163A","Sand Bay Improvements","Wessex","Wessex"]
["WXS001C/000A/024A","Poole Frontage Management Plan Works - Beach Renourishment 2025 -2026","Wessex","Wessex"]
["WXS007E/000A/187A","Henley Sluice","Wessex","Wessex"]
["WXO004E/000A/060A","Wessex Property Level Protection yrs 4 to 8","Wessex","Wessex"]
["WXC006F/000A/159A","Clevedon Sea Wall Capital Maintenance","Wessex","Wessex"]
["WXS002E/000A/103A","West Bay Coastal Improvements","Wessex","Wessex"]
["WXO002E/000A/159A","Saltmoor Pumping Station Improvements","Wessex","Wessex"]
["WXC007E/000A/229A","Dunball Sluice Gates Refurbishment","Wessex","Wessex"]
["WXC005F/000A/163A","Beanacre Surface Water Drainage Improvements","Wessex","Wessex"]
["WXC006E/000A/160A","Parrett at Langport RB Asset Improvements","Wessex","Wessex"]
["WXC005E/000A/169A","Malago Asset Improvements","Wessex","Wessex"]
["WXC007E/000A/232A","Westmoor & Southmoor Asset Improvements","Wessex","Wessex"]
["WXC006E/000A/161A","Parrett LB Langport - Thorney Asset Improvements","Wessex","Wessex"]
["WXC002E/000A/062A","Tisbury Asset Improvements","Wessex","Wessex"]
["WXC005F/000A/120A","Bristol City, Surface Water Management, Southmead Site","Wessex","Wessex"]
["WXC007E/000A/231A","Kings Sedgmoor Drain Asset Improvements","Wessex","Wessex"]
["WXC007E/000A/227A","West Sedgemoor Pumping Station Improvements","Wessex","Wessex"]
["WXS004E/001A/052A","Land Yeo Lower & Blind Yeo Asset Improvements","Wessex","Wessex"]
["WXC007E/000A/228A","Gold Corner Pumping StationImprovements","Wessex","Wessex"]
["WXC008E/000A/035A","Muchelney Ham FDS Improvements","Wessex","Wessex"]
["WXC003E/000A/065A","Wimborne FDS Improvements","Wessex","Wessex"]
["WXC005E/000A/170A","Twerton Gate Vertical Gate Refurbishment","Wessex","Wessex"]
["WXC007E/000A/230A","Currymoor Pumping Station Improvements","Wessex","Wessex"]
["WXC008E/000A/034A","Williton Flood Defence Scheme","Wessex","Wessex"]
["WXS001F/000A/037A","Creekmoor Flood Defences","Wessex","Wessex"]
["WXC007E/000A/171A","Dalby Avenue Trash Screen Improvements","Wessex","Wessex"]
["WXC005E/000A/136A","Yate Chipping Sodbury Defence Improvements","Wessex","Wessex"]
["WXC005F/000A/151A","Melksham, Forest Road Surface Water Drainage Improvements","Wessex","Wessex"]
["WXC005E/000A/173A","Avonmouth Severnside Flood Defences","Wessex","Wessex"]
["WXC006F/000A/153A","Summer Lane Improvement Works","Wessex","Wessex"]
["WXC006F/000A/110A","Brookside Cottages, Brookside Road, Combwich","Wessex","Wessex"]
["WXC005F/000A/118A","Bristol City, Surface Water Management, Henbury 1 Site","Wessex","Wessex"]
["WXC001F/000A/027A","Whitley Lake Sea Defence","Wessex","Wessex"]
["WXC006C/000A0146A","Weston Catchment Flood Alleviation Scheme ","Wessex","Wessex"]
["WXC004F/000A/065A","Chickerell and Southill Flood Management Scheme","Wessex","Wessex"]
["WXC005F/000A/117A","Bristol City, Surface Water Management, Bamfield Road Site","Wessex","Wessex"]
["WXC006F/000A/112A","Sparrow Hill Way / Henmore Lane, Weare","Wessex","Wessex"]
["WXC006F/000A/132A","Redcliffe Street, Cheddar","Wessex","Wessex"]
["WXC007F/000A/214A","Durleigh Brook, Blake Gardens, Bridgwater","Wessex","Wessex"]
["WXC006F/000A/154A","Greenway Farm to Partridge Close, Greinton","Wessex","Wessex"]
["WXC006F/000A/111A","Church Lane, Badgworth","Wessex","Wessex"]
["WXS001C/000A/035A","Bournemouth Central Valley Surface Water Flood Relief Scheme","Wessex","Wessex"]
["WXC004F/000A/079A","Weymouth Tidal Defence Scheme","Wessex","Wessex"]
["WXC003F/000A/064A","Hatch Pond Poole Flood Attenuation","Wessex","Wessex"]
["WXC005E/000A/168A","Melksham (Cooper Tyres LEP)","Wessex","Wessex"]
["WXC005F/000A/160A","Strategic Avon Defence ","Wessex","Wessex"]
["WXC007E/000A/211A","Bath Flood Defence Scheme improvements","Wessex","Wessex"]
["WXC007E/000A/211A","Bath to Bristol improvements","Wessex","Wessex"]
["WXC005F/000A/159A","Bristol Avon localised interventions - interim measures","Wessex","Wessex"]
["WXC005F/000A/162A","Avon Beach and Friars Cliff Groyne Replacement Scheme","Wessex","Wessex"]
["WXC007E/000A/192A","Firepool Weir Stabilisation","Wessex","Wessex"]
["WXC005F/000A/161A","Combined Sewer Flooding Project","Wessex","Wessex"]
["WXS002C/000A/047A","Lyme Regis Coast Protection Works Phase V","Wessex","Wessex"]
["WXS002C/000A/035A","Portland Harbour NW Shore Scheme","Wessex","Wessex"]
["YOC356E/003A/901A","Avenue Flood Balancing Reservoir, Chesterfield","Yorkshire","Yorkshire"]
["YOC356F/000A/046A","Chester Street PLP","Yorkshire","Yorkshire"]
["YOC356F/000A/053A","Norbriggs PLP","Yorkshire","Yorkshire"]
["YOC356F/000A/055A","Pottery Lane East PLP","Yorkshire","Yorkshire"]
["YOC356F/000A/060A","Tapton Terrace PLP Flood Mitigation Scheme","Yorkshire","Yorkshire"]
["YOC356F/000A/056A","Renishaw Flood Alleviation Scheme","Yorkshire","Yorkshire"]
["YOC356E/003A/001A","Chesterfield Flood Alleviation Scheme ","Yorkshire","Yorkshire"]
["YOC356E/000A/078A","Dronfield Dam","Yorkshire","Yorkshire"]
["YOC356E/000A/101A","Poolsbrook future Repairs","Yorkshire","Yorkshire"]
["YOC356E/000A/102A","Poolsbrook Reservoir Works","Yorkshire","Yorkshire"]
["YOC356E/000A/106A","Rother Shoal Removal","Yorkshire","Yorkshire"]
["YOC356E/000A/114A","Slitting Mills Embankment Refurb","Yorkshire","Yorkshire"]
["YOC356E/000A/117A","The Avenue Refurbishments","Yorkshire","Yorkshire"]
["YOC356E/000A/126A","Whitting \"Wagon Works\" Defence Upgrade","Yorkshire","Yorkshire"]
["YOC356E/000A/086A","Hipper Shoal Removal","Yorkshire","Yorkshire"]
["YOC354E/000A/055A","Victoria Clough, Earby Culvert Repair","Yorkshire","Yorkshire"]
["YOC355E/000A/002A","Ings Beck Flood Alleviation Scheme","Yorkshire","Yorkshire"]
["YOS399E/001A/046B","Humber: Erosion Protection Works","Yorkshire","Yorkshire"]
["YOC353E/000A/040A","Works arising from City of York Flood Defence Improvement Strategy.","Yorkshire","Yorkshire"]
["YOC357I/000A/012A","Eastrington & Laxton Flood Management Project","Yorkshire","Yorkshire"]
["YOC353E/001A/002A","Water End Flood Alleviation Scheme, York","Yorkshire","Yorkshire"]
["YOC357E/000A/056A","Upper and Middle Hull Embankment Repairs","Yorkshire","Yorkshire"]
["YOC357E/000A/013A","Mill Beck Reservoir Works, Market Weighton ","Yorkshire","Yorkshire"]
["YOC357I/000A/011A","Gilberdyke & Blacktoft Flood Management Project","Yorkshire","Yorkshire"]
["YOC353E/000A/006A","Northallerton (Sun and Turker Becks) Flood Alleviation Scheme","Yorkshire","Yorkshire"]
["YOC357F/000A/022A","Willerby and Derringham Flood Alleviation Scheme","Yorkshire","Yorkshire"]
["YOS351C/000A/086A","Whitby Harbour Works MU17 & MU18","Yorkshire","Yorkshire"]
["YOC357F/000A/037A","Sutton Ings Flood Alleviation Scheme - Sustainable Drainage retrofit","Yorkshire","Yorkshire"]
["YOC353F/000A/013A","Pocklington Flood Alleviation Scheme","Yorkshire","Yorkshire"]
["YOC356E/000A/083A","Goole Dutch River Museum Bank","Yorkshire","Yorkshire"]
["YOC355F/000A/103A","Rochdale Canal & Tributaries","Yorkshire","Yorkshire"]
["YOS351F/000A/012A","Sandsend Coast Protection Scheme","Yorkshire","Yorkshire"]
["YOC356F/000A/032A","Low Valley Flood Alleviation Scheme, Wombwell, Barnsley","Yorkshire","Yorkshire"]
["YOC354E/000A/025A","Snaith Ings Reservoir Repairs Project","Yorkshire","Yorkshire"]
["YOC353E/000A/094A","Package 2 - Yorkshire - inc Reedness, Goole and Airmyn [Recovery]","Yorkshire","Yorkshire"]
["YOC357I/000A/037A","Howdendyke Pumping Station Refurbishment","Yorkshire","Yorkshire"]
["YOC357F/000A/038A","Newland Flood Alleviaiton Scheme - Sustainable Drainage retrofit","Yorkshire","Yorkshire"]
["YOC356F/000A/057A","Sheffield Watercourses Culvert Renewal Survey Programme","Yorkshire","Yorkshire"]
["YOC354E/000A/016A","Skipton Flood Alleviation Scheme","Yorkshire","Yorkshire"]
["YOC353E/000A/916A","Catterick FAS","Yorkshire","Yorkshire"]
["YOC356F/000A/019A","Sheffield Lower Don Valley Flood Protection Project","Yorkshire","Yorkshire"]
["YOC353E/000A/062A","Humber: Goole Fields to Crowle","Yorkshire","Yorkshire"]
["YOC354E/002A/005A","Hensall Barrier Banks - Defence Improvements","Yorkshire","Yorkshire"]
["YOC356F/000A/069A","Remedial Works on the Porter Brook at Sidney Street","Yorkshire","Yorkshire"]
["YOC354E/001A/001A","Leeds City Flood Alleviation Scheme","Yorkshire","Yorkshire"]
["YOC355E/000A/010A","Dewsbury Flood Alleviation Scheme","Yorkshire","Yorkshire"]
["YOC356E/000A/089A","Kirk Sandall PS Refurbishment","Yorkshire","Yorkshire"]
["YOC353E/000A/077A","Selby Floodgates Maintenance","Yorkshire","Yorkshire"]
["YOC356I/000A/003A","Rawcliffe DB Pumping Stations Refurbishment & Other Works (3502)","Yorkshire","Yorkshire"]
["YOC356F/000A/087A","Sheffield Watercourses - Culvert Renewal Programme","Yorkshire","Yorkshire"]
["YOC355F/000A/046A","Cleckheaton Flood Alleviation Scheme","Yorkshire","Yorkshire"]
["YOC357F/000A/074A","Beverley Model Farm Drain","Yorkshire","Yorkshire"]
["YOC356E/000A/053A","Mile Thorne Bank Refurbishment","Yorkshire","Yorkshire"]
["YOC353F/000A/019A","FMU 05 River Wiske FRMP","Yorkshire","Yorkshire"]
["YOC354F/000A/007A","Wortley Beck Improvements, Leeds","Yorkshire","Yorkshire"]
["YOC356F/000A/097A","Rotherham to Kilnhurst Phase 2 Flood Alleviation Scheme","Yorkshire","Yorkshire"]
["YOC355F/000A/057A","Holmfirth Flood Alleviation Scheme","Yorkshire","Yorkshire"]
["YOS351C/000A/100A","Whitby Coastal Strategy 2 Management Unit 19 Haggerlythe","Yorkshire","Yorkshire"]
["YOC356F/000A/062A","Whiston Brook Flood Storage","Yorkshire","Yorkshire"]
["YOC354F/000A/019A","Victoria Road Surface Water Flood Alleviation Scheme, Guisley, Leeds","Yorkshire","Yorkshire"]
["YOC356E/000A/137A","Blackburn Brook Culvert","Yorkshire","Yorkshire"]
["YOC353F/000A/004A","Nunburnholme Watercourse Improvements","Yorkshire","Yorkshire"]
["YOS351C/001A/020A","Scalby Ness PAR & Works  ","Yorkshire","Yorkshire"]
["YOC355F/000A/118A","Swineshead Clough","Yorkshire","Yorkshire"]
["YOC355F/000A/085A","Allescholes Road Catchment FAS","Yorkshire","Yorkshire"]
["YOC354F/000A/005A","Wakefield Road Flood Alleviation Scheme, Garforth, Leeds","Yorkshire","Yorkshire"]
["YOC355F/000A/109A","Stubbing Drive","Yorkshire","Yorkshire"]
["YOC354F/000A/008A","Farnley Wood Beck FAS, Cottingley, Leeds","Yorkshire","Yorkshire"]
["YOC356F/000A/054A","Parkgate Flood Alleviation Scheme","Yorkshire","Yorkshire"]
["YOC357I/000A/046A","Causeway Dale Weel ","Yorkshire","Yorkshire"]
["YOC357I/000A/038A","Constable Drain North Frodingham","Yorkshire","Yorkshire"]
["YOC357I/000A/047A","Cross Drain Leven","Yorkshire","Yorkshire"]
["YOC357I/000A/049A","Firth Drain Leven","Yorkshire","Yorkshire"]
["YOC357I/000A/051A","Fox Drain Tributary Dunswell","Yorkshire","Yorkshire"]
["YOC357I/000A/052A","Hards Covert Burton Agnes","Yorkshire","Yorkshire"]
["YOC357I/000A/053A","Hull Road East Drain Woodmansey","Yorkshire","Yorkshire"]
["YOC357I/000A/054A","Hull Road West Drain Woodmansey","Yorkshire","Yorkshire"]
["YOC357I/000A/040A","Hutton Cranswick East  Flood Alleviation Scheme","Yorkshire","Yorkshire"]
["YOC357I/000A/041A","Mill Dam Beck Brandesburton","Yorkshire","Yorkshire"]
["YOC357I/000A/042A","North Bullock Arram","Yorkshire","Yorkshire"]
["YOC357I/000A/043A","North Frodingham Flood Alleviation Scheme","Yorkshire","Yorkshire"]
["YOC357I/000A/018A","Old Main Drain Wawne 1","Yorkshire","Yorkshire"]
["YOC357I/000A/056A","Old Main Drain Wawne 2","Yorkshire","Yorkshire"]
["YOC357I/000A/057A","Parting Dike Eske","Yorkshire","Yorkshire"]
["YOC357I/000A/019A","Riston Pumping Station","Yorkshire","Yorkshire"]
["YOC357I/000A/058A","Rotsea Drain Hempholme","Yorkshire","Yorkshire"]
["YOC357I/000A/020A","South Leven Flood Alleviation Scheme","Yorkshire","Yorkshire"]
["YOC357I/000A/061A","Swinemoor North Tickton","Yorkshire","Yorkshire"]
["YOC357I/000A/044A","Tickton Flood Alleviation Scheme","Yorkshire","Yorkshire"]
["YOC357I/000A/063A","Western Drain Woodmansey","Yorkshire","Yorkshire"]
["YOC354I/000A/008A","Gowdall Pumping Station","Yorkshire","Yorkshire"]
["YOC356I/000A/011A","Park Farm Pumping Station","Yorkshire","Yorkshire"]
["YOC357F/000A/071A","Aldbrough Seaside Road","Yorkshire","Yorkshire"]
["YOC357F/000A/067A","Anlaby and East Ella Flood Alleviation Scheme","Yorkshire","Yorkshire"]
["YOC357F/000A/025A","Beeford Village Flood Alleviation Scheme","Yorkshire","Yorkshire"]
["YOC357F/000A/075A","Beverley Victoria Road Culvert Reinstatement","Yorkshire","Yorkshire"]
["YOS352F/000A/002A","Bridlington Hilderthorpe Sea Cut","Yorkshire","Yorkshire"]
["YOC351F/000A/004A","Bubwith Culvert Connection","Yorkshire","Yorkshire"]
["YOC351F/000A/006A","Burnby Culvert Scheme","Yorkshire","Yorkshire"]
["YOS352F/000A/003A","Burton Fleming Flood Alleviation Scheme","Yorkshire","Yorkshire"]
["YOC357F/000A/077A","Carnaby Ditch Improvement Scheme","Yorkshire","Yorkshire"]
["YOC357F/000A/078A","Cherry Burton The Meadows","Yorkshire","Yorkshire"]
["YOC357F/000A/023A","Cottingham and Orchard Flood Alleviation Scheme","Yorkshire","Yorkshire"]
["YOC357F/000A/114A","Driffield Kellythorpe Groundwater Scheme","Yorkshire","Yorkshire"]
["YOC351F/000A/007A","East Cottingwith Hagg Bridge Flood Elevation Scheme","Yorkshire","Yorkshire"]
["YOC357F/000A/080A","Flamborough Hartendale Gutter Scheme","Yorkshire","Yorkshire"]
["YOC357F/000A/051A","Gilberdyke Drainage Scheme Phase 4","Yorkshire","Yorkshire"]
["YOC353F/000A/003A","Goole Hook Drain Culvert Improvements","Yorkshire","Yorkshire"]
["YOC353F/000A/008A","Hayton Flood Conveyance Scheme","Yorkshire","Yorkshire"]
["YOC357F/000A/083A","Hessle Fleet Drain Ancillaries","Yorkshire","Yorkshire"]
["YOS352C/000A/012A","Hornsea Floral Hall Seawall Rehabilitation","Yorkshire","Yorkshire"]
["YOC357F/000A/087A","Howden East Drainage Improvements","Yorkshire","Yorkshire"]
["YOC357F/000A/115A","Hull and Holderness Flood Alleviation Scheme","Yorkshire","Yorkshire"]
["YOC357F/000A/089A","Keyingham North Culvert Scheme","Yorkshire","Yorkshire"]
["YOC357F/000A/090A","Kilham Village Flood Alleviation Scheme","Yorkshire","Yorkshire"]
["YOC357F/000A/091A","Langtoft Village Flood Alleviation Scheme","Yorkshire","Yorkshire"]
["YOC357F/000A/093A","Lelley Culvert","Yorkshire","Yorkshire"]
["YOC357F/000A/009A","Leven Village Flood Alleviation Scheme","Yorkshire","Yorkshire"]
["YOC355F/000A/107A","Smithy Lane, Colden","Yorkshire","Yorkshire"]
["YOS352C/000A/013A","Mappleton Coastal Change Learning Resource Centre","Yorkshire","Yorkshire"]
["YOC357F/000A/096A","Middleton on the Wolds Culverting Scheme","Yorkshire","Yorkshire"]
["YOC357F/000A/102A","Minor Capital Scheme Support Year 24/25 On  (Assumed Min 100% PF Score)","Yorkshire","Yorkshire"]
["YOC357F/000A/103A","Molescroft Sister Beck Flood Alleviation Scheme","Yorkshire","Yorkshire"]
["YOC357F/000A/105A","North Cave New Cut to Wetlands","Yorkshire","Yorkshire"]
["YOC357F/000A/045A","North Ferriby Church Street","Yorkshire","Yorkshire"]
["YOC357F/000A/007A","Skidby Village Flood Alleviation Scheme","Yorkshire","Yorkshire"]
["YOC357F/000A/054A","South Cave Village Flood Alleviation Scheme","Yorkshire","Yorkshire"]
["YOC351F/000A/019A","Sutton on Derwent Old Mill Flood Elevation Scheme","Yorkshire","Yorkshire"]
["YOC356F/000A/058A","Swinefleet Flood Alleviation Scheme","Yorkshire","Yorkshire"]
["YOC357F/000A/110A","Ulrome Pond Improvements","Yorkshire","Yorkshire"]
["YOC353F/000A/007A","Warter Addlekeld Drainage Improvements","Yorkshire","Yorkshire"]
["YOC353F/000A/009A","Wilberfoss Flood Attenuation Scheme","Yorkshire","Yorkshire"]
["YOS352C/000A/007A","Withernsea Groyne Field Improvements","Yorkshire","Yorkshire"]
["YOS352C/000A/014A","Withernsea South Terminal Structure Improvements","Yorkshire","Yorkshire"]
["YOS352F/000A/006A","Works Arising from Barmston Main Drain Catchment Flood Risk Management Plan","Yorkshire","Yorkshire"]
["YOS399F/000A/005A","Works Arising from Brough and Redcliff Catchment Flood Risk Management Plan","Yorkshire","Yorkshire"]
["YOC357F/000A/117A","Works Arising from Burstwick Drain Catchment Flood Risk Management Plan","Yorkshire","Yorkshire"]
["YOC357F/000A/118A","Works Arising from Earls Dyke Catchment Flood Risk Management Plan","Yorkshire","Yorkshire"]
["YOC351F/000A/020A","Works Arising from Gypsey Race and Flamborough Catchment Flood Risk Management Plan","Yorkshire","Yorkshire"]
["YOS352F/000A/007A","Works Arising from Hornsea Mere Catchment Flood Risk Management Plan","Yorkshire","Yorkshire"]
["YOC353F/000A/035A","Works Arising from Lower Derwent and Ouse Catchment Flood Risk Management Plan","Yorkshire","Yorkshire"]
["YOC357F/000A/119A","Works Arising from Market Weighton Canal Catchment Flood Risk Management Plan","Yorkshire","Yorkshire"]
["YOC357F/000A/120A","Works Arising from North Cave Beck Catchment Flood Risk Management Plan","Yorkshire","Yorkshire"]
["YOC357F/000A/121A","Works Arising from Old Fleet Drain Catchment Flood Risk Management Plan","Yorkshire","Yorkshire"]
["YOC357F/000A/116A","Works Arising from River Hull Integrated Catchment Strategy","Yorkshire","Yorkshire"]
["YOC357F/000A/122A","Works Arising from South Holderness Level Drains Catchment Flood Risk Management Plan","Yorkshire","Yorkshire"]
["YOC353E/000A/046A","Airmyn Wall and Bank Replacement","Yorkshire","Yorkshire"]
["YOC357E/000A/032A","Barmston Sea End Outfall","Yorkshire","Yorkshire"]
["YOC357E/000A/033A","Beverley Beck Crane / Floodgate","Yorkshire","Yorkshire"]
["YOC357E/000A/061A","Burstwick New Clough","Yorkshire","Yorkshire"]
["YOC357E/000A/035A","Easington Long Bank Outfall","Yorkshire","Yorkshire"]
["YOC357E/000A/026A","Frodingham Beck Embankment Repairs","Yorkshire","Yorkshire"]
["YOC357E/001A/005A","Great Culvert Pumping Station Refurbishment","Yorkshire","Yorkshire"]
["YOC356E/000A/084A","Greenland Lane Leakage","Yorkshire","Yorkshire"]
["YOC357E/000A/039A","Hempholme Pumping Station Refurbishment","Yorkshire","Yorkshire"]
["YOC357E/000A/042A","Humber: Brough Haven to Weighton Lock","Yorkshire","Yorkshire"]
["YOC357E/000A/043A","Humber: Flood Area 3: Sunk Island","Yorkshire","Yorkshire"]
["YOC357E/000A/044A","Humber: Flood Area 4: Paull Holme Strays to Sunk Island","Yorkshire","Yorkshire"]
["YOS399E/001A/036A","Humber: Hull frontage","Yorkshire","Yorkshire"]
["YOS399E/001A/075A","Humber: North Ferriby","Yorkshire","Yorkshire"]
["YOS399E/001A/039A","Humber: Skeffling Land Purchase and Managed Realignment","Yorkshire","Yorkshire"]
["YOC353E/000A/063A","Humber: Weighton Lock to Boothferry Bridge","Yorkshire","Yorkshire"]
["YOC357E/000A/047A","Market Weighton (Mill Beck) Culvert Repairs","Yorkshire","Yorkshire"]
["YOC357E/000A/049A","Mickley Dike Embankment","Yorkshire","Yorkshire"]
["YOC357E/000A/050A","Newport Floodwalls","Yorkshire","Yorkshire"]
["YOC357E/000A/025A","Old Howe Bank Rationalisation","Yorkshire","Yorkshire"]
["YOC357E/000A/052A","Paull Holme Strays Embankment","Yorkshire","Yorkshire"]
["YOC351E/000A/026A","Pocklington Culvert","Yorkshire","Yorkshire"]
["YOC353E/000A/074A","Rawcliffe Wall Replacement","Yorkshire","Yorkshire"]
["YOC357E/000A/053A","Roam Drain","Yorkshire","Yorkshire"]
["YOC357E/000A/054A","Skeffling Pumping Station Refurbishment","Yorkshire","Yorkshire"]
["YOC351E/000A/027A","Stamford Bridge Floodgates Refurbishment","Yorkshire","Yorkshire"]
["YOC351E/000A/028A","Stamford Bridge Sluice Decommission","Yorkshire","Yorkshire"]
["YOC357E/000A/055A","Tickton Pumping Station Refurbishment","Yorkshire","Yorkshire"]
["YOC356E/000A/121A","Upper Sands Study and Works","Yorkshire","Yorkshire"]
["YOC357E/000A/057A","Waterside Pumping Station Refurbishment","Yorkshire","Yorkshire"]
["YOC356E/000A/122A","Went Left Bank Refurbishment","Yorkshire","Yorkshire"]
["YOC357E/000A/058A","Wilfholme Pumping Station Refurbishment","Yorkshire","Yorkshire"]
["YOO000E/000A/058A","East Hull (Bransholme) Flood Alleviation Scheme","Yorkshire","Yorkshire"]
["YOC357E/000A/040A","High Flags Outfall","Yorkshire","Yorkshire"]
["YOC357E/000A/041A","Hull Barrier Full Refurbishment","Yorkshire","Yorkshire"]
["YOC357E/001A/002A","Hull River Defences","Yorkshire","Yorkshire"]
["YOC357E/000A/046A","Lower Hull Embankments","Yorkshire","Yorkshire"]
["YOC357E/000A/048A","Market Weighton Lock","Yorkshire","Yorkshire"]
["YOS399E/001A/052A","Package 1 - Albert Dock and Dunstan Culvert [Recovery] ","Yorkshire","Yorkshire"]
["YOC357F/000A/027A","Bund alongside Old Fleet Drain close to Annandale Road, Kingston upon Hull - Design & Construction","Yorkshire","Yorkshire"]
["YOC354I/000A/009A","Hensall Pumping Station","Yorkshire","Yorkshire"]
["YOC354I/000A/011A","Whitley Bridge Pumping Station","Yorkshire","Yorkshire"]
["YOC354E/000A/038A","Beal Bank (right) and wall Refurbishment","Yorkshire","Yorkshire"]
["YOC354E/000A/039A","Birkin & Hartley's Bank Refurbishment","Yorkshire","Yorkshire"]
["YOC353E/000A/047A","Boroughbridge Floodgates Maintenance","Yorkshire","Yorkshire"]
["YOC353E/000A/048A","Boroughbridge Gravel Removal","Yorkshire","Yorkshire"]
["YOC353E/000A/049A","Boroughbridge Pumping Station Refurbishment","Yorkshire","Yorkshire"]
["YOC353E/000A/050A","Boroughbridge Wall Repairs","Yorkshire","Yorkshire"]
["YOC354E/000A/040A","Brotherton Bank Replacement","Yorkshire","Yorkshire"]
["YOC351E/000A/907A","Burniston and Cloughton Community Resilience Project","Yorkshire","Yorkshire"]
["YOC353E/000A/054A","Cawood Floodgates Maintenance","Yorkshire","Yorkshire"]
["YOC353E/000A/056A","Cawood Radial Gates","Yorkshire","Yorkshire"]
["YOC353E/000A/057A","Cleek Hall bank Erosion Repair","Yorkshire","Yorkshire"]
["YOC354E/000A/041A","Cononley Washland Replacement of scheme","Yorkshire","Yorkshire"]
["YOC354E/000A/042A","Fairburn Sluice and Structure Replacement","Yorkshire","Yorkshire"]
["YOC354E/000A/045A","Kemp Bank and East Ings Outfall Refurbishment","Yorkshire","Yorkshire"]
["YOC351E/000A/025A","Kirkham Sluice Decommission","Yorkshire","Yorkshire"]
["YOC351E/000A/029A","Malton Floodgate Refurbishments","Yorkshire","Yorkshire"]
["YOC351E/000A/036A","Newby Beck Culvert Refurbishments","Yorkshire","Yorkshire"]
["YOC353E/000A/069A","Newland to Little Airmyn Wall Refurbishment","Yorkshire","Yorkshire"]
["YOC353E/000A/071A","Nun Appleton Pumping Station Refurbishment","Yorkshire","Yorkshire"]
["YOC353E/000A/073A","Pannal (River Crimple) Floodwall Raising","Yorkshire","Yorkshire"]
["YOC353E/000A/075A","Ripon Gabions Replacement and Gravel Removal","Yorkshire","Yorkshire"]
["YOC353E/000A/076A","Roecliffe Pumping Station Refurbishment","Yorkshire","Yorkshire"]
["YOC351E/000A/035A","Sea Cut Banks & Weirs Replacement","Yorkshire","Yorkshire"]
["YOC353E/000A/078A","Selby Lock Gates Strengthening","Yorkshire","Yorkshire"]
["YOC353E/000A/079A","Selby Ousegate ","Yorkshire","Yorkshire"]
["YOC354E/000A/049A","Skipton Coach Street Culvert - ECI","Yorkshire","Yorkshire"]
["YOC354E/000A/050A","Skipton Gabions Waller Hill Beck","Yorkshire","Yorkshire"]
["YOC353E/000A/080A","Tadcaster Embankment and Wall Raising","Yorkshire","Yorkshire"]
["YOC354E/000A/054A","Temple Hirst to Hirst Courtney Bank Replacement","Yorkshire","Yorkshire"]
["YOC353E/000A/081A","Tidal Ouse Floodbank Improvements","Yorkshire","Yorkshire"]
["YOC353E/000A/083A","Ulleskelf Floodwall Replacement","Yorkshire","Yorkshire"]
["YOC356E/000A/124A","Wentbridge Bank Refurbishment and PS Replacement","Yorkshire","Yorkshire"]
["YOC353E/000A/084A","Wistow Ings Refurbishment","Yorkshire","Yorkshire"]
["YOC353F/000A/016A","FMU 02 Stokesley & Great Ayton FRMP","Yorkshire","Yorkshire"]
["YOC353F/000A/017A","FMU 03 River Esk FRMP","Yorkshire","Yorkshire"]
["YOC353F/000A/018A","FMU 04 Swale Upland & Catterick FRMP","Yorkshire","Yorkshire"]
["YOC351F/000A/008A","FMU 06 Upper Derwent & Sea Cut FRMP","Yorkshire","Yorkshire"]
["YOC353F/000A/020A","FMU 07 Swale Washlands West FRMP","Yorkshire","Yorkshire"]
["YOC353F/000A/021A","FMU 08 Upper Ure FRMP","Yorkshire","Yorkshire"]
["YOC353F/000A/022A","FMU 09 Swale Washlands East FRMP","Yorkshire","Yorkshire"]
["YOC351F/000A/009A","FMU 10 River Rye Uplands FRMP","Yorkshire","Yorkshire"]
["YOC351F/000A/010A","FMU 11 River Dove Uplands FRMP","Yorkshire","Yorkshire"]
["YOC351F/000A/011A","FMU 12 River Seven FRMP","Yorkshire","Yorkshire"]
["YOC351F/000A/012A","FMU 13 River Derwent & Filey FRMP","Yorkshire","Yorkshire"]
["YOC351F/000A/013A","FMU 14 Pickering & Costa Becks FRMP","Yorkshire","Yorkshire"]
["YOC351F/000A/014A","FMU 15 Holbeck FRMP","Yorkshire","Yorkshire"]
["YOC353F/000A/023A","FMU 16 River Derwent, Malton & Norton FRMP","Yorkshire","Yorkshire"]
["YOC351F/000A/015A","FMU 17 Middle Hull FRMP","Yorkshire","Yorkshire"]
["YOC353F/000A/024A","FMU 18 Cod Beck FRMP","Yorkshire","Yorkshire"]
["YOC354F/000A/027A","FMU 19 Rural Lune FRMP","Yorkshire","Yorkshire"]
["YOC351F/000A/016A","FMU 20 Gypsey Race FRMP","Yorkshire","Yorkshire"]
["YOC354F/000A/028A","FMU 21 Wenning Sub-Catchment FRMP","Yorkshire","Yorkshire"]
["YOC354F/000A/029A","FMU 22 Upper Ribble & Hodder FRMP","Yorkshire","Yorkshire"]
["YOC353F/000A/025A","FMU 23 Upper Ouse FRMP","Yorkshire","Yorkshire"]
["YOC353F/000A/026A","FMU 24 River Nidd FRMP","Yorkshire","Yorkshire"]
["YOC353F/000A/027A","FMU 25 Lower Ure FRMP","Yorkshire","Yorkshire"]
["YOC353F/000A/028A","FMU 26 North York FRMP","Yorkshire","Yorkshire"]
["YOC354F/000A/030A","FMU 27 River Wharfe FRMP","Yorkshire","Yorkshire"]
["YOC354F/000A/031A","FMU 28 Upper Aire & Skipton FRMP","Yorkshire","Yorkshire"]
["YOC353F/000A/029A","FMU 29 Lower Aire FRMP","Yorkshire","Yorkshire"]
["YOC353F/000A/030A","FMU 30 Lower Don FRMP","Yorkshire","Yorkshire"]
["YOC353F/000A/031A","FMU 31 Tidal Wharfe & Selby FRMP","Yorkshire","Yorkshire"]
["YOC351F/000A/018A","Malton Railway Pipe crossing","Yorkshire","Yorkshire"]
["YOC351I/000A/001A","Hagthorpe Pumping Station improvements","Yorkshire","Yorkshire"]
["YOS351F/000A/011A","Filey Flood Alleviation Works ","Yorkshire","Yorkshire"]
["YOS351C/000A/097A","Filey Town Coastal Defences Coastal Slope and Outflanking Works","Yorkshire","Yorkshire"]
["YOS351C/000A/098A","North Bay Seawall Capital Improvements Phase 2 and 3","Yorkshire","Yorkshire"]
["YOS351C/000A/068A","Robin Hoods Bay PAR & Works","Yorkshire","Yorkshire"]
["YOS351C/000A/107A","Robin Hoods Bay Surface Water Flooding PAR and Works","Yorkshire","Yorkshire"]
["YOS351C/001A/012A","Runswick Bay Appraisal and Works","Yorkshire","Yorkshire"]
["YOS351C/000A/108A","Runswick Bay Surface Water Flooding PAR and Works","Yorkshire","Yorkshire"]
["YOS351C/000A/022A","Scarborough North Bay Sealife Centre Works","Yorkshire","Yorkshire"]
["YOS351C/000A/073A","Scarborough North Bay Seawall Capital Scheme Yr30","Yorkshire","Yorkshire"]
["YOS351C/000A/076A","Scarborough South Bay Foreshore Road to the Spa ","Yorkshire","Yorkshire"]
["YOS351C/000A/084A","Scarborough South Bay Spa Seawall Works","Yorkshire","Yorkshire"]
["YOS351C/000A/079A","Scarborough South Bay Spa to Holbeck Gardens","Yorkshire","Yorkshire"]
["YOS351C/000A/089A","Whitby  Church Street FAS","Yorkshire","Yorkshire"]
["YOS351C/000A/102A","Whitby Coastal Strategy 2 Flood Cell 1 Rowing Club to Museum","Yorkshire","Yorkshire"]
["YOS351F/000A/017A","Whitby Coastal Strategy 2 Flood Cell 3 Spital Beck PLP","Yorkshire","Yorkshire"]
["YOS351C/000A/093A","Whitby Coastal Strategy 2 Management Unit 4AB Sandsend Valley Yr 2050","Yorkshire","Yorkshire"]
["YOS351F/000A/020A","Whitby Coastal Strategy 2 New quay  and Langbourne Rd PLP","Yorkshire","Yorkshire"]
["YOS351C/000A/101A","Whitby Coastal Strategy 2 Pavilion New Revetment and Slope Stabilisation PAR","Yorkshire","Yorkshire"]
["YOS351F/000A/022A","Whitby Coastal Strategy 2 Sandgate IPP and Capital Scheme for Quaywalls","Yorkshire","Yorkshire"]
["YOS351C/000A/094A","Whitby Coastal Strategy 3 Management Unit 3 Sandsend Village","Yorkshire","Yorkshire"]
["YOS351C/000A/095A","Whitby Strategy 2 - Management Unit 13 West Cliff PAR - Spa","Yorkshire","Yorkshire"]
["YOS351C/000A/096A","Whitby Strategy 2 Management Unit 2 Sandsend Car Park Scheme 2033","Yorkshire","Yorkshire"]
["YOC353I/000A/035A","Bond Ings Pumping Station","Yorkshire","Yorkshire"]
["YOC354I/000A/001A","Coates Marsh Pumping Station","Yorkshire","Yorkshire"]
["YOC354I/000A/003A","Little Airmyn Pumping Station","Yorkshire","Yorkshire"]
["YOC354I/000A/006A","Temple Hirst Pumping Station","Yorkshire","Yorkshire"]
["YOC353I/000A/036A","Wistow Clough Pumping Station","Yorkshire","Yorkshire"]
["YOC353I/000A/047A","Main Foss (053) Channel Improvements Ainsty 2008 IDB","Yorkshire","Yorkshire"]
["YOC353I/000A/050A","River Foss (020) Channel Improvements Foss 2008 IDB","Yorkshire","Yorkshire"]
["YOC353F/000A/032A","Works arising from Burdyke inc. Blue Beck Flood Risk Management Strategy","Yorkshire","Yorkshire"]
["YOC353F/000A/034A","Works arising from Holgate Beck Flood Risk Management Strategy","Yorkshire","Yorkshire"]
["YOS399E/001A/037A","Humber: Estuary-wide Monitoring","Yorkshire","Yorkshire"]
["YOC353E/000A/051A","Burdyke Pumping Station Refurbishment","Yorkshire","Yorkshire"]
["YOC351E/000A/023A","Elvington Sluice & Lock Refurbishment","Yorkshire","Yorkshire"]
["YOC353E/000A/091A","Foss Barrier Pump & Software Replacement","Yorkshire","Yorkshire"]
["YOC353E/000A/061A","Holgate Beck Pumping Station Replacement","Yorkshire","Yorkshire"]
["YOC353E/000A/067A","Lower Ebor Street Floodwall","Yorkshire","Yorkshire"]
["YOC353E/000A/068A","Museum Garden Floodbank Improvements ","Yorkshire","Yorkshire"]
["YOC353E/000A/070A","North Street War Memorial Gardens","Yorkshire","Yorkshire"]
["YOC353E/000A/082A","Tower Street Defences","Yorkshire","Yorkshire"]
["YOC353E/001A/041A","Works arising from Naburn & Naburn Grange Flood Risk Management Strategy","Yorkshire","Yorkshire"]
["YOC353E/000A/016A","York - Foss Barrier Flood Alleviation Scheme, River Ouse","Yorkshire","Yorkshire"]
["YOC353E/000A/011A","York - River Ouse/Burdyke - Burdyke Pumping Station Replacements","Yorkshire","Yorkshire"]
["YOC353E/000A/042A","York City Centre Flood Resilience Works","Yorkshire","Yorkshire"]
["YOC353E/000A/043A","York: Government House Road","Yorkshire","Yorkshire"]
["YOC356F/000A/001A","Aldham Bridge - River Dove Upstream Improvements","Yorkshire","Yorkshire"]
["YOC356F/000A/002A","Birthwaite - Huddersfield Road (A637)","Yorkshire","Yorkshire"]
["YOC356F/000A/071A","Grimethorpe - High Street","Yorkshire","Yorkshire"]
["YOC356F/000A/003A","Hemingfield - Tingle Bridge","Yorkshire","Yorkshire"]
["YOC356F/000A/004A","Hoyland - Sheffield Road","Yorkshire","Yorkshire"]
["YOC356F/000A/065A","Silkstone - High Street (Red Lion)","Yorkshire","Yorkshire"]
["YOC356F/000A/030A","Wombwell Ings Flood Storage Scheme, Darfield, Barnsley","Yorkshire","Yorkshire"]
["YOC356F/000A/067A","Worsborough - Edmund Road","Yorkshire","Yorkshire"]
["YOC356E/000A/090A","Low Valley Wombwell Repairs","Yorkshire","Yorkshire"]
["YOC356E/000A/100A","Penistone Channel Management","Yorkshire","Yorkshire"]
["YOC356I/000A/004A","Adwick Mill Pumping Station","Yorkshire","Yorkshire"]
["YOC356I/000A/005A","Blackshaw Clough Pumping Station","Yorkshire","Yorkshire"]
["YOC356I/000A/006A","Church Walk Pumping Station","Yorkshire","Yorkshire"]
["YOC356I/000A/008A","Goosepool Pumping Station","Yorkshire","Yorkshire"]
["YOC356I/000A/017A","Kirk Bramwith Pumping Station","Yorkshire","Yorkshire"]
["YOC356I/000A/010A","Norton Common Pumping Station","Yorkshire","Yorkshire"]
["YOC356I/000A/012A","Sour Lane Pumping Station","Yorkshire","Yorkshire"]
["YOC356I/000A/013A","Taining Drain Pumping Station","Yorkshire","Yorkshire"]
["YOC356I/000A/014A","Thistlegoit Pumping Station","Yorkshire","Yorkshire"]
["YOC356I/000A/015A","Thornhurst Pumping Station","Yorkshire","Yorkshire"]
["YOC356I/000A/016A","Towns Clough Pumping Station","Yorkshire","Yorkshire"]
["YOC356F/000A/047A","Future Doncaster MBC Flood Alleviation Schemes","Yorkshire","Yorkshire"]
["YOC356F/000A/050A","Kearsley Brook Flood Alleviation Scheme","Yorkshire","Yorkshire"]
["YOC356E/000A/062A","Bentley Barrier Bank Refurbishment","Yorkshire","Yorkshire"]
["YOC356E/000A/063A","Bentley PS Replacement","Yorkshire","Yorkshire"]
["YOC356E/000A/070A","Conisbrough Culvert","Yorkshire","Yorkshire"]
["YOC356E/000A/071A","Dearne Mouth Sluices Refurbishments","Yorkshire","Yorkshire"]
["YOC356E/000A/072A","Dearne Pumping Stations Refurbishment","Yorkshire","Yorkshire"]
["YOC356E/000A/073A","Dearne Washlands","Yorkshire","Yorkshire"]
["YOC356E/000A/074A","Dearne Washlands Optimisation","Yorkshire","Yorkshire"]
["YOC356E/000A/075A","Don Piles Wall Refurbishment","Yorkshire","Yorkshire"]
["YOC356E/000A/076A","Don Reservoir Refurbishments","Yorkshire","Yorkshire"]
["YOC356E/000A/079A","Ea Beck & Engine Drain Tidal Doors","Yorkshire","Yorkshire"]
["YOC356E/000A/081A","Fishlake Bank, Penstock and Tidal Doors Refurbishment","Yorkshire","Yorkshire"]
["YOC356E/000A/082A","Fishlake Habitat improvement","Yorkshire","Yorkshire"]
["YOC356E/000A/087A","Kearsley Brook Shoal Removal","Yorkshire","Yorkshire"]
["YOC356E/000A/088A","Kirk Bramwith Defences Bank Refurbishment","Yorkshire","Yorkshire"]
["YOC356E/000A/097A","Old Don Outfall Stainforth","Yorkshire","Yorkshire"]
["YOC356E/000A/112A","Skell Banks Reforming","Yorkshire","Yorkshire"]
["YOC356E/000A/113A","Skellow Rail Tie-in Bridge Parapet Raising","Yorkshire","Yorkshire"]
["YOC356E/000A/115A","Stainforth Left Bank Refurbishment","Yorkshire","Yorkshire"]
["YOC356E/000A/116A","Sykehouse Barrier Bank Refurbishment","Yorkshire","Yorkshire"]
["YOC356E/000A/118A","Thorne Flood Wall Replacement","Yorkshire","Yorkshire"]
["YOC356E/000A/119A","Thorpe Marsh Piles and Bank Refurbishment","Yorkshire","Yorkshire"]
["YOC356E/000A/123A","Went Outfall Refurbishment / Replacement","Yorkshire","Yorkshire"]
["YOC356I/000A/009A","Lake Outfall Pumping Station","Yorkshire","Yorkshire"]
["YOC356E/000A/066A","Canklow Regulator Gate","Yorkshire","Yorkshire"]
["YOC356E/000A/068A","Catcliffe, Canklow, Meadowgate and Woodhouse Mill Defence Improvements","Yorkshire","Yorkshire"]
["YOC356E/000A/091A","Meadowgate Regulator","Yorkshire","Yorkshire"]
["YOC356E/000A/105A","Rother Reservoir Refurbishments","Yorkshire","Yorkshire"]
["YOC356E/000A/107A","Rotherham Defence and Channel Works","Yorkshire","Yorkshire"]
["YOC356E/000A/125A","Whiston Brook FAS","Yorkshire","Yorkshire"]
["YOC356F/000A/006A","Broom & Clifton Flood Alleviation Scheme","Yorkshire","Yorkshire"]
["YOC356F/000A/049A","Herringthorpe Valley Flood Alleviation Scheme","Yorkshire","Yorkshire"]
["YOC356F/000A/059A","Swinton Flood Alleviation Scheme","Yorkshire","Yorkshire"]
["YOC356F/000A/061A","Todwick Flood Alleviation Scheme","Yorkshire","Yorkshire"]
["YOC356E/000A/061A","Abbey Brook Culvert","Yorkshire","Yorkshire"]
["YOC356E/000A/064A","Blackburn Brook Channel Improvements","Yorkshire","Yorkshire"]
["YOC356E/000A/065A","Blackburn Brook FAS","Yorkshire","Yorkshire"]
["YOC356E/000A/077A","Don Shoal Removal","Yorkshire","Yorkshire"]
["YOC356E/000A/080A","Ellin Street Culvert Works","Yorkshire","Yorkshire"]
["YOC356E/000A/092A","Meadowgate Regulator Refurbishment","Yorkshire","Yorkshire"]
["YOC356E/000A/093A","Meadowhall Rd, Bagley Dike Culvert Works","Yorkshire","Yorkshire"]
["YOC356E/000A/094A","Meersbrook Culvert","Yorkshire","Yorkshire"]
["YOC356E/000A/104A","River Loxley Channel Management","Yorkshire","Yorkshire"]
["YOC356E/000A/108A","Sheaf Culvert under Ponds Forge","Yorkshire","Yorkshire"]
["YOC356E/000A/110A","Sheaf Screen Study and Works","Yorkshire","Yorkshire"]
["YOC356E/000A/111A","Sheaf Sediment Removal","Yorkshire","Yorkshire"]
["YOC356E/000A/051A","Upper Don Reservoir Storage","Yorkshire","Yorkshire"]
["YOC356F/000A/086A","Sheffield Upper Don Flood Alleviation Scheme","Yorkshire","Yorkshire"]
["YOC356F/000A/089A","Three Brooks Environmental Scheme, Manor, Sheffield","Yorkshire","Yorkshire"]
["YOC354F/000A/035A","North Beck","Yorkshire","Yorkshire"]
["YOC354F/000A/036A","Oakworth Flood Study","Yorkshire","Yorkshire"]
["YOC354F/000A/037A","Skipton Road","Yorkshire","Yorkshire"]
["YOC353E/000A/064A","Ilkley Backstone Beck Culvert Improvements","Yorkshire","Yorkshire"]
["YOC353E/000A/065A","Ilkley Denton Road FAS","Yorkshire","Yorkshire"]
["YOC354E/000A/043A","Keighley Culvert Repair","Yorkshire","Yorkshire"]
["YOC354E/000A/044A","Keighley Replacement of \"Ski Jump\", Aireworth Road","Yorkshire","Yorkshire"]
["YOC354E/000A/048A","Providence Lane Culvert Repair","Yorkshire","Yorkshire"]
["YOC354E/000A/052A","Stocksbridge Wall & Embankment Replacement","Yorkshire","Yorkshire"]
["YOC354E/000A/053A","Stocksbridge Wall Repair near industrial estate (Aire)","Yorkshire","Yorkshire"]
["YOC355F/000A/086A","Brearly Fields Washland Optimisation","Yorkshire","Yorkshire"]
["YOC355F/000A/087A","Brearly Weir Removal","Yorkshire","Yorkshire"]
["YOC355F/000A/088A","Calder Ryburn FAS","Yorkshire","Yorkshire"]
["YOC355F/000A/089A","Callis Bridge Weir Removal","Yorkshire","Yorkshire"]
["YOC355F/000A/090A","Canker Dyke, Wistons Lane, Elland","Yorkshire","Yorkshire"]
["YOC355F/000A/092A","Farnboro Street Weir Removal","Yorkshire","Yorkshire"]
["YOC355F/000A/093A","Fountain Street Footbridge Removal","Yorkshire","Yorkshire"]
["YOC355F/000A/094A","Harley Wood By-Pass Channel removal","Yorkshire","Yorkshire"]
["YOC355F/000A/095A","Kershaw Road, Walsden","Yorkshire","Yorkshire"]
["YOC355F/000A/096A","Kingfisher Chase, Sowerby Bridge","Yorkshire","Yorkshire"]
["YOC355F/000A/097A","Lobb Mill Weir Removal","Yorkshire","Yorkshire"]
["YOC355F/000A/099A","Luddenden Brook Gravel Arrest","Yorkshire","Yorkshire"]
["YOC355F/000A/100A","Major Clough","Yorkshire","Yorkshire"]
["YOC355F/000A/101A","Mayroyd Footbridge Removal","Yorkshire","Yorkshire"]
["YOC355F/000A/102A","Mayroyd Weir Removal","Yorkshire","Yorkshire"]
["YOC355F/000A/104A","Rough Hall Lane, Wainstalls","Yorkshire","Yorkshire"]
["YOC355F/000A/105A","Shaw Wood Road, Springside","Yorkshire","Yorkshire"]
["YOC355F/000A/106A","Shoebroad Clough","Yorkshire","Yorkshire"]
["YOC355F/000A/111A","Vale Upholstery Bridge Modifications","Yorkshire","Yorkshire"]
["YOC355F/000A/112A","Willowfield Estate","Yorkshire","Yorkshire"]
["YOC355E/000A/081A","Bacup Road Culvert","Yorkshire","Yorkshire"]
["YOC355E/000A/086A","Brighouse Scheme Replacement","Yorkshire","Yorkshire"]
["YOC355E/000A/087A","Callis Bridge Scheme - Replacement of Wall","Yorkshire","Yorkshire"]
["YOC355E/000A/088A","Copley Embankment Repair","Yorkshire","Yorkshire"]
["YOC355E/000A/089A","Cragg Brook Outfalls Replacement","Yorkshire","Yorkshire"]
["YOC355E/000A/096A","Hebble Brook Culverts Repairs","Yorkshire","Yorkshire"]
["YOC355E/001A/002A","Hebden Bridge FAS","Yorkshire","Yorkshire"]
["YOC355E/000A/029A","Mytholmroyd FAS","Yorkshire","Yorkshire"]
["YOC355E/000A/104A","Rochdale Rd culvert and Gauxholme Canal Overflow Package","Yorkshire","Yorkshire"]
["YOC355E/000A/110A","Todmorden Coping Stones Replacement","Yorkshire","Yorkshire"]
["YOC355E/000A/111A","Todmorden Phase 1 Scheme Replacement","Yorkshire","Yorkshire"]
["YOC355E/000A/073A","Upper Calder Flood Risk Reduction Schemes","Yorkshire","Yorkshire"]
["YOC355E/001A/001A","Walsden Water-Todmorden Flood Alleviation Scheme Phase 3","Yorkshire","Yorkshire"]
["YOC355E/000A/082A","Batley Beck Scheme Replacement - Culverts / Walls Repairs","Yorkshire","Yorkshire"]
["YOC355E/000A/083A","Batley Beck Screen Replacements","Yorkshire","Yorkshire"]
["YOC355E/000A/084A","Blackhouse Dike Culvert","Yorkshire","Yorkshire"]
["YOC355E/000A/085A","Box Ings Culverts","Yorkshire","Yorkshire"]
["YOC355E/000A/090A","Crimble Clough Culvert","Yorkshire","Yorkshire"]
["YOC355E/000A/091A","Crowhill Culverts","Yorkshire","Yorkshire"]
["YOC355E/000A/092A","Dewsbury / Batley Flapvalve Replacement","Yorkshire","Yorkshire"]
["YOC355E/000A/093A","Dewsbury Scheme Replacement","Yorkshire","Yorkshire"]
["YOC355E/000A/094A","Fenay Beck Replacement of Floodwalls, Flapvalves and Embankments","Yorkshire","Yorkshire"]
["YOC355E/000A/095A","Grimscar Dyke Culverts Repairs","Yorkshire","Yorkshire"]
["YOC355E/000A/097A","Holme Wall Replacement","Yorkshire","Yorkshire"]
["YOC355E/000A/098A","Longwood Brook Culvert Repair","Yorkshire","Yorkshire"]
["YOC355E/000A/101A","Marsden Culvert","Yorkshire","Yorkshire"]
["YOC355E/000A/105A","Spen Culverts Replacement","Yorkshire","Yorkshire"]
["YOC355E/000A/106A","Spen Flood Gates Replacement","Yorkshire","Yorkshire"]
["YOC355E/000A/107A","Spen Ings Crescent Flood Wall","Yorkshire","Yorkshire"]
["YOC355E/000A/108A","Spen Scheme Replacement","Yorkshire","Yorkshire"]
["YOC356E/000A/120A","Upper Dearne Shoal Removal","Yorkshire","Yorkshire"]
["YOC355F/000A/037A","Almondbury Flood Alleviation Scheme","Yorkshire","Yorkshire"]
["YOC355F/000A/038A","Batley Flood Alleviation Scheme","Yorkshire","Yorkshire"]
["YOC355F/000A/039A","Berry Brow and Primrose Hill Flood Alleviation Scheme","Yorkshire","Yorkshire"]
["YOC355F/000A/040A","Birkby Flood Alleviation Scheme","Yorkshire","Yorkshire"]
["YOC355F/000A/041A","Birkenshaw Flood Alleviation Scheme","Yorkshire","Yorkshire"]
["YOC355F/000A/042A","Birstall Flood Alleviation Scheme","Yorkshire","Yorkshire"]
["YOC355F/000A/043A","Bradley Flood Alleviation Scheme","Yorkshire","Yorkshire"]
["YOC355F/000A/044A","Brockholes Flood Alleviation Scheme","Yorkshire","Yorkshire"]
["YOC355F/000A/045A","Central Huddersfield Flood Alleviation Scheme","Yorkshire","Yorkshire"]
["YOC356F/000A/073A","Clayton West and Scissett Flood Alleviation Scheme","Yorkshire","Yorkshire"]
["YOC355F/000A/047A","Cowcliffe Flood Alleviation Scheme","Yorkshire","Yorkshire"]
["YOC355F/000A/048A","Cowlersley Flood Alleviation Scheme","Yorkshire","Yorkshire"]
["YOC355F/000A/049A","Crossland Flood Alleviation Scheme","Yorkshire","Yorkshire"]
["YOC355F/000A/050A","Dalton and Waterloo Flood Alleviation Scheme","Yorkshire","Yorkshire"]
["YOC356F/000A/074A","Denby Dale Flood Alleviation Scheme","Yorkshire","Yorkshire"]
["YOC355F/000A/051A","Fartown Flood Alleviation Scheme","Yorkshire","Yorkshire"]
["YOC356F/000A/075A","Flockton Flood Alleviation Scheme","Yorkshire","Yorkshire"]
["YOC355F/000A/052A","Gomersal Flood Alleviation Scheme","Yorkshire","Yorkshire"]
["YOC355F/000A/053A","Heckmondwike Flood Alleviation Scheme","Yorkshire","Yorkshire"]
["YOC355F/000A/054A","Hepworth Flood Alleviation Scheme","Yorkshire","Yorkshire"]
["YOC355F/000A/055A","Highburton Flood Alleviation Scheme","Yorkshire","Yorkshire"]
["YOC355F/000A/056A","Hightown Flood Alleviation Scheme","Yorkshire","Yorkshire"]
["YOC355F/000A/058A","Honley Flood Alleviation Scheme","Yorkshire","Yorkshire"]
["YOC355F/000A/036A","Huddersfield A62 Corridor Flood Alleviation Scheme","Yorkshire","Yorkshire"]
["YOC355F/000A/059A","Ings Crescent Flood Alleviation Scheme","Yorkshire","Yorkshire"]
["YOC355F/000A/060A","Kirkheaton Flood Alleviation Scheme","Yorkshire","Yorkshire"]
["YOC355F/000A/030A","Kirklees Culvert Programme","Yorkshire","Yorkshire"]
["YOC355F/000A/061A","Kirklees Small Communities at Risk Flood Alleviation Scheme","Yorkshire","Yorkshire"]
["YOC355F/000A/063A","Lepton Flood Alleviation Scheme","Yorkshire","Yorkshire"]
["YOC355F/000A/064A","Lindley Flood Alleviation Scheme","Yorkshire","Yorkshire"]
["YOC355F/000A/065A","Linthwaite Flood Alleviation Scheme","Yorkshire","Yorkshire"]
["YOC355F/000A/066A","Liversedge Flood Alleviation Scheme","Yorkshire","Yorkshire"]
["YOC355F/000A/067A","Lockwood Flood Alleviation Scheme","Yorkshire","Yorkshire"]
["YOC355F/000A/068A","Marsden Flood Alleviation Scheme","Yorkshire","Yorkshire"]
["YOC355F/000A/069A","Meltham Flood Alleviation Scheme","Yorkshire","Yorkshire"]
["YOC355F/000A/070A","Milnsbridge and Golcar Flood Alleviation Scheme","Yorkshire","Yorkshire"]
["YOC355F/000A/071A","Mirfield Flood Alleviation Scheme","Yorkshire","Yorkshire"]
["YOC355F/000A/072A","New Mill Road (Brockholes) Flood Alleviation Scheme","Yorkshire","Yorkshire"]
["YOC355F/000A/073A","North-East Huddersfield Flood Alleviation Scheme","Yorkshire","Yorkshire"]
["YOC355F/000A/074A","Ox Field Beck Flood Alleviation Scheme","Yorkshire","Yorkshire"]
["YOC355F/000A/075A","Paddock and Marsh Flood Alleviation Scheme","Yorkshire","Yorkshire"]
["YOC355E/000A/068A","Ravensthorpe Flood Alleviation Scheme","Yorkshire","Yorkshire"]
["YOC355F/000A/078A","Shepley Flood Alleviation Scheme","Yorkshire","Yorkshire"]
["YOC356F/000A/076A","Skelmanthorpe Flood Alleviation Scheme","Yorkshire","Yorkshire"]
["YOC355F/000A/079A","Slaithwaite Flood Alleviation Scheme","Yorkshire","Yorkshire"]
["YOC355F/000A/080A","Thongsbridge Flood Alleviation Scheme","Yorkshire","Yorkshire"]
["YOC355F/000A/081A","Thornhill and Overthorpe Flood Alleviation Scheme","Yorkshire","Yorkshire"]
["YOC355F/000A/082A","Thornhill Lees Flood Alleviation Scheme","Yorkshire","Yorkshire"]
["YOC355F/000A/083A","Upper and Lower Hopton Flood Alleviation Scheme","Yorkshire","Yorkshire"]
["YOC354E/000A/037A","Allerton Bywater Bank Refurbishment","Yorkshire","Yorkshire"]
["YOC353E/000A/060A","Holbeck Culverts","Yorkshire","Yorkshire"]
["YOC355E/000A/102A","Methley Sluices Replacement","Yorkshire","Yorkshire"]
["YOC354E/000A/047A","Oulton Beck Wall","Yorkshire","Yorkshire"]
["YOC354E/000A/051A","St Aiden's Reforming banks","Yorkshire","Yorkshire"]
["YOC354E/000A/057A","Wyke Beck Regrade Channel","Yorkshire","Yorkshire"]
["YOC354E/000A/058A","Wyke Beck Repair Riparian wall upstream of Selby Road","Yorkshire","Yorkshire"]
["YOC354F/000A/001A","Cotton Mill Beck Culvert, Valley Road, Morley","Yorkshire","Yorkshire"]
["YOC354F/000A/038A","Leeds FAS Phase 2","Yorkshire","Yorkshire"]
["YOC354F/000A/039A","Leeds FAS Phase 3","Yorkshire","Yorkshire"]
["YOC354F/000A/021A","Potternewton Surface Water Flood Alleviation Scheme, Leeds.","Yorkshire","Yorkshire"]
["YOC354F/000A/002A","Thorner Beck Flood Alleviation Scheme, Thorner, Leeds","Yorkshire","Yorkshire"]
["YOC354I/000A/007A","East Ings Pumping Station","Yorkshire","Yorkshire"]
["YOC354I/000A/010A","Town Drain Pumping Station","Yorkshire","Yorkshire"]
["YOC356E/000A/085A","Hemsworth Culvert","Yorkshire","Yorkshire"]
["YOC355E/000A/120A","Horbury Flood Alleviation Scheme","Yorkshire","Yorkshire"]
["YOC355E/000A/099A","Lower Calder Penbank MEICA Repairs","Yorkshire","Yorkshire"]
["YOC355E/000A/100A","Lower Calder Washlands Replacement","Yorkshire","Yorkshire"]
["YOC355E/000A/109A","Thornes Canal","Yorkshire","Yorkshire"]
["YOC355E/000A/112A","Wakefield - Replacement of Phases 1 & 2","Yorkshire","Yorkshire"]
["YOC354E/000A/056A","Whitwood Mere Barrier Bank ","Yorkshire","Yorkshire"]
["YOC355F/000A/113A","C7 - Oakenshaw Beck phase 2 - Crofton","Yorkshire","Yorkshire"]
["YOC355F/000A/114A","Carr Beck  - FAS Phase 1 ","Yorkshire","Yorkshire"]
["YOC355F/000A/115A","Carr Beck Flood Risk Reduction Phase 2 - 200yr protection","Yorkshire","Yorkshire"]
["YOC356F/000A/092A","Ea Beck - FAS Phase 1 ","Yorkshire","Yorkshire"]
["YOC356F/000A/093A","EA Beck - Phase 2 (Langthwaite Beck)","Yorkshire","Yorkshire"]
["YOC356F/000A/094A","Hoyle Mill Beck Kinsley","Yorkshire","Yorkshire"]
["YOC355F/000A/116A","Lupset Beck, Wakefield","Yorkshire","Yorkshire"]
["YOC355F/000A/117A","Oakenshaw Beck FAS - Drain Beck, Walton","Yorkshire","Yorkshire"]
["YOC356F/000A/095A","River Skell, Upton","Yorkshire","Yorkshire"]
["YOC356F/000A/096A","Went Beck Upper Catchment","Yorkshire","Yorkshire"]
["YOO000E/000A/100A","Yorkshire Culverts","Yorkshire","Yorkshire"]
["YOC357F/000A/094A","Lockington Village Flood Alleviation Scheme","Yorkshire","Yorkshire"]
["YOC357F/000A/097A","Minor Capital Scheme Support Year 19/20 (Assumed Min 100% PF Score)","Yorkshire","Yorkshire"]
["YOC357F/000A/098A","Minor Capital Scheme Support Year 20/21  (Assumed Min 100% PF Score)","Yorkshire","Yorkshire"]
["YOC357F/000A/099A","Minor Capital Scheme Support Year 21/22  (Assumed Min 100% PF Score)","Yorkshire","Yorkshire"]
["YOC357F/000A/100A","Minor Capital Scheme Support Year 22/23  (Assumed Min 100% PF Score)","Yorkshire","Yorkshire"]
["YOC357F/000A/101A","Minor Capital Scheme Support Year 23/24  (Assumed Min 100% PF Score)","Yorkshire","Yorkshire"]
["YOC357F/000A/106A","Patrington Haven Flood Alleviation Scheme","Yorkshire","Yorkshire"]
["YOC356E/000A/098A","Old Goole Infill of low spot","Yorkshire","Yorkshire"]
["YOC353E/000A/053A","Catterick Gravel Removal","Yorkshire","Yorkshire"]
["YOC353E/000A/055A","Cawood Foreshore Erosion","Yorkshire","Yorkshire"]
["YOC353F/001A/036A","Works arising from River Foss Flood Risk Management Strategy","Yorkshire","Yorkshire"]
["YOC353E/000A/085A","York Flood Gates Maintenance","Yorkshire","Yorkshire"]
["YOC356E/000A/048A","Sheaf Catchment Flood Alleviation Scheme","Yorkshire","Yorkshire"]
["YOC356E/000A/049A","Upper Blackburn Brook Flood Alleviation Scheme","Yorkshire","Yorkshire"]
["YOC355F/000A/091A","Cragg Road Culvert Improvements","Yorkshire","Yorkshire"]
["YOC355F/000A/098A","London Road, Mankinholes","Yorkshire","Yorkshire"]
["YOC355F/000A/108A","Stoodley Grange/Lee Bottom Road","Yorkshire","Yorkshire"]
["YOC355F/000A/076A","Radulf Gardens Flood Alleviation Scheme","Yorkshire","Yorkshire"]
["YOC354E/000A/046A","Lowther Penstock / Outfall replacement & barrier bank Refurbishment","Yorkshire","Yorkshire"]
["YOC354F/000A/006A","Wyke Beck Improvements, Leeds","Yorkshire","Yorkshire"]
["YOC356E/000A/141A","Chantry's Cottages, Dutch River Urgent Works","Yorkshire","Yorkshire"]
["YOC355E/000A/028A","Todmorden Flood Mitigation","Yorkshire","Yorkshire"]
["YOC357E/000A/063A","Downstream Paull - Thorngumbald Clough [SoN]","Yorkshire","Yorkshire"]
["YOC351E/000A/014A","Scarborough Church Beck Culvert Improvements","Yorkshire","Yorkshire"]
["YOC353E/000A/058A","Clifton Ings Barrier Bank","Yorkshire","Yorkshire"]
["YOC356E/000A/096A","Wheatley Park Bank Refurbishment \nMile Thorne to Arksey Bank Refurbishment","Yorkshire","Yorkshire"]
["YOC356E/000A/138A","Catcliffe Woodhouse Works","Yorkshire","Yorkshire"]
["YOC354F/000A/042A","Mickletown FAS, Leeds","Yorkshire","Yorkshire"]
["YOC353E/000A/098A","Clifton Ings Frontage ","Yorkshire","Yorkshire"]
["YOC356F/000A/098A","Castlegate Culvert Removal","Yorkshire","Yorkshire"]
["AES503E/006A/004A","IFDMS: Tidal Barrier","Essex Norfolk and Suffolk",null,"NCPMS","Project Bank Account",null,null,null,null,null,null,null,null,null,null,null,null,null,null,null,null,null,null,null,null,null,null,null,null,null,null,null,null,null,"Project bank account to be used  on project",null,null,null,null,null,null,null,null,null,null,null,null,null,null,null,null,null,null,null,null,null,null,null,null,null,null,null,null,null,420317.30817919999,null,null,null,null,null,null,null,null,null,null,null,null,null,null,null,null,null,null,null,null,null,null,null,null,null,null,null,null,null,0]
["ACC451E/000A/016A","Ouse Washes Habitat Creation","Cambs and Bedfordshire","Anglian Central","NCPMS","Farm business tenancies prepared by external solicitors. ",null,null,null,null,null,null,null,null,null,null,null,null,null,null,null,null,null,null,null,null,null,null,null,null,null,null,null,null,null,"Farm business tenancies prepared by internal solicitors. ",null,null,null,null,null,null,null,null,null,null,null,null,null,null,null,null,null,null,null,null,null,null,null,null,null,null,null,null,null,9460,null,null,null,null,null,null,null,null,null,null,null,null,null,null,null,null,null,null,null,null,null,null,null,null,null,null,null,null,null,0]
["AEC505E/000A/006A","Steeple Bumpstead FRMS","Cambs and Bedfordshire",null,"NCPMS","EA to pay for necessary road closures "," EA to pay for replacement of street light"," Undertake service diversions required to complete the scheme",null,null,null,null,null,null,null,null,null,null,null,null,null,null,null,null,null,null,null,null,null,null,null,null,null,null,null,"EA to pursue cost reimbursement from Essex County Council for road closure fees at Church St."," EA to propose opportunity to Essex County Council for them to replace and pay for street light."," Contractor working closely with STATS companies to provide proposals for more efficient alternative diversions.",null,null,null,null,null,null,null,null,null,null,null,null,null,null,null,null,null,null,null,null,null,null,null,null,null,null,null,995,500,10000,null,null,null,null,null,null,null,null,null,null,null,null,null,null,null,null,null,null,null,null,null,null,null,null,null,null,null,0," "," "]
["AEO000E/000A/146A","Botany Marshes Habitat Creation","Essex Norfolk and Suffolk",null,"NCPMS","Reed planting at one seedling per square metre. Assumed cost £1 per m2.",null,null,null,null,null,null,null,null,null,null,null,null,null,null,null,null,null,null,null,null,null,null,null,null,null,null,null,null,null,"The RSPB have soucred reed seed and supplied peat to a local prison who using their greenhouse facilities have grown reed plugs ready for planting out on site. The prisoners have also planted the reed plugs.  7000 plugs are being grown and planted in 2013-14 and a similar number next year. Savings of 50p per seedling.",null,null,null,null,null,null,null,null,null,null,null,null,null,null,null,null,null,null,null,null,null,null,null,null,null,null,null,null,null,7000,null,null,null,null,null,null,null,null,null,null,null,null,null,null,null,null,null,null,null,null,null,null,null,null,null,null,null,null,null,0]
["ANC405E/000A/048A","Reservoirs: Whittlesey Washes PMF Works","Lincs and Northants",null,"NCPMS","Year 1 works",null,null,null,null,null,null,null,null,null,null,null,null,null,null,null,null,null,null,null,null,null,null,null,null,null,null,null,null,null,"Value engineering exercise to investigate possibility of increasing slope gradient to reduce imported material while still keeping grass/ reinforced grass cover"," Investigate using Highways Agency framework for unit rate efficiencies. Also consider  recycled materials from alternative suppliers river Nene dredgings and Partner's stockpile. ",null,null,null,null,null,null,null,null,null,null,null,null,null,null,null,null,null,null,null,null,null,null,null,null,null,null,null,null,590000,525000,null,null,null,null,null,null,null,null,null,null,null,null,null,null,null,null,null,null,null,null,null,null,null,null,null,null,null,null,171162,0]
["AES503E/006A/004B","IFDMS: Cable Diversion","Essex Norfolk and Suffolk",null,"NCPMS","Construct tunnel and shafts in accordance with UKPN standard requirements set out in their design guidance manual for cable tunnels. One of the requirements is for 4 hour fire resistance."," Originally there was no plan to seek a betterment contribution from UKPN (formerly EDF Energy). "," UKPN would be due payment of a commuted sum to cover future O&M and decommissioning costs for the new diversion works they would be adopting."," MEICA element for cable tunnel and shafts to be constructed to UKPN's specification.",null,null,null,null,null,null,null,null,null,null,null,null,null,null,null,null,null,null,null,null,null,null,null,null,null,null,"Challenge UKPN's standard requirement of 4 hour fire resistance."," Seek betterment contributions from UKPN for walk through cable tunnel and diversion "," Link the calculation of O&M and decommissioning commuted sums into the same calculator as that for the betterment commuted sum to discourage UKPN from lowering the discount factor and increasing the commuted sums payable to them."," Develop specification to offer UKPN the same performance and quality at a reduced cost.",null,null,null,null,null,null,null,null,null,null,null,null,null,null,null,null,null,null,null,null,null,null,null,null,null,null,300000,1005000,56300,140260,null,null,null,null,null,null,null,null,null,null,null,null,null,null,null,null,null,null,null,null,null,null,null,null,null,null,0," "," "," "]
["ACO000E/000A/085C","Cut-Off Channel Track Bridges","Cambs and Bedfordshire",null,"NCPMS","Procurement strategy for post-PAR stage to be traditional Design then Build",null,null,null,null,null,null,null,null,null,null,null,null,null,null,null,null,null,null,null,null,null,null,null,null,null,null,null,null,null,"Following start up of WEM procurement strategy amended to Design & Build option",null,null,null,null,null,null,null,null,null,null,null,null,null,null,null,null,null,null,null,null,null,null,null,null,null,null,null,null,null,236000,null,null,null,null,null,null,null,null,null,null,null,null,null,null,null,null,null,null,null,null,null,null,null,null,null,null,null,null,null,0]
["AES502E/002A/002B","Great Yarmouth Tidal defences 2013 - 2016","Essex Norfolk and Suffolk",null,"NCPMS","Pile along the existing quay wall alignment or just in front line as per the tendered contract which requires a temporary works cofferdam along the entire frontage and the extraction of all the existing piles."," Ground anchor at every in-pan"," Phase 1B and P2 Pay the principal contractor in the normal way direct the their bank account and subcontractors would then be paid through the contractors normal payment process. (2014/15)"," Hire in all plant and machinery as required form specialist hire companies. "," Set up isolated site compound on disused site without its own security infrastructure."," A - Award phase 1B& 2 Lot 4 D&B contract  based on tendered price (error checked) with out any adjustments. ",null,null,null,null,null,null,null,null,null,null,null,null,null,null,null,null,null,null,null,null,null,null,null,null,"Agreement reached with Port Authority to adjust the alignment of the Phase 1 frontage which enables the construction of approximately 2/3 in advance of the existing pile line resulting in overall cost savings and reduced risk to the environment of releasing potentially contaminated ground. Efficiency based on budget estimate from contractor and is subject to confirmation."," 1 in 5 Ground Anchors have now been omitted from the design following detailed analysis of soil parameters since contract award. Value of efficiency cannot be confirmed until FY14/15 when final savings are known pending outcome of PM1 23 Value Engineering "," Utilise a Project bank account payment mechanism where by payment form the employer and is paid directly into a project bank account administered by the principle contractor. Following this payment funds are distributed directly to the PC and 2nd and 3rd tier suppliers signed up to the PBA. The cabinet office estimate efficiencies of between 1% and 4% will be realised form the use of the PBA. We are therefore claiming an efficiency of 2% of the construction spend in Phase 1B and Phase 2 - This is currently forecast as a percentage of the forecast construction spend per year that work these phases will be undertaken. Construction value is per current (Aug14 PPMT forecast expenditure £1775000) once we have a firm programme form the successful contractor we will refine the claim per quarter of the efficiency year."," Use of Interserve in house Plant and Machinery Department has reduced cost from open market place. Efficiency is on going and an assessment of the value is being undertaken."," Use of the Red7 secure compound has removed any need for specific Security Guarding."," Negotiated value savings on new Lot 4 DB contract for Phase 1B and 2 of the works. Savings of circa £1.1m achieved through a raft of measures. This efficiency line relates to a saving of £550k as a result of commercial negotiations resulting in the contractors review of risk and contingency allowances in there bid. This amount was reduced form there tendered price as an alterative offer and the contract has been awarded on this basis. In addition a further £50k was included in the contractor alternative offer relating the removal of other fees for there bid as a result of the commercial negotiations. Full details of these value savings and the process can be found into he CAR relating to this contract report which is available on request.",null,null,null,null,null,null,null,null,null,null,null,null,null,null,null,null,null,null,null,null,null,null,null,null,145000,200000,35500," TBA"," TBA",600000,null,null,null,null,null,null,null,null,null,null,null,null,null,null,null,null,null,null,null,null,null,null,null,null,0," "," "," "," "," "]
["ARW000E/000A/035A","Anglian Waterways Package 2013","Lincs and Northants",null,"NCPMS",0,null,null,null,null,null,null,null,null,null,null,null,null,null,null,null,null,null,null,null,null,null,null,null,null,null,null,null,null,null,0,null,null,null,null,null,null,null,null,null,null,null,null,null,null,null,null,null,null,null,null,null,null,null,null,null,null,null,null,null,0,null,null,null,null,null,null,null,null,null,null,null,null,null,null,null,null,null,null,null,null,null,null,null,null,null,null,null,null,null,0]
["ARW000E/000A/036A","Anglian Waterways Package 2013","Lincs and Northants",null,"NCPMS",0,null,null,null,null,null,null,null,null,null,null,null,null,null,null,null,null,null,null,null,null,null,null,null,null,null,null,null,null,null,0,null,null,null,null,null,null,null,null,null,null,null,null,null,null,null,null,null,null,null,null,null,null,null,null,null,null,null,null,null,0,null,null,null,null,null,null,null,null,null,null,null,null,null,null,null,null,null,null,null,null,null,null,null,null,null,null,null,null,null,0]
["ANC404E/000A/054A","WFD Fish and Eel Pass package","Lincs and Northants",null,"NCPMS","Belmesthorpe Fish and Eel Pass was design as a larinier fish pass. "," Tender documents for WEM  D&B Lot 4 - preparation"," Apprisal and design for individual sites"," Delivery of 4 sites under separate design and separate construction contracts",null,null,null,null,null,null,null,null,null,null,null,null,null,null,null,null,null,null,null,null,null,null,null,null,null,null,"The PM influenced the PB decision not to construct the larinier fish pass after learning lessons from Tallington Fish Pass. Different option had been proposed. Lessons were sought from Stoke on Trent fish pass and the Low Cost Baffles (LCB). By further simplifying  the design the project risks were reduced making it less complex and suitable for the Anglian and Midlands Minor Works Framework (AMMWF). The project team revised the procurement strategy closed the NCF2 contract and re-tendered through the AMMWF. Overall efficiency is  significant (construction cost of LCB is £46557 as oppose to £574000!). The programme has been reduced from 6 weeks to 3 weeks. ECC PM input is not required (costs saved: 2days/wk per 6wks £4456=(£49.51*7.5)*2*6                         "," The Fish Pass Package project team identified similarities in contract principles with the Recon approach. By working with the Recon team lessons have been shared. The document preparation took significantly less time (from 6months to 3 months) = saving of 3monthsx2days a week=£10k for Cost Consultant time "," Packaging work - a number of sites have been packaged together during PAR development and the Design. "," 4 sites will be delivered under ARPoW Packadge. ECC PM savings as we'll use the existing arrangements contract docs not required it will be scoped under ARPoW. Further efficiencies will be expected during the Delivery under D&B contract",null,null,null,null,null,null,null,null,null,null,null,null,null,null,null,null,null,null,null,null,null,null,null,null,null,null,522707,10000," ",40000,null,null,null,null,null,null,null,null,null,null,null,null,null,null,null,null,null,null,null,null,null,null,null,null,null,null,0," "," "," "]
["ANO000E/000A/509A","Eel Obstructions - Northern RFCC","Lincs and Northants",null,"NCPMS","Consultant Appraise options for Eel passage at each individual site and then produce an options report.",null,null,null,null,null,null,null,null,null,null,null,null,null,null,null,null,null,null,null,null,null,null,null,null,null,null,null,null,null,"ncpms have created Detailed Assesment Forms in which area teams provide basic information and outline there suggested options for each site. Consultant then appraises these suggested options and records there decision on the Design Decision Forms.",null,null,null,null,null,null,null,null,null,null,null,null,null,null,null,null,null,null,null,null,null,null,null,null,null,null,null,null,null,41272,null,null,null,null,null,null,null,null,null,null,null,null,null,null,null,null,null,null,null,null,null,null,null,null,null,null,null,null,null,0]
["ACO000E/000A/634A","Eel Obstructions - Central RFCC","Cambs and Bedfordshire",null,"NCPMS","Consultant Appraise options for Eel passage at each individual site and then produce an options report.",null,null,null,null,null,null,null,null,null,null,null,null,null,null,null,null,null,null,null,null,null,null,null,null,null,null,null,null,null,"ncpms have created Detailed Assesment Forms in which area teams provide basic information and outline there suggested options for each site. Consultant then appraises these suggested options and records there decision on the Design Decision Forms.",null,null,null,null,null,null,null,null,null,null,null,null,null,null,null,null,null,null,null,null,null,null,null,null,null,null,null,null,null,10318,null,null,null,null,null,null,null,null,null,null,null,null,null,null,null,null,null,null,null,null,null,null,null,null,null,null,null,null,null,0]
["AEO000E/000A/636A","Eel Obstructions - Eastern RFCC","Essex Norfolk and Suffolk",null,"NCPMS","Consultant Appraise options for Eel passage at each individual site and then produce an options report.",null,null,null,null,null,null,null,null,null,null,null,null,null,null,null,null,null,null,null,null,null,null,null,null,null,null,null,null,null,"ncpms have created Detailed Assesment Forms in which area teams provide basic information and outline there suggested options for each site. Consultant then appraises these suggested options and records there decision on the Design Decision Forms.",null,null,null,null,null,null,null,null,null,null,null,null,null,null,null,null,null,null,null,null,null,null,null,null,null,null,null,null,null,10318,null,null,null,null,null,null,null,null,null,null,null,null,null,null,null,null,null,null,null,null,null,null,null,null,null,null,null,null,null,0]