{"text_format":"1","workbook":"xlsx","n_sheets":13,"sheets":["Control","Inert Restorati","Contaminants","Hydrogeology","Attenuation","WaterBalance","Pathways","Simulation","Audit","User_Water_Balance","User_Attenuation_Parameters","User_ScreeningAssessment_VoidC","Groundwater"],"not_rendered":{"charts":0,"images":3,"macros":1,"external_links":1,"defined_names":16717,"comments":1,"pivot_tables":0},"unopened":[],"bounds":{"document_bytes":16777216,"sheet_cells":100000,"rows_first":2000,"rows_last":500,"rows_between":2000,"halvings":0,"cell_chars":16384,"cell_head_chars":4096},"cells_cut":0,"cells_raw":0,"read":"whole","date_system":"1900"}

{"sheet":"Control","index":0,"n_rows":34,"n_cols":3,"rows_kept":34,"cut":false,"hidden":false,"merged":[]}
[]
[]
[]
[]
[]
[]
[]
[]
[]
[]
[]
[]
[]
[]
[]
[]
[]
[]
[]
[]
[]
[]
[]
[]
[]
[]
[]
[]
[]
[null,null,"Numerical value"]
[null,null,"Suggested formula"]
[null,null,"Probabilistic parameters"]
[null,null,"Data specified elsewhere"]
[null,null,"Suggested formula edited"]

{"sheet":"Inert Restorati","index":1,"n_rows":131,"n_cols":10,"rows_kept":131,"cut":false,"hidden":true,"merged":[]}
["SOURCE CONCENTRATIONS: Inert Restorati"]
[]
["Source Data Options","Source Type"]
[]
[]
[]
[]
[]
[]
[]
["Target Standard"]
[]
["Select which Quality Standard (defined on the Contaminants sheet) to apply"]
["Not Specified"]
[]
[]
["Source Geometry"]
[]
["Inert_Restorati_Source_length",null,"m"]
["Inert_Restorati_Source_width",null,"m"]
["Inert_Restorati_Source_area",{"$f":"area_c","v":149545},"m2"]
["Inert_Restorati_Source_thickness",{"$f":"thick_c","v":5.4300000000000068},"m"]
["Inert_Restorati_Source_volume",{"$f":"vol_c","v":322827.98760536074},"m3"]
[]
[]
["General Source Properties"]
[]
["Inert_Restorati_Source_field_capacity","[-]",0.3]
["Distribution",null,"constant"]
["Inert_Restorati_Source_field_capacity_param1"]
["Inert_Restorati_Source_field_capacity_param2"]
["Inert_Restorati_Source_field_capacity_param3"]
[]
[]
["Inert_Restorati_Source_porosity_total","[-]"]
["Distribution",null,"constant"]
["Inert_Restorati_Source_porosity_total_param1"]
["Inert_Restorati_Source_porosity_total_param2"]
["Inert_Restorati_Source_porosity_total_param3"]
[]
[]
["Inert_Restorati_Source_porosity_water_filled","[-]"]
["Distribution",null,"constant"]
["Inert_Restorati_Source_porosity_water_filled_param1"]
["Inert_Restorati_Source_porosity_water_filled_param2"]
["Inert_Restorati_Source_porosity_water_filled_param3"]
[]
[]
["Inert_Restorati_Source_porosity_air_filled","[-]",{"$f":" Inert_Restorati_Source_porosity_total - Inert_Restorati_Source_porosity_water_filled","v":0}]
["Distribution",null,"constant"]
["Inert_Restorati_Source_porosity_air_filled_param1"]
["Inert_Restorati_Source_porosity_air_filled_param2"]
["Inert_Restorati_Source_porosity_air_filled_param3"]
[]
[]
["Inert_Restorati_Source_dry_bulk_density","kg/m3"]
["Distribution",null,"constant"]
["Inert_Restorati_Source_dry_bulk_density_param1"]
["Inert_Restorati_Source_dry_bulk_density_param2"]
["Inert_Restorati_Source_dry_bulk_density_param3"]
[]
[]
["Inert_Restorati_Source_fraction_organic_carbon","[-]"]
["Distribution",null,"constant"]
["Inert_Restorati_Source_fraction_organic_carbon_param1"]
["Inert_Restorati_Source_fraction_organic_carbon_param2"]
["Inert_Restorati_Source_fraction_organic_carbon_param3"]
[]
[]
[]
["Source Contaminant Information"]
[]
["Source determinand names",null,{"$f":" IF( ISTEXT( (Contaminants_Source_determinand_names Contaminants_Species1)), (Contaminants_Source_determinand_names Contaminants_Species1), \"Undefined\" )","v":"Arsenic"},{"$f":" IF( ISTEXT( (Contaminants_Source_determinand_names Contaminants_Species2)), (Contaminants_Source_determinand_names Contaminants_Species2), \"Undefined\" )","v":"Cadmium"},{"$f":" IF( ISTEXT( (Contaminants_Source_determinand_names Contaminants_Species3)), (Contaminants_Source_determinand_names Contaminants_Species3), \"Undefined\" )","v":"Chromium"},{"$f":" IF( ISTEXT( (Contaminants_Source_determinand_names Contaminants_Species4)), (Contaminants_Source_determinand_names Contaminants_Species4), \"Undefined\" )","v":"Copper"},{"$f":" IF( ISTEXT( (Contaminants_Source_determinand_names Contaminants_Species5)), (Contaminants_Source_determinand_names Contaminants_Species5), \"Undefined\" )","v":"Mercury"},{"$f":" IF( ISTEXT( (Contaminants_Source_determinand_names Contaminants_Species6)), (Contaminants_Source_determinand_names Contaminants_Species6), \"Undefined\" )","v":"Molybdenum"},{"$f":" IF( ISTEXT( (Contaminants_Source_determinand_names Contaminants_Species7)), (Contaminants_Source_determinand_names Contaminants_Species7), \"Undefined\" )","v":"Lead"},{"$f":" IF( ISTEXT( (Contaminants_Source_determinand_names Contaminants_Species8)), (Contaminants_Source_determinand_names Contaminants_Species8), \"Undefined\" )","v":"Antimony"}]
[]
["Inert_Restorati_Pore_water_concentration","mg/L",0.06,0.02,0.1,0.6,2E-3,0.2,0.15,0.1]
["Distribution",null,"constant","constant","constant","constant","constant","constant","constant","constant"]
["Inert_Restorati_Pore_water_concentration_param1"]
["Inert_Restorati_Pore_water_concentration_param2"]
["Inert_Restorati_Pore_water_concentration_param3"]
[]
[]
["Inert_Restorati_Leaching_test_concentration","mg/L"]
["Distribution",null,"constant","constant","constant","constant","constant","constant","constant","constant"]
["Inert_Restorati_Leaching_test_concentration_param1"]
["Inert_Restorati_Leaching_test_concentration_param2"]
["Inert_Restorati_Leaching_test_concentration_param3"]
[]
[]
["Inert_Restorati_Soil_contaminant_concentration","mg/kg",1,0.1]
["Distribution",null,"constant","constant","constant","constant","constant","constant","constant","constant"]
["Inert_Restorati_Soil_contaminant_concentration_param1"]
["Inert_Restorati_Soil_contaminant_concentration_param2"]
["Inert_Restorati_Soil_contaminant_concentration_param3"]
[]
[]
["Inert_Restorati_Source_solid_water_partitioning_coefficient_Kd","L/kg",{"$f":" (Contaminants_Organic_Carbon_Water_Partition_Coefficient_Koc  Contaminants_Species1) * ( Inert_Restorati_Source_fraction_organic_carbon)","v":0},{"$f":" (Contaminants_Organic_Carbon_Water_Partition_Coefficient_Koc  Contaminants_Species2) * ( Inert_Restorati_Source_fraction_organic_carbon)","v":0},{"$f":" (Contaminants_Organic_Carbon_Water_Partition_Coefficient_Koc  Contaminants_Species3) * ( Inert_Restorati_Source_fraction_organic_carbon)","v":0},{"$f":" (Contaminants_Organic_Carbon_Water_Partition_Coefficient_Koc  Contaminants_Species4) * ( Inert_Restorati_Source_fraction_organic_carbon)","v":0},{"$f":" (Contaminants_Organic_Carbon_Water_Partition_Coefficient_Koc  Contaminants_Species5) * ( Inert_Restorati_Source_fraction_organic_carbon)","v":0},{"$f":" (Contaminants_Organic_Carbon_Water_Partition_Coefficient_Koc  Contaminants_Species6) * ( Inert_Restorati_Source_fraction_organic_carbon)","v":0},{"$f":" (Contaminants_Organic_Carbon_Water_Partition_Coefficient_Koc  Contaminants_Species7) * ( Inert_Restorati_Source_fraction_organic_carbon)","v":0},{"$f":" (Contaminants_Organic_Carbon_Water_Partition_Coefficient_Koc  Contaminants_Species8) * ( Inert_Restorati_Source_fraction_organic_carbon)","v":0}]
["Distribution",null,"constant","constant","constant","constant","constant","constant","constant","constant"]
["Inert_Restorati_Source_solid_water_partitioning_coefficient_Kd_param1"]
["Inert_Restorati_Source_solid_water_partitioning_coefficient_Kd_param2"]
["Inert_Restorati_Source_solid_water_partitioning_coefficient_Kd_param3"]
[]
[]
["Inert_Restorati_Initial_inventory","kg",{"$f":" 0.001 * (Inert_Restorati_Pore_water_concentration) * (Inert_Restorati_Source_field_capacity) * (Inert_Restorati_Source_volume)","v":5.8109037768964935},1.9369679256321646,9.6848396281608231,58.109037768964932,0.19369679256321642,19.369679256321646,14.527259442241233,9.6848396281608231]
["Distribution",null,"constant","constant","constant","constant","constant","constant","constant","constant"]
["Inert_Restorati_Initial_inventory_param1"]
["Inert_Restorati_Initial_inventory_param2"]
["Inert_Restorati_Initial_inventory_param3"]
[]
[]
["Inert_Restorati_Kappa_slope_value_m","kg/L"]
["Distribution",null,"constant","constant","constant","constant","constant","constant","constant","constant"]
["Inert_Restorati_Kappa_slope_value_m_param1"]
["Inert_Restorati_Kappa_slope_value_m_param2"]
["Inert_Restorati_Kappa_slope_value_m_param3"]
[]
[]
["Inert_Restorati_Kappa_intercept_value_c","kg/L"]
["Distribution",null,"constant","constant","constant","constant","constant","constant","constant","constant"]
["Inert_Restorati_Kappa_intercept_value_c_param1"]
["Inert_Restorati_Kappa_intercept_value_c_param2"]
["Inert_Restorati_Kappa_intercept_value_c_param3"]
[]
[]
["Inert_Restorati_Kappa_Value","kg/L",{"$f":" IF(AND(ISNUMBER(Inert_Restorati_Kappa_slope_value_m),ISNUMBER(Inert_Restorati_Kappa_intercept_value_c),ISNUMBER(Inert_Restorati_Input_concentration)), IF(Inert_Restorati_Input_concentration>0,MAX(0,Inert_Restorati_Kappa_slope_value_m * LN(1000 * Inert_Restorati_Input_concentration) + Inert_Restorati_Kappa_intercept_value_c),\"\"),\"Not-used\")","v":"Not-used"},"Not-used","Not-used","Not-used","Not-used","Not-used","Not-used","Not-used"]
["Distribution",null,"constant","constant","constant","constant","constant","constant","constant","constant"]
["Inert_Restorati_Kappa_Value_param1"]
["Inert_Restorati_Kappa_Value_param2"]
["Inert_Restorati_Kappa_Value_param3"]
[]
[]
["Inert_Restorati_Input_concentration","mg/L",{"$f":" (Inert_Restorati_Pore_water_concentration)","v":0.06},0.02,0.1,0.6,2E-3,0.2,0.15,0.1]

{"sheet":"Contaminants","index":2,"n_rows":42,"n_cols":11,"rows_kept":42,"cut":false,"hidden":false,"merged":[]}
["CONTAMINANT INFORMATION"]
[]
[null,null,null,"Species1","Species2","Species3","Species4","Species5","Species6","Species7","Species8"]
["Source determinand names",null,1,"Arsenic","Cadmium","Chromium","Copper","Mercury","Molybdenum","Lead","Antimony"]
[]
[]
["Receptor Target Concentrations"]
[null,"Name",null,"Values in mg/L"]
["Quality Standard 1  ","EAL (GW)",null,{"$f":"User_ScreeningAssessment_VoidC!G3","v":1.1999999999999999E-3},{"$f":"User_ScreeningAssessment_VoidC!G5","v":1.9599999999999994E-4},{"$f":"User_ScreeningAssessment_VoidC!G6","v":1E-3},{"$f":"User_ScreeningAssessment_VoidC!G7","v":5.0599999999999994E-3},{"$f":"User_ScreeningAssessment_VoidC!G8","v":2.0000000000000002E-5},{"$f":"User_ScreeningAssessment_VoidC!G9","v":2E-3},{"$f":"User_ScreeningAssessment_VoidC!G11","v":2.0000000000000001E-4},{"$f":"User_ScreeningAssessment_VoidC!G12","v":5.0000000000000001E-4}]
["Quality Standard 2  "]
["Quality Standard 3  "]
["Quality Standard 4  "]
[null,"Not Specified"]
[]
["Generic Contaminant Properties"]
[]
["Contaminants_Solubility","mg/L"]
["Distribution",null,null,"constant","constant","constant","constant","constant","constant","constant","constant"]
["Contaminants_Solubility_param1"]
["Contaminants_Solubility_param2"]
["Contaminants_Solubility_param3"]
[]
[]
["Contaminants_Henrys_Law_Constant","[-]"]
["Distribution",null,null,"constant","constant","constant","constant","constant","constant","constant","constant"]
["Contaminants_Henrys_Law_Constant_param1"]
["Contaminants_Henrys_Law_Constant_param2"]
["Contaminants_Henrys_Law_Constant_param3"]
[]
[]
["Contaminants_Organic_Carbon_Water_Partition_Coefficient_Koc","L/kg"]
["Distribution",null,null,"constant","constant","constant","constant","constant","constant","constant","constant"]
["Contaminants_Organic_Carbon_Water_Partition_Coefficient_Koc_param1"]
["Contaminants_Organic_Carbon_Water_Partition_Coefficient_Koc_param2"]
["Contaminants_Organic_Carbon_Water_Partition_Coefficient_Koc_param3"]
[]
[]
["Contaminants_Free_Water_Diffusion_Coefficient","m2/s",null,{"$f":"Free_Water_Diffusion_Coefficient","v":2.0000000000000001E-9},2.0000000000000001E-9,2.0000000000000001E-9,2.0000000000000001E-9,2.0000000000000001E-9,2.0000000000000001E-9,2.0000000000000001E-9,2.0000000000000001E-9]
["Distribution",null,null,"constant","constant","constant","constant","constant","constant","constant","constant"]
["Contaminants_Free_Water_Diffusion_Coefficient_param1"]
["Contaminants_Free_Water_Diffusion_Coefficient_param2"]
["Contaminants_Free_Water_Diffusion_Coefficient_param3"]

{"sheet":"Hydrogeology","index":3,"n_rows":58,"n_cols":18,"rows_kept":58,"cut":false,"hidden":false,"merged":[]}
["HYDROGEOLOGICAL UNITS"]
[]
["Hydrogeological Units",null,"Attenuation Lay","Beenham Grange "]
[]
["Hydrogeology_Unit_Thickness","m",1,{"$f":"thick_c","v":5.4300000000000068}]
["Distribution",null,"constant","constant","constant","constant","constant","constant","constant","constant","constant","constant","constant","constant","constant","constant","constant","constant"]
["Hydrogeology_Unit_Thickness_param1"]
["Hydrogeology_Unit_Thickness_param2"]
["Hydrogeology_Unit_Thickness_param3"]
[]
[]
["Hydrogeology_Log_Hydraulic_Conductivity","log(m/s)"]
["Distribution",null,"constant","constant","constant","constant","constant","constant","constant","constant","constant","constant","constant","constant","constant","constant","constant","constant"]
["Hydrogeology_Log_Hydraulic_Conductivity_param1"]
["Hydrogeology_Log_Hydraulic_Conductivity_param2"]
["Hydrogeology_Log_Hydraulic_Conductivity_param3"]
[]
[]
["Hydrogeology_Hydraulic_Conductivity","m/s",{"$f":"AL_K","v":9.9999999999999995E-8},{"$f":"BGF_K","v":1.4120000000000001E-3},{"$f":" POWER(10, (Hydrogeology_Log_Hydraulic_Conductivity))","v":1},1,1,1,1,1,1,1,1,1,1,1,1,1]
["Distribution",null,"constant","constant","constant","constant","constant","constant","constant","constant","constant","constant","constant","constant","constant","constant","constant","constant"]
["Hydrogeology_Hydraulic_Conductivity_param1"]
["Hydrogeology_Hydraulic_Conductivity_param2"]
["Hydrogeology_Hydraulic_Conductivity_param3"]
[]
[]
["Hydrogeology_Head","m"]
["Distribution",null,"constant","constant","constant","constant","constant","constant","constant","constant","constant","constant","constant","constant","constant","constant","constant","constant"]
["Hydrogeology_Head_param1"]
["Hydrogeology_Head_param2"]
["Hydrogeology_Head_param3"]
[]
[]
["Hydrogeology_Hydraulic_Gradient","[-]",{"$f":"AL_i","v":2.4058823529411785E-2},{"$f":"BGF_hydraulic_gradient","v":3.0000000000000001E-3}]
["Distribution",null,"constant","constant","constant","constant","constant","constant","constant","constant","constant","constant","constant","constant","constant","constant","constant","constant"]
["Hydrogeology_Hydraulic_Gradient_param1"]
["Hydrogeology_Hydraulic_Gradient_param2"]
["Hydrogeology_Hydraulic_Gradient_param3"]
[]
[]
["Hydrogeology_Porosity","[-]",{"$f":"AL_porosity","v":0.05},{"$f":"BGF_porosity","v":0.2}]
["Distribution",null,"constant","constant","constant","constant","constant","constant","constant","constant","constant","constant","constant","constant","constant","constant","constant","constant"]
["Hydrogeology_Porosity_param1"]
["Hydrogeology_Porosity_param2"]
["Hydrogeology_Porosity_param3"]
[]
[]
["Hydrogeology_Velocity","m/s",{"$f":" (Hydrogeology_Hydraulic_Conductivity) * (Hydrogeology_Hydraulic_Gradient) / (Hydrogeology_Porosity)","v":4.8117647058823564E-8},2.1180000000000001E-5,{"$error":"#DIV/0!"},{"$error":"#DIV/0!"},{"$error":"#DIV/0!"},{"$error":"#DIV/0!"},{"$error":"#DIV/0!"},{"$error":"#DIV/0!"},{"$error":"#DIV/0!"},{"$error":"#DIV/0!"},{"$error":"#DIV/0!"},{"$error":"#DIV/0!"},{"$error":"#DIV/0!"},{"$error":"#DIV/0!"},{"$error":"#DIV/0!"},{"$error":"#DIV/0!"}]
["Distribution",null,"constant","constant","constant","constant","constant","constant","constant","constant","constant","constant","constant","constant","constant","constant","constant","constant"]
["Hydrogeology_Velocity_param1"]
["Hydrogeology_Velocity_param2"]
["Hydrogeology_Velocity_param3"]
[]
[]
["Hydrogeology_Tortuosity","[-]",{"$f":"Tortuosity","v":5},{"$f":"Tortuosity","v":5}]
["Distribution",null,"constant","constant","constant","constant","constant","constant","constant","constant","constant","constant","constant","constant","constant","constant","constant","constant"]
["Hydrogeology_Tortuosity_param1"]
["Hydrogeology_Tortuosity_param2"]
["Hydrogeology_Tortuosity_param3"]

{"sheet":"Attenuation","index":4,"n_rows":261,"n_cols":18,"rows_kept":261,"cut":false,"hidden":false,"merged":[]}
["ATTENUATION PARAMETERS"]
[]
["Hydrogeological Units",null,"Attenuation Lay","Beenham Grange "]
[]
["General properties"]
[]
["Attenuation_Dry_bulk_density","kg/m3",{"$f":"Attenuation_Layer_Bulk_Density","v":2000},{"$f":"Beenham_Grange_Formation_Bulk_Density","v":1600}]
["Distribution",null,"constant","constant","constant","constant","constant","constant","constant","constant","constant","constant","constant","constant","constant","constant","constant","constant"]
["Attenuation_Dry_bulk_density_param1"]
["Attenuation_Dry_bulk_density_param2"]
["Attenuation_Dry_bulk_density_param3"]
[]
[]
["Attenuation_Fraction_organic_carbon","[-]"]
["Distribution",null,"constant","constant","constant","constant","constant","constant","constant","constant","constant","constant","constant","constant","constant","constant","constant","constant"]
["Attenuation_Fraction_organic_carbon_param1"]
["Attenuation_Fraction_organic_carbon_param2"]
["Attenuation_Fraction_organic_carbon_param3"]
[]
[]
[]
["Contaminant specific parameters"]
[]
[{"$f":" IF((Contaminants_Source_determinand_names   Contaminants_Species1)=0,\"Undefined\",(Contaminants_Source_determinand_names   Contaminants_Species1))","v":"Arsenic"}]
[]
["Attenuation_Partition_Coefficient_Kd_Species_1","L/kg",{"$f":"AL_Kd_As","v":137},{"$f":"BGF_Kd_As","v":25},{"$f":" (Attenuation_Fraction_organic_carbon) * (Contaminants_Organic_Carbon_Water_Partition_Coefficient_Koc  Contaminants_Species1)","v":0},{"$f":" (Attenuation_Fraction_organic_carbon) * (Contaminants_Organic_Carbon_Water_Partition_Coefficient_Koc  Contaminants_Species1)","v":0},{"$f":" (Attenuation_Fraction_organic_carbon) * (Contaminants_Organic_Carbon_Water_Partition_Coefficient_Koc  Contaminants_Species1)","v":0},{"$f":" (Attenuation_Fraction_organic_carbon) * (Contaminants_Organic_Carbon_Water_Partition_Coefficient_Koc  Contaminants_Species1)","v":0},{"$f":" (Attenuation_Fraction_organic_carbon) * (Contaminants_Organic_Carbon_Water_Partition_Coefficient_Koc  Contaminants_Species1)","v":0},{"$f":" (Attenuation_Fraction_organic_carbon) * (Contaminants_Organic_Carbon_Water_Partition_Coefficient_Koc  Contaminants_Species1)","v":0},{"$f":" (Attenuation_Fraction_organic_carbon) * (Contaminants_Organic_Carbon_Water_Partition_Coefficient_Koc  Contaminants_Species1)","v":0},{"$f":" (Attenuation_Fraction_organic_carbon) * (Contaminants_Organic_Carbon_Water_Partition_Coefficient_Koc  Contaminants_Species1)","v":0},{"$f":" (Attenuation_Fraction_organic_carbon) * (Contaminants_Organic_Carbon_Water_Partition_Coefficient_Koc  Contaminants_Species1)","v":0},{"$f":" (Attenuation_Fraction_organic_carbon) * (Contaminants_Organic_Carbon_Water_Partition_Coefficient_Koc  Contaminants_Species1)","v":0},{"$f":" (Attenuation_Fraction_organic_carbon) * (Contaminants_Organic_Carbon_Water_Partition_Coefficient_Koc  Contaminants_Species1)","v":0},{"$f":" (Attenuation_Fraction_organic_carbon) * (Contaminants_Organic_Carbon_Water_Partition_Coefficient_Koc  Contaminants_Species1)","v":0},{"$f":" (Attenuation_Fraction_organic_carbon) * (Contaminants_Organic_Carbon_Water_Partition_Coefficient_Koc  Contaminants_Species1)","v":0},{"$f":" (Attenuation_Fraction_organic_carbon) * (Contaminants_Organic_Carbon_Water_Partition_Coefficient_Koc  Contaminants_Species1)","v":0}]
["Distribution",null,"constant","constant","constant","constant","constant","constant","constant","constant","constant","constant","constant","constant","constant","constant","constant","constant"]
["Attenuation_Partition_Coefficient_Kd_Species_1_param1"]
["Attenuation_Partition_Coefficient_Kd_Species_1_param2"]
["Attenuation_Partition_Coefficient_Kd_Species_1_param3"]
[]
[]
["Attenuation_Retardation_Species_1","[-]",{"$f":" 1 + 0.001 * (Attenuation_Partition_Coefficient_Kd_Species_1) * (Attenuation_Dry_bulk_density) / (Hydrogeology_Porosity    Hydrogeology!$C:$C)","v":5481},{"$f":" 1 + 0.001 * (Attenuation_Partition_Coefficient_Kd_Species_1) * (Attenuation_Dry_bulk_density) / (Hydrogeology_Porosity    Hydrogeology!$D:$D)","v":201},{"$f":" 1 + 0.001 * (Attenuation_Partition_Coefficient_Kd_Species_1) * (Attenuation_Dry_bulk_density) / (Hydrogeology_Porosity    Hydrogeology!$E:$E)","v":{"$error":"#DIV/0!"}},{"$f":" 1 + 0.001 * (Attenuation_Partition_Coefficient_Kd_Species_1) * (Attenuation_Dry_bulk_density) / (Hydrogeology_Porosity    Hydrogeology!$F:$F)","v":{"$error":"#DIV/0!"}},{"$f":" 1 + 0.001 * (Attenuation_Partition_Coefficient_Kd_Species_1) * (Attenuation_Dry_bulk_density) / (Hydrogeology_Porosity    Hydrogeology!$G:$G)","v":{"$error":"#DIV/0!"}},{"$f":" 1 + 0.001 * (Attenuation_Partition_Coefficient_Kd_Species_1) * (Attenuation_Dry_bulk_density) / (Hydrogeology_Porosity    Hydrogeology!$H:$H)","v":{"$error":"#DIV/0!"}},{"$f":" 1 + 0.001 * (Attenuation_Partition_Coefficient_Kd_Species_1) * (Attenuation_Dry_bulk_density) / (Hydrogeology_Porosity    Hydrogeology!$I:$I)","v":{"$error":"#DIV/0!"}},{"$f":" 1 + 0.001 * (Attenuation_Partition_Coefficient_Kd_Species_1) * (Attenuation_Dry_bulk_density) / (Hydrogeology_Porosity    Hydrogeology!$J:$J)","v":{"$error":"#DIV/0!"}},{"$f":" 1 + 0.001 * (Attenuation_Partition_Coefficient_Kd_Species_1) * (Attenuation_Dry_bulk_density) / (Hydrogeology_Porosity    Hydrogeology!$K:$K)","v":{"$error":"#DIV/0!"}},{"$f":" 1 + 0.001 * (Attenuation_Partition_Coefficient_Kd_Species_1) * (Attenuation_Dry_bulk_density) / (Hydrogeology_Porosity    Hydrogeology!$L:$L)","v":{"$error":"#DIV/0!"}},{"$f":" 1 + 0.001 * (Attenuation_Partition_Coefficient_Kd_Species_1) * (Attenuation_Dry_bulk_density) / (Hydrogeology_Porosity    Hydrogeology!$M:$M)","v":{"$error":"#DIV/0!"}},{"$f":" 1 + 0.001 * (Attenuation_Partition_Coefficient_Kd_Species_1) * (Attenuation_Dry_bulk_density) / (Hydrogeology_Porosity    Hydrogeology!$N:$N)","v":{"$error":"#DIV/0!"}},{"$f":" 1 + 0.001 * (Attenuation_Partition_Coefficient_Kd_Species_1) * (Attenuation_Dry_bulk_density) / (Hydrogeology_Porosity    Hydrogeology!$O:$O)","v":{"$error":"#DIV/0!"}},{"$f":" 1 + 0.001 * (Attenuation_Partition_Coefficient_Kd_Species_1) * (Attenuation_Dry_bulk_density) / (Hydrogeology_Porosity    Hydrogeology!$P:$P)","v":{"$error":"#DIV/0!"}},{"$f":" 1 + 0.001 * (Attenuation_Partition_Coefficient_Kd_Species_1) * (Attenuation_Dry_bulk_density) / (Hydrogeology_Porosity    Hydrogeology!$Q:$Q)","v":{"$error":"#DIV/0!"}},{"$f":" 1 + 0.001 * (Attenuation_Partition_Coefficient_Kd_Species_1) * (Attenuation_Dry_bulk_density) / (Hydrogeology_Porosity    Hydrogeology!$R:$R)","v":{"$error":"#DIV/0!"}}]
["Distribution",null,"constant","constant","constant","constant","constant","constant","constant","constant","constant","constant","constant","constant","constant","constant","constant","constant"]
["Attenuation_Retardation_Species_1_param1"]
["Attenuation_Retardation_Species_1_param2"]
["Attenuation_Retardation_Species_1_param3"]
[]
[]
["Attenuation_Half_Life_Species_1","days","No Decay","No Decay","No Decay","No Decay","No Decay","No Decay","No Decay","No Decay","No Decay","No Decay","No Decay","No Decay","No Decay","No Decay","No Decay","No Decay"]
["Distribution",null,"constant","constant","constant","constant","constant","constant","constant","constant","constant","constant","constant","constant","constant","constant","constant","constant"]
["Attenuation_Half_Life_Species_1_param1"]
["Attenuation_Half_Life_Species_1_param2"]
["Attenuation_Half_Life_Species_1_param3"]
[]
[]
["Attenuation_Decay_Coefficient_Species_1","1/s",{"$f":" IF((_xlfn.SINGLE(Attenuation_Half_Life_Species_1))<>\"No Decay\", LN(2) / ((_xlfn.SINGLE(Attenuation_Half_Life_Species_1)) *_xlfn.SINGLE( s_per_day)),0)","v":0},0,0,0,0,0,0,0,0,0,0,0,0,0,0,0]
["Distribution",null,"constant","constant","constant","constant","constant","constant","constant","constant","constant","constant","constant","constant","constant","constant","constant","constant"]
["Attenuation_Decay_Coefficient_Species_1_param1"]
["Attenuation_Decay_Coefficient_Species_1_param2"]
["Attenuation_Decay_Coefficient_Species_1_param3"]
[]
[]
[{"$f":" IF((Contaminants_Source_determinand_names   Contaminants_Species2)=0,\"Undefined\",(Contaminants_Source_determinand_names   Contaminants_Species2))","v":"Cadmium"}]
[]
["Attenuation_Partition_Coefficient_Kd_Species_2","L/kg",{"$f":"AL_Kd_Cd","v":222},{"$f":"BGF_Kd_Cd","v":74},{"$f":" (Attenuation_Fraction_organic_carbon) * (Contaminants_Organic_Carbon_Water_Partition_Coefficient_Koc  Contaminants_Species2)","v":0},{"$f":" (Attenuation_Fraction_organic_carbon) * (Contaminants_Organic_Carbon_Water_Partition_Coefficient_Koc  Contaminants_Species2)","v":0},{"$f":" (Attenuation_Fraction_organic_carbon) * (Contaminants_Organic_Carbon_Water_Partition_Coefficient_Koc  Contaminants_Species2)","v":0},{"$f":" (Attenuation_Fraction_organic_carbon) * (Contaminants_Organic_Carbon_Water_Partition_Coefficient_Koc  Contaminants_Species2)","v":0},{"$f":" (Attenuation_Fraction_organic_carbon) * (Contaminants_Organic_Carbon_Water_Partition_Coefficient_Koc  Contaminants_Species2)","v":0},{"$f":" (Attenuation_Fraction_organic_carbon) * (Contaminants_Organic_Carbon_Water_Partition_Coefficient_Koc  Contaminants_Species2)","v":0},{"$f":" (Attenuation_Fraction_organic_carbon) * (Contaminants_Organic_Carbon_Water_Partition_Coefficient_Koc  Contaminants_Species2)","v":0},{"$f":" (Attenuation_Fraction_organic_carbon) * (Contaminants_Organic_Carbon_Water_Partition_Coefficient_Koc  Contaminants_Species2)","v":0},{"$f":" (Attenuation_Fraction_organic_carbon) * (Contaminants_Organic_Carbon_Water_Partition_Coefficient_Koc  Contaminants_Species2)","v":0},{"$f":" (Attenuation_Fraction_organic_carbon) * (Contaminants_Organic_Carbon_Water_Partition_Coefficient_Koc  Contaminants_Species2)","v":0},{"$f":" (Attenuation_Fraction_organic_carbon) * (Contaminants_Organic_Carbon_Water_Partition_Coefficient_Koc  Contaminants_Species2)","v":0},{"$f":" (Attenuation_Fraction_organic_carbon) * (Contaminants_Organic_Carbon_Water_Partition_Coefficient_Koc  Contaminants_Species2)","v":0},{"$f":" (Attenuation_Fraction_organic_carbon) * (Contaminants_Organic_Carbon_Water_Partition_Coefficient_Koc  Contaminants_Species2)","v":0},{"$f":" (Attenuation_Fraction_organic_carbon) * (Contaminants_Organic_Carbon_Water_Partition_Coefficient_Koc  Contaminants_Species2)","v":0}]
["Distribution",null,"constant","constant","constant","constant","constant","constant","constant","constant","constant","constant","constant","constant","constant","constant","constant","constant"]
["Attenuation_Partition_Coefficient_Kd_Species_2_param1"]
["Attenuation_Partition_Coefficient_Kd_Species_2_param2"]
["Attenuation_Partition_Coefficient_Kd_Species_2_param3"]
[]
[]
["Attenuation_Retardation_Species_2","[-]",{"$f":" 1 + 0.001 * (Attenuation_Partition_Coefficient_Kd_Species_2) * (Attenuation_Dry_bulk_density) / (Hydrogeology_Porosity    Hydrogeology!$C:$C)","v":8881},{"$f":" 1 + 0.001 * (Attenuation_Partition_Coefficient_Kd_Species_2) * (Attenuation_Dry_bulk_density) / (Hydrogeology_Porosity    Hydrogeology!$D:$D)","v":592.99999999999989},{"$f":" 1 + 0.001 * (Attenuation_Partition_Coefficient_Kd_Species_2) * (Attenuation_Dry_bulk_density) / (Hydrogeology_Porosity    Hydrogeology!$E:$E)","v":{"$error":"#DIV/0!"}},{"$f":" 1 + 0.001 * (Attenuation_Partition_Coefficient_Kd_Species_2) * (Attenuation_Dry_bulk_density) / (Hydrogeology_Porosity    Hydrogeology!$F:$F)","v":{"$error":"#DIV/0!"}},{"$f":" 1 + 0.001 * (Attenuation_Partition_Coefficient_Kd_Species_2) * (Attenuation_Dry_bulk_density) / (Hydrogeology_Porosity    Hydrogeology!$G:$G)","v":{"$error":"#DIV/0!"}},{"$f":" 1 + 0.001 * (Attenuation_Partition_Coefficient_Kd_Species_2) * (Attenuation_Dry_bulk_density) / (Hydrogeology_Porosity    Hydrogeology!$H:$H)","v":{"$error":"#DIV/0!"}},{"$f":" 1 + 0.001 * (Attenuation_Partition_Coefficient_Kd_Species_2) * (Attenuation_Dry_bulk_density) / (Hydrogeology_Porosity    Hydrogeology!$I:$I)","v":{"$error":"#DIV/0!"}},{"$f":" 1 + 0.001 * (Attenuation_Partition_Coefficient_Kd_Species_2) * (Attenuation_Dry_bulk_density) / (Hydrogeology_Porosity    Hydrogeology!$J:$J)","v":{"$error":"#DIV/0!"}},{"$f":" 1 + 0.001 * (Attenuation_Partition_Coefficient_Kd_Species_2) * (Attenuation_Dry_bulk_density) / (Hydrogeology_Porosity    Hydrogeology!$K:$K)","v":{"$error":"#DIV/0!"}},{"$f":" 1 + 0.001 * (Attenuation_Partition_Coefficient_Kd_Species_2) * (Attenuation_Dry_bulk_density) / (Hydrogeology_Porosity    Hydrogeology!$L:$L)","v":{"$error":"#DIV/0!"}},{"$f":" 1 + 0.001 * (Attenuation_Partition_Coefficient_Kd_Species_2) * (Attenuation_Dry_bulk_density) / (Hydrogeology_Porosity    Hydrogeology!$M:$M)","v":{"$error":"#DIV/0!"}},{"$f":" 1 + 0.001 * (Attenuation_Partition_Coefficient_Kd_Species_2) * (Attenuation_Dry_bulk_density) / (Hydrogeology_Porosity    Hydrogeology!$N:$N)","v":{"$error":"#DIV/0!"}},{"$f":" 1 + 0.001 * (Attenuation_Partition_Coefficient_Kd_Species_2) * (Attenuation_Dry_bulk_density) / (Hydrogeology_Porosity    Hydrogeology!$O:$O)","v":{"$error":"#DIV/0!"}},{"$f":" 1 + 0.001 * (Attenuation_Partition_Coefficient_Kd_Species_2) * (Attenuation_Dry_bulk_density) / (Hydrogeology_Porosity    Hydrogeology!$P:$P)","v":{"$error":"#DIV/0!"}},{"$f":" 1 + 0.001 * (Attenuation_Partition_Coefficient_Kd_Species_2) * (Attenuation_Dry_bulk_density) / (Hydrogeology_Porosity    Hydrogeology!$Q:$Q)","v":{"$error":"#DIV/0!"}},{"$f":" 1 + 0.001 * (Attenuation_Partition_Coefficient_Kd_Species_2) * (Attenuation_Dry_bulk_density) / (Hydrogeology_Porosity    Hydrogeology!$R:$R)","v":{"$error":"#DIV/0!"}}]
["Distribution",null,"constant","constant","constant","constant","constant","constant","constant","constant","constant","constant","constant","constant","constant","constant","constant","constant"]
["Attenuation_Retardation_Species_2_param1"]
["Attenuation_Retardation_Species_2_param2"]
["Attenuation_Retardation_Species_2_param3"]
[]
[]
["Attenuation_Half_Life_Species_2","days","No Decay","No Decay","No Decay","No Decay","No Decay","No Decay","No Decay","No Decay","No Decay","No Decay","No Decay","No Decay","No Decay","No Decay","No Decay","No Decay"]
["Distribution",null,"constant","constant","constant","constant","constant","constant","constant","constant","constant","constant","constant","constant","constant","constant","constant","constant"]
["Attenuation_Half_Life_Species_2_param1"]
["Attenuation_Half_Life_Species_2_param2"]
["Attenuation_Half_Life_Species_2_param3"]
[]
[]
["Attenuation_Decay_Coefficient_Species_2","1/s",{"$f":" IF((_xlfn.SINGLE(Attenuation_Half_Life_Species_2))<>\"No Decay\", LN(2) / ((_xlfn.SINGLE(Attenuation_Half_Life_Species_2)) *_xlfn.SINGLE( s_per_day)),0)","v":0},0,0,0,0,0,0,0,0,0,0,0,0,0,0,0]
["Distribution",null,"constant","constant","constant","constant","constant","constant","constant","constant","constant","constant","constant","constant","constant","constant","constant","constant"]
["Attenuation_Decay_Coefficient_Species_2_param1"]
["Attenuation_Decay_Coefficient_Species_2_param2"]
["Attenuation_Decay_Coefficient_Species_2_param3"]
[]
[]
[{"$f":" IF((Contaminants_Source_determinand_names   Contaminants_Species3)=0,\"Undefined\",(Contaminants_Source_determinand_names   Contaminants_Species3))","v":"Chromium"}]
[]
["Attenuation_Partition_Coefficient_Kd_Species_3","L/kg",{"$f":"AL_Kd_Cr","v":966},{"$f":"BGF_Kd_Cr","v":67},{"$f":" (Attenuation_Fraction_organic_carbon) * (Contaminants_Organic_Carbon_Water_Partition_Coefficient_Koc  Contaminants_Species3)","v":0},{"$f":" (Attenuation_Fraction_organic_carbon) * (Contaminants_Organic_Carbon_Water_Partition_Coefficient_Koc  Contaminants_Species3)","v":0},{"$f":" (Attenuation_Fraction_organic_carbon) * (Contaminants_Organic_Carbon_Water_Partition_Coefficient_Koc  Contaminants_Species3)","v":0},{"$f":" (Attenuation_Fraction_organic_carbon) * (Contaminants_Organic_Carbon_Water_Partition_Coefficient_Koc  Contaminants_Species3)","v":0},{"$f":" (Attenuation_Fraction_organic_carbon) * (Contaminants_Organic_Carbon_Water_Partition_Coefficient_Koc  Contaminants_Species3)","v":0},{"$f":" (Attenuation_Fraction_organic_carbon) * (Contaminants_Organic_Carbon_Water_Partition_Coefficient_Koc  Contaminants_Species3)","v":0},{"$f":" (Attenuation_Fraction_organic_carbon) * (Contaminants_Organic_Carbon_Water_Partition_Coefficient_Koc  Contaminants_Species3)","v":0},{"$f":" (Attenuation_Fraction_organic_carbon) * (Contaminants_Organic_Carbon_Water_Partition_Coefficient_Koc  Contaminants_Species3)","v":0},{"$f":" (Attenuation_Fraction_organic_carbon) * (Contaminants_Organic_Carbon_Water_Partition_Coefficient_Koc  Contaminants_Species3)","v":0},{"$f":" (Attenuation_Fraction_organic_carbon) * (Contaminants_Organic_Carbon_Water_Partition_Coefficient_Koc  Contaminants_Species3)","v":0},{"$f":" (Attenuation_Fraction_organic_carbon) * (Contaminants_Organic_Carbon_Water_Partition_Coefficient_Koc  Contaminants_Species3)","v":0},{"$f":" (Attenuation_Fraction_organic_carbon) * (Contaminants_Organic_Carbon_Water_Partition_Coefficient_Koc  Contaminants_Species3)","v":0},{"$f":" (Attenuation_Fraction_organic_carbon) * (Contaminants_Organic_Carbon_Water_Partition_Coefficient_Koc  Contaminants_Species3)","v":0},{"$f":" (Attenuation_Fraction_organic_carbon) * (Contaminants_Organic_Carbon_Water_Partition_Coefficient_Koc  Contaminants_Species3)","v":0}]
["Distribution",null,"constant","constant","constant","constant","constant","constant","constant","constant","constant","constant","constant","constant","constant","constant","constant","constant"]
["Attenuation_Partition_Coefficient_Kd_Species_3_param1"]
["Attenuation_Partition_Coefficient_Kd_Species_3_param2"]
["Attenuation_Partition_Coefficient_Kd_Species_3_param3"]
[]
[]
["Attenuation_Retardation_Species_3","[-]",{"$f":" 1 + 0.001 * (Attenuation_Partition_Coefficient_Kd_Species_3) * (Attenuation_Dry_bulk_density) / (Hydrogeology_Porosity    Hydrogeology!$C:$C)","v":38641},{"$f":" 1 + 0.001 * (Attenuation_Partition_Coefficient_Kd_Species_3) * (Attenuation_Dry_bulk_density) / (Hydrogeology_Porosity    Hydrogeology!$D:$D)","v":537},{"$f":" 1 + 0.001 * (Attenuation_Partition_Coefficient_Kd_Species_3) * (Attenuation_Dry_bulk_density) / (Hydrogeology_Porosity    Hydrogeology!$E:$E)","v":{"$error":"#DIV/0!"}},{"$f":" 1 + 0.001 * (Attenuation_Partition_Coefficient_Kd_Species_3) * (Attenuation_Dry_bulk_density) / (Hydrogeology_Porosity    Hydrogeology!$F:$F)","v":{"$error":"#DIV/0!"}},{"$f":" 1 + 0.001 * (Attenuation_Partition_Coefficient_Kd_Species_3) * (Attenuation_Dry_bulk_density) / (Hydrogeology_Porosity    Hydrogeology!$G:$G)","v":{"$error":"#DIV/0!"}},{"$f":" 1 + 0.001 * (Attenuation_Partition_Coefficient_Kd_Species_3) * (Attenuation_Dry_bulk_density) / (Hydrogeology_Porosity    Hydrogeology!$H:$H)","v":{"$error":"#DIV/0!"}},{"$f":" 1 + 0.001 * (Attenuation_Partition_Coefficient_Kd_Species_3) * (Attenuation_Dry_bulk_density) / (Hydrogeology_Porosity    Hydrogeology!$I:$I)","v":{"$error":"#DIV/0!"}},{"$f":" 1 + 0.001 * (Attenuation_Partition_Coefficient_Kd_Species_3) * (Attenuation_Dry_bulk_density) / (Hydrogeology_Porosity    Hydrogeology!$J:$J)","v":{"$error":"#DIV/0!"}},{"$f":" 1 + 0.001 * (Attenuation_Partition_Coefficient_Kd_Species_3) * (Attenuation_Dry_bulk_density) / (Hydrogeology_Porosity    Hydrogeology!$K:$K)","v":{"$error":"#DIV/0!"}},{"$f":" 1 + 0.001 * (Attenuation_Partition_Coefficient_Kd_Species_3) * (Attenuation_Dry_bulk_density) / (Hydrogeology_Porosity    Hydrogeology!$L:$L)","v":{"$error":"#DIV/0!"}},{"$f":" 1 + 0.001 * (Attenuation_Partition_Coefficient_Kd_Species_3) * (Attenuation_Dry_bulk_density) / (Hydrogeology_Porosity    Hydrogeology!$M:$M)","v":{"$error":"#DIV/0!"}},{"$f":" 1 + 0.001 * (Attenuation_Partition_Coefficient_Kd_Species_3) * (Attenuation_Dry_bulk_density) / (Hydrogeology_Porosity    Hydrogeology!$N:$N)","v":{"$error":"#DIV/0!"}},{"$f":" 1 + 0.001 * (Attenuation_Partition_Coefficient_Kd_Species_3) * (Attenuation_Dry_bulk_density) / (Hydrogeology_Porosity    Hydrogeology!$O:$O)","v":{"$error":"#DIV/0!"}},{"$f":" 1 + 0.001 * (Attenuation_Partition_Coefficient_Kd_Species_3) * (Attenuation_Dry_bulk_density) / (Hydrogeology_Porosity    Hydrogeology!$P:$P)","v":{"$error":"#DIV/0!"}},{"$f":" 1 + 0.001 * (Attenuation_Partition_Coefficient_Kd_Species_3) * (Attenuation_Dry_bulk_density) / (Hydrogeology_Porosity    Hydrogeology!$Q:$Q)","v":{"$error":"#DIV/0!"}},{"$f":" 1 + 0.001 * (Attenuation_Partition_Coefficient_Kd_Species_3) * (Attenuation_Dry_bulk_density) / (Hydrogeology_Porosity    Hydrogeology!$R:$R)","v":{"$error":"#DIV/0!"}}]
["Distribution",null,"constant","constant","constant","constant","constant","constant","constant","constant","constant","constant","constant","constant","constant","constant","constant","constant"]
["Attenuation_Retardation_Species_3_param1"]
["Attenuation_Retardation_Species_3_param2"]
["Attenuation_Retardation_Species_3_param3"]
[]
[]
["Attenuation_Half_Life_Species_3","days","No Decay","No Decay","No Decay","No Decay","No Decay","No Decay","No Decay","No Decay","No Decay","No Decay","No Decay","No Decay","No Decay","No Decay","No Decay","No Decay"]
["Distribution",null,"constant","constant","constant","constant","constant","constant","constant","constant","constant","constant","constant","constant","constant","constant","constant","constant"]
["Attenuation_Half_Life_Species_3_param1"]
["Attenuation_Half_Life_Species_3_param2"]
["Attenuation_Half_Life_Species_3_param3"]
[]
[]
["Attenuation_Decay_Coefficient_Species_3","1/s",{"$f":" IF((_xlfn.SINGLE(Attenuation_Half_Life_Species_3))<>\"No Decay\", LN(2) / ((_xlfn.SINGLE(Attenuation_Half_Life_Species_3)) *_xlfn.SINGLE( s_per_day)),0)","v":0},0,0,0,0,0,0,0,0,0,0,0,0,0,0,0]
["Distribution",null,"constant","constant","constant","constant","constant","constant","constant","constant","constant","constant","constant","constant","constant","constant","constant","constant"]
["Attenuation_Decay_Coefficient_Species_3_param1"]
["Attenuation_Decay_Coefficient_Species_3_param2"]
["Attenuation_Decay_Coefficient_Species_3_param3"]
[]
[]
[{"$f":" IF((Contaminants_Source_determinand_names   Contaminants_Species4)=0,\"Undefined\",(Contaminants_Source_determinand_names   Contaminants_Species4))","v":"Copper"}]
[]
["Attenuation_Partition_Coefficient_Kd_Species_4","L/kg",{"$f":"AL_Kd_Cu","v":126.8},{"$f":"BGF_Kd_Cu","v":295},{"$f":" (Attenuation_Fraction_organic_carbon) * (Contaminants_Organic_Carbon_Water_Partition_Coefficient_Koc  Contaminants_Species4)","v":0},{"$f":" (Attenuation_Fraction_organic_carbon) * (Contaminants_Organic_Carbon_Water_Partition_Coefficient_Koc  Contaminants_Species4)","v":0},{"$f":" (Attenuation_Fraction_organic_carbon) * (Contaminants_Organic_Carbon_Water_Partition_Coefficient_Koc  Contaminants_Species4)","v":0},{"$f":" (Attenuation_Fraction_organic_carbon) * (Contaminants_Organic_Carbon_Water_Partition_Coefficient_Koc  Contaminants_Species4)","v":0},{"$f":" (Attenuation_Fraction_organic_carbon) * (Contaminants_Organic_Carbon_Water_Partition_Coefficient_Koc  Contaminants_Species4)","v":0},{"$f":" (Attenuation_Fraction_organic_carbon) * (Contaminants_Organic_Carbon_Water_Partition_Coefficient_Koc  Contaminants_Species4)","v":0},{"$f":" (Attenuation_Fraction_organic_carbon) * (Contaminants_Organic_Carbon_Water_Partition_Coefficient_Koc  Contaminants_Species4)","v":0},{"$f":" (Attenuation_Fraction_organic_carbon) * (Contaminants_Organic_Carbon_Water_Partition_Coefficient_Koc  Contaminants_Species4)","v":0},{"$f":" (Attenuation_Fraction_organic_carbon) * (Contaminants_Organic_Carbon_Water_Partition_Coefficient_Koc  Contaminants_Species4)","v":0},{"$f":" (Attenuation_Fraction_organic_carbon) * (Contaminants_Organic_Carbon_Water_Partition_Coefficient_Koc  Contaminants_Species4)","v":0},{"$f":" (Attenuation_Fraction_organic_carbon) * (Contaminants_Organic_Carbon_Water_Partition_Coefficient_Koc  Contaminants_Species4)","v":0},{"$f":" (Attenuation_Fraction_organic_carbon) * (Contaminants_Organic_Carbon_Water_Partition_Coefficient_Koc  Contaminants_Species4)","v":0},{"$f":" (Attenuation_Fraction_organic_carbon) * (Contaminants_Organic_Carbon_Water_Partition_Coefficient_Koc  Contaminants_Species4)","v":0},{"$f":" (Attenuation_Fraction_organic_carbon) * (Contaminants_Organic_Carbon_Water_Partition_Coefficient_Koc  Contaminants_Species4)","v":0}]
["Distribution",null,"constant","constant","constant","constant","constant","constant","constant","constant","constant","constant","constant","constant","constant","constant","constant","constant"]
["Attenuation_Partition_Coefficient_Kd_Species_4_param1"]
["Attenuation_Partition_Coefficient_Kd_Species_4_param2"]
["Attenuation_Partition_Coefficient_Kd_Species_4_param3"]
[]
[]
["Attenuation_Retardation_Species_4","[-]",{"$f":" 1 + 0.001 * (Attenuation_Partition_Coefficient_Kd_Species_4) * (Attenuation_Dry_bulk_density) / (Hydrogeology_Porosity    Hydrogeology!$C:$C)","v":5073},{"$f":" 1 + 0.001 * (Attenuation_Partition_Coefficient_Kd_Species_4) * (Attenuation_Dry_bulk_density) / (Hydrogeology_Porosity    Hydrogeology!$D:$D)","v":2361},{"$f":" 1 + 0.001 * (Attenuation_Partition_Coefficient_Kd_Species_4) * (Attenuation_Dry_bulk_density) / (Hydrogeology_Porosity    Hydrogeology!$E:$E)","v":{"$error":"#DIV/0!"}},{"$f":" 1 + 0.001 * (Attenuation_Partition_Coefficient_Kd_Species_4) * (Attenuation_Dry_bulk_density) / (Hydrogeology_Porosity    Hydrogeology!$F:$F)","v":{"$error":"#DIV/0!"}},{"$f":" 1 + 0.001 * (Attenuation_Partition_Coefficient_Kd_Species_4) * (Attenuation_Dry_bulk_density) / (Hydrogeology_Porosity    Hydrogeology!$G:$G)","v":{"$error":"#DIV/0!"}},{"$f":" 1 + 0.001 * (Attenuation_Partition_Coefficient_Kd_Species_4) * (Attenuation_Dry_bulk_density) / (Hydrogeology_Porosity    Hydrogeology!$H:$H)","v":{"$error":"#DIV/0!"}},{"$f":" 1 + 0.001 * (Attenuation_Partition_Coefficient_Kd_Species_4) * (Attenuation_Dry_bulk_density) / (Hydrogeology_Porosity    Hydrogeology!$I:$I)","v":{"$error":"#DIV/0!"}},{"$f":" 1 + 0.001 * (Attenuation_Partition_Coefficient_Kd_Species_4) * (Attenuation_Dry_bulk_density) / (Hydrogeology_Porosity    Hydrogeology!$J:$J)","v":{"$error":"#DIV/0!"}},{"$f":" 1 + 0.001 * (Attenuation_Partition_Coefficient_Kd_Species_4) * (Attenuation_Dry_bulk_density) / (Hydrogeology_Porosity    Hydrogeology!$K:$K)","v":{"$error":"#DIV/0!"}},{"$f":" 1 + 0.001 * (Attenuation_Partition_Coefficient_Kd_Species_4) * (Attenuation_Dry_bulk_density) / (Hydrogeology_Porosity    Hydrogeology!$L:$L)","v":{"$error":"#DIV/0!"}},{"$f":" 1 + 0.001 * (Attenuation_Partition_Coefficient_Kd_Species_4) * (Attenuation_Dry_bulk_density) / (Hydrogeology_Porosity    Hydrogeology!$M:$M)","v":{"$error":"#DIV/0!"}},{"$f":" 1 + 0.001 * (Attenuation_Partition_Coefficient_Kd_Species_4) * (Attenuation_Dry_bulk_density) / (Hydrogeology_Porosity    Hydrogeology!$N:$N)","v":{"$error":"#DIV/0!"}},{"$f":" 1 + 0.001 * (Attenuation_Partition_Coefficient_Kd_Species_4) * (Attenuation_Dry_bulk_density) / (Hydrogeology_Porosity    Hydrogeology!$O:$O)","v":{"$error":"#DIV/0!"}},{"$f":" 1 + 0.001 * (Attenuation_Partition_Coefficient_Kd_Species_4) * (Attenuation_Dry_bulk_density) / (Hydrogeology_Porosity    Hydrogeology!$P:$P)","v":{"$error":"#DIV/0!"}},{"$f":" 1 + 0.001 * (Attenuation_Partition_Coefficient_Kd_Species_4) * (Attenuation_Dry_bulk_density) / (Hydrogeology_Porosity    Hydrogeology!$Q:$Q)","v":{"$error":"#DIV/0!"}},{"$f":" 1 + 0.001 * (Attenuation_Partition_Coefficient_Kd_Species_4) * (Attenuation_Dry_bulk_density) / (Hydrogeology_Porosity    Hydrogeology!$R:$R)","v":{"$error":"#DIV/0!"}}]
["Distribution",null,"constant","constant","constant","constant","constant","constant","constant","constant","constant","constant","constant","constant","constant","constant","constant","constant"]
["Attenuation_Retardation_Species_4_param1"]
["Attenuation_Retardation_Species_4_param2"]
["Attenuation_Retardation_Species_4_param3"]
[]
[]
["Attenuation_Half_Life_Species_4","days","No Decay","No Decay","No Decay","No Decay","No Decay","No Decay","No Decay","No Decay","No Decay","No Decay","No Decay","No Decay","No Decay","No Decay","No Decay","No Decay"]
["Distribution",null,"constant","constant","constant","constant","constant","constant","constant","constant","constant","constant","constant","constant","constant","constant","constant","constant"]
["Attenuation_Half_Life_Species_4_param1"]
["Attenuation_Half_Life_Species_4_param2"]
["Attenuation_Half_Life_Species_4_param3"]
[]
[]
["Attenuation_Decay_Coefficient_Species_4","1/s",{"$f":" IF((_xlfn.SINGLE(Attenuation_Half_Life_Species_4))<>\"No Decay\", LN(2) / ((_xlfn.SINGLE(Attenuation_Half_Life_Species_4)) *_xlfn.SINGLE( s_per_day)),0)","v":0},0,0,0,0,0,0,0,0,0,0,0,0,0,0,0]
["Distribution",null,"constant","constant","constant","constant","constant","constant","constant","constant","constant","constant","constant","constant","constant","constant","constant","constant"]
["Attenuation_Decay_Coefficient_Species_4_param1"]
["Attenuation_Decay_Coefficient_Species_4_param2"]
["Attenuation_Decay_Coefficient_Species_4_param3"]
[]
[]
[{"$f":" IF((Contaminants_Source_determinand_names   Contaminants_Species5)=0,\"Undefined\",(Contaminants_Source_determinand_names   Contaminants_Species5))","v":"Mercury"}]
[]
["Attenuation_Partition_Coefficient_Kd_Species_5","L/kg",{"$f":"AL_Kd_Hg","v":2142},{"$f":"BGF_Kd_Hg","v":450},{"$f":" (Attenuation_Fraction_organic_carbon) * (Contaminants_Organic_Carbon_Water_Partition_Coefficient_Koc  Contaminants_Species5)","v":0},{"$f":" (Attenuation_Fraction_organic_carbon) * (Contaminants_Organic_Carbon_Water_Partition_Coefficient_Koc  Contaminants_Species5)","v":0},{"$f":" (Attenuation_Fraction_organic_carbon) * (Contaminants_Organic_Carbon_Water_Partition_Coefficient_Koc  Contaminants_Species5)","v":0},{"$f":" (Attenuation_Fraction_organic_carbon) * (Contaminants_Organic_Carbon_Water_Partition_Coefficient_Koc  Contaminants_Species5)","v":0},{"$f":" (Attenuation_Fraction_organic_carbon) * (Contaminants_Organic_Carbon_Water_Partition_Coefficient_Koc  Contaminants_Species5)","v":0},{"$f":" (Attenuation_Fraction_organic_carbon) * (Contaminants_Organic_Carbon_Water_Partition_Coefficient_Koc  Contaminants_Species5)","v":0},{"$f":" (Attenuation_Fraction_organic_carbon) * (Contaminants_Organic_Carbon_Water_Partition_Coefficient_Koc  Contaminants_Species5)","v":0},{"$f":" (Attenuation_Fraction_organic_carbon) * (Contaminants_Organic_Carbon_Water_Partition_Coefficient_Koc  Contaminants_Species5)","v":0},{"$f":" (Attenuation_Fraction_organic_carbon) * (Contaminants_Organic_Carbon_Water_Partition_Coefficient_Koc  Contaminants_Species5)","v":0},{"$f":" (Attenuation_Fraction_organic_carbon) * (Contaminants_Organic_Carbon_Water_Partition_Coefficient_Koc  Contaminants_Species5)","v":0},{"$f":" (Attenuation_Fraction_organic_carbon) * (Contaminants_Organic_Carbon_Water_Partition_Coefficient_Koc  Contaminants_Species5)","v":0},{"$f":" (Attenuation_Fraction_organic_carbon) * (Contaminants_Organic_Carbon_Water_Partition_Coefficient_Koc  Contaminants_Species5)","v":0},{"$f":" (Attenuation_Fraction_organic_carbon) * (Contaminants_Organic_Carbon_Water_Partition_Coefficient_Koc  Contaminants_Species5)","v":0},{"$f":" (Attenuation_Fraction_organic_carbon) * (Contaminants_Organic_Carbon_Water_Partition_Coefficient_Koc  Contaminants_Species5)","v":0}]
["Distribution",null,"constant","constant","constant","constant","constant","constant","constant","constant","constant","constant","constant","constant","constant","constant","constant","constant"]
["Attenuation_Partition_Coefficient_Kd_Species_5_param1"]
["Attenuation_Partition_Coefficient_Kd_Species_5_param2"]
["Attenuation_Partition_Coefficient_Kd_Species_5_param3"]
[]
[]
["Attenuation_Retardation_Species_5","[-]",{"$f":" 1 + 0.001 * (Attenuation_Partition_Coefficient_Kd_Species_5) * (Attenuation_Dry_bulk_density) / (Hydrogeology_Porosity    Hydrogeology!$C:$C)","v":85681},{"$f":" 1 + 0.001 * (Attenuation_Partition_Coefficient_Kd_Species_5) * (Attenuation_Dry_bulk_density) / (Hydrogeology_Porosity    Hydrogeology!$D:$D)","v":3601},{"$f":" 1 + 0.001 * (Attenuation_Partition_Coefficient_Kd_Species_5) * (Attenuation_Dry_bulk_density) / (Hydrogeology_Porosity    Hydrogeology!$E:$E)","v":{"$error":"#DIV/0!"}},{"$f":" 1 + 0.001 * (Attenuation_Partition_Coefficient_Kd_Species_5) * (Attenuation_Dry_bulk_density) / (Hydrogeology_Porosity    Hydrogeology!$F:$F)","v":{"$error":"#DIV/0!"}},{"$f":" 1 + 0.001 * (Attenuation_Partition_Coefficient_Kd_Species_5) * (Attenuation_Dry_bulk_density) / (Hydrogeology_Porosity    Hydrogeology!$G:$G)","v":{"$error":"#DIV/0!"}},{"$f":" 1 + 0.001 * (Attenuation_Partition_Coefficient_Kd_Species_5) * (Attenuation_Dry_bulk_density) / (Hydrogeology_Porosity    Hydrogeology!$H:$H)","v":{"$error":"#DIV/0!"}},{"$f":" 1 + 0.001 * (Attenuation_Partition_Coefficient_Kd_Species_5) * (Attenuation_Dry_bulk_density) / (Hydrogeology_Porosity    Hydrogeology!$I:$I)","v":{"$error":"#DIV/0!"}},{"$f":" 1 + 0.001 * (Attenuation_Partition_Coefficient_Kd_Species_5) * (Attenuation_Dry_bulk_density) / (Hydrogeology_Porosity    Hydrogeology!$J:$J)","v":{"$error":"#DIV/0!"}},{"$f":" 1 + 0.001 * (Attenuation_Partition_Coefficient_Kd_Species_5) * (Attenuation_Dry_bulk_density) / (Hydrogeology_Porosity    Hydrogeology!$K:$K)","v":{"$error":"#DIV/0!"}},{"$f":" 1 + 0.001 * (Attenuation_Partition_Coefficient_Kd_Species_5) * (Attenuation_Dry_bulk_density) / (Hydrogeology_Porosity    Hydrogeology!$L:$L)","v":{"$error":"#DIV/0!"}},{"$f":" 1 + 0.001 * (Attenuation_Partition_Coefficient_Kd_Species_5) * (Attenuation_Dry_bulk_density) / (Hydrogeology_Porosity    Hydrogeology!$M:$M)","v":{"$error":"#DIV/0!"}},{"$f":" 1 + 0.001 * (Attenuation_Partition_Coefficient_Kd_Species_5) * (Attenuation_Dry_bulk_density) / (Hydrogeology_Porosity    Hydrogeology!$N:$N)","v":{"$error":"#DIV/0!"}},{"$f":" 1 + 0.001 * (Attenuation_Partition_Coefficient_Kd_Species_5) * (Attenuation_Dry_bulk_density) / (Hydrogeology_Porosity    Hydrogeology!$O:$O)","v":{"$error":"#DIV/0!"}},{"$f":" 1 + 0.001 * (Attenuation_Partition_Coefficient_Kd_Species_5) * (Attenuation_Dry_bulk_density) / (Hydrogeology_Porosity    Hydrogeology!$P:$P)","v":{"$error":"#DIV/0!"}},{"$f":" 1 + 0.001 * (Attenuation_Partition_Coefficient_Kd_Species_5) * (Attenuation_Dry_bulk_density) / (Hydrogeology_Porosity    Hydrogeology!$Q:$Q)","v":{"$error":"#DIV/0!"}},{"$f":" 1 + 0.001 * (Attenuation_Partition_Coefficient_Kd_Species_5) * (Attenuation_Dry_bulk_density) / (Hydrogeology_Porosity    Hydrogeology!$R:$R)","v":{"$error":"#DIV/0!"}}]
["Distribution",null,"constant","constant","constant","constant","constant","constant","constant","constant","constant","constant","constant","constant","constant","constant","constant","constant"]
["Attenuation_Retardation_Species_5_param1"]
["Attenuation_Retardation_Species_5_param2"]
["Attenuation_Retardation_Species_5_param3"]
[]
[]
["Attenuation_Half_Life_Species_5","days","No Decay","No Decay","No Decay","No Decay","No Decay","No Decay","No Decay","No Decay","No Decay","No Decay","No Decay","No Decay","No Decay","No Decay","No Decay","No Decay"]
["Distribution",null,"constant","constant","constant","constant","constant","constant","constant","constant","constant","constant","constant","constant","constant","constant","constant","constant"]
["Attenuation_Half_Life_Species_5_param1"]
["Attenuation_Half_Life_Species_5_param2"]
["Attenuation_Half_Life_Species_5_param3"]
[]
[]
["Attenuation_Decay_Coefficient_Species_5","1/s",{"$f":" IF((_xlfn.SINGLE(Attenuation_Half_Life_Species_5))<>\"No Decay\", LN(2) / ((_xlfn.SINGLE(Attenuation_Half_Life_Species_5)) *_xlfn.SINGLE( s_per_day)),0)","v":0},0,0,0,0,0,0,0,0,0,0,0,0,0,0,0]
["Distribution",null,"constant","constant","constant","constant","constant","constant","constant","constant","constant","constant","constant","constant","constant","constant","constant","constant"]
["Attenuation_Decay_Coefficient_Species_5_param1"]
["Attenuation_Decay_Coefficient_Species_5_param2"]
["Attenuation_Decay_Coefficient_Species_5_param3"]
[]
[]
[{"$f":" IF((Contaminants_Source_determinand_names   Contaminants_Species6)=0,\"Undefined\",(Contaminants_Source_determinand_names   Contaminants_Species6))","v":"Molybdenum"}]
[]
["Attenuation_Partition_Coefficient_Kd_Species_6","L/kg",{"$f":"AL_Kd_Mo","v":110},{"$f":"BGF_Kd_Mo","v":110},{"$f":" (Attenuation_Fraction_organic_carbon) * (Contaminants_Organic_Carbon_Water_Partition_Coefficient_Koc  Contaminants_Species6)","v":0},{"$f":" (Attenuation_Fraction_organic_carbon) * (Contaminants_Organic_Carbon_Water_Partition_Coefficient_Koc  Contaminants_Species6)","v":0},{"$f":" (Attenuation_Fraction_organic_carbon) * (Contaminants_Organic_Carbon_Water_Partition_Coefficient_Koc  Contaminants_Species6)","v":0},{"$f":" (Attenuation_Fraction_organic_carbon) * (Contaminants_Organic_Carbon_Water_Partition_Coefficient_Koc  Contaminants_Species6)","v":0},{"$f":" (Attenuation_Fraction_organic_carbon) * (Contaminants_Organic_Carbon_Water_Partition_Coefficient_Koc  Contaminants_Species6)","v":0},{"$f":" (Attenuation_Fraction_organic_carbon) * (Contaminants_Organic_Carbon_Water_Partition_Coefficient_Koc  Contaminants_Species6)","v":0},{"$f":" (Attenuation_Fraction_organic_carbon) * (Contaminants_Organic_Carbon_Water_Partition_Coefficient_Koc  Contaminants_Species6)","v":0},{"$f":" (Attenuation_Fraction_organic_carbon) * (Contaminants_Organic_Carbon_Water_Partition_Coefficient_Koc  Contaminants_Species6)","v":0},{"$f":" (Attenuation_Fraction_organic_carbon) * (Contaminants_Organic_Carbon_Water_Partition_Coefficient_Koc  Contaminants_Species6)","v":0},{"$f":" (Attenuation_Fraction_organic_carbon) * (Contaminants_Organic_Carbon_Water_Partition_Coefficient_Koc  Contaminants_Species6)","v":0},{"$f":" (Attenuation_Fraction_organic_carbon) * (Contaminants_Organic_Carbon_Water_Partition_Coefficient_Koc  Contaminants_Species6)","v":0},{"$f":" (Attenuation_Fraction_organic_carbon) * (Contaminants_Organic_Carbon_Water_Partition_Coefficient_Koc  Contaminants_Species6)","v":0},{"$f":" (Attenuation_Fraction_organic_carbon) * (Contaminants_Organic_Carbon_Water_Partition_Coefficient_Koc  Contaminants_Species6)","v":0},{"$f":" (Attenuation_Fraction_organic_carbon) * (Contaminants_Organic_Carbon_Water_Partition_Coefficient_Koc  Contaminants_Species6)","v":0}]
["Distribution",null,"constant","constant","constant","constant","constant","constant","constant","constant","constant","constant","constant","constant","constant","constant","constant","constant"]
["Attenuation_Partition_Coefficient_Kd_Species_6_param1"]
["Attenuation_Partition_Coefficient_Kd_Species_6_param2"]
["Attenuation_Partition_Coefficient_Kd_Species_6_param3"]
[]
[]
["Attenuation_Retardation_Species_6","[-]",{"$f":" 1 + 0.001 * (Attenuation_Partition_Coefficient_Kd_Species_6) * (Attenuation_Dry_bulk_density) / (Hydrogeology_Porosity    Hydrogeology!$C:$C)","v":4401},{"$f":" 1 + 0.001 * (Attenuation_Partition_Coefficient_Kd_Species_6) * (Attenuation_Dry_bulk_density) / (Hydrogeology_Porosity    Hydrogeology!$D:$D)","v":881},{"$f":" 1 + 0.001 * (Attenuation_Partition_Coefficient_Kd_Species_6) * (Attenuation_Dry_bulk_density) / (Hydrogeology_Porosity    Hydrogeology!$E:$E)","v":{"$error":"#DIV/0!"}},{"$f":" 1 + 0.001 * (Attenuation_Partition_Coefficient_Kd_Species_6) * (Attenuation_Dry_bulk_density) / (Hydrogeology_Porosity    Hydrogeology!$F:$F)","v":{"$error":"#DIV/0!"}},{"$f":" 1 + 0.001 * (Attenuation_Partition_Coefficient_Kd_Species_6) * (Attenuation_Dry_bulk_density) / (Hydrogeology_Porosity    Hydrogeology!$G:$G)","v":{"$error":"#DIV/0!"}},{"$f":" 1 + 0.001 * (Attenuation_Partition_Coefficient_Kd_Species_6) * (Attenuation_Dry_bulk_density) / (Hydrogeology_Porosity    Hydrogeology!$H:$H)","v":{"$error":"#DIV/0!"}},{"$f":" 1 + 0.001 * (Attenuation_Partition_Coefficient_Kd_Species_6) * (Attenuation_Dry_bulk_density) / (Hydrogeology_Porosity    Hydrogeology!$I:$I)","v":{"$error":"#DIV/0!"}},{"$f":" 1 + 0.001 * (Attenuation_Partition_Coefficient_Kd_Species_6) * (Attenuation_Dry_bulk_density) / (Hydrogeology_Porosity    Hydrogeology!$J:$J)","v":{"$error":"#DIV/0!"}},{"$f":" 1 + 0.001 * (Attenuation_Partition_Coefficient_Kd_Species_6) * (Attenuation_Dry_bulk_density) / (Hydrogeology_Porosity    Hydrogeology!$K:$K)","v":{"$error":"#DIV/0!"}},{"$f":" 1 + 0.001 * (Attenuation_Partition_Coefficient_Kd_Species_6) * (Attenuation_Dry_bulk_density) / (Hydrogeology_Porosity    Hydrogeology!$L:$L)","v":{"$error":"#DIV/0!"}},{"$f":" 1 + 0.001 * (Attenuation_Partition_Coefficient_Kd_Species_6) * (Attenuation_Dry_bulk_density) / (Hydrogeology_Porosity    Hydrogeology!$M:$M)","v":{"$error":"#DIV/0!"}},{"$f":" 1 + 0.001 * (Attenuation_Partition_Coefficient_Kd_Species_6) * (Attenuation_Dry_bulk_density) / (Hydrogeology_Porosity    Hydrogeology!$N:$N)","v":{"$error":"#DIV/0!"}},{"$f":" 1 + 0.001 * (Attenuation_Partition_Coefficient_Kd_Species_6) * (Attenuation_Dry_bulk_density) / (Hydrogeology_Porosity    Hydrogeology!$O:$O)","v":{"$error":"#DIV/0!"}},{"$f":" 1 + 0.001 * (Attenuation_Partition_Coefficient_Kd_Species_6) * (Attenuation_Dry_bulk_density) / (Hydrogeology_Porosity    Hydrogeology!$P:$P)","v":{"$error":"#DIV/0!"}},{"$f":" 1 + 0.001 * (Attenuation_Partition_Coefficient_Kd_Species_6) * (Attenuation_Dry_bulk_density) / (Hydrogeology_Porosity    Hydrogeology!$Q:$Q)","v":{"$error":"#DIV/0!"}},{"$f":" 1 + 0.001 * (Attenuation_Partition_Coefficient_Kd_Species_6) * (Attenuation_Dry_bulk_density) / (Hydrogeology_Porosity    Hydrogeology!$R:$R)","v":{"$error":"#DIV/0!"}}]
["Distribution",null,"constant","constant","constant","constant","constant","constant","constant","constant","constant","constant","constant","constant","constant","constant","constant","constant"]
["Attenuation_Retardation_Species_6_param1"]
["Attenuation_Retardation_Species_6_param2"]
["Attenuation_Retardation_Species_6_param3"]
[]
[]
["Attenuation_Half_Life_Species_6","days","No Decay","No Decay","No Decay","No Decay","No Decay","No Decay","No Decay","No Decay","No Decay","No Decay","No Decay","No Decay","No Decay","No Decay","No Decay","No Decay"]
["Distribution",null,"constant","constant","constant","constant","constant","constant","constant","constant","constant","constant","constant","constant","constant","constant","constant","constant"]
["Attenuation_Half_Life_Species_6_param1"]
["Attenuation_Half_Life_Species_6_param2"]
["Attenuation_Half_Life_Species_6_param3"]
[]
[]
["Attenuation_Decay_Coefficient_Species_6","1/s",{"$f":" IF((_xlfn.SINGLE(Attenuation_Half_Life_Species_6))<>\"No Decay\", LN(2) / ((_xlfn.SINGLE(Attenuation_Half_Life_Species_6)) *_xlfn.SINGLE( s_per_day)),0)","v":0},0,0,0,0,0,0,0,0,0,0,0,0,0,0,0]
["Distribution",null,"constant","constant","constant","constant","constant","constant","constant","constant","constant","constant","constant","constant","constant","constant","constant","constant"]
["Attenuation_Decay_Coefficient_Species_6_param1"]
["Attenuation_Decay_Coefficient_Species_6_param2"]
["Attenuation_Decay_Coefficient_Species_6_param3"]
[]
[]
[{"$f":" IF((Contaminants_Source_determinand_names   Contaminants_Species7)=0,\"Undefined\",(Contaminants_Source_determinand_names   Contaminants_Species7))","v":"Lead"}]
[]
["Attenuation_Partition_Coefficient_Kd_Species_7","L/kg",{"$f":"AL_Kd_Pb","v":434.6},{"$f":"BGF_Kd_Pb","v":270},{"$f":" (Attenuation_Fraction_organic_carbon) * (Contaminants_Organic_Carbon_Water_Partition_Coefficient_Koc  Contaminants_Species7)","v":0},{"$f":" (Attenuation_Fraction_organic_carbon) * (Contaminants_Organic_Carbon_Water_Partition_Coefficient_Koc  Contaminants_Species7)","v":0},{"$f":" (Attenuation_Fraction_organic_carbon) * (Contaminants_Organic_Carbon_Water_Partition_Coefficient_Koc  Contaminants_Species7)","v":0},{"$f":" (Attenuation_Fraction_organic_carbon) * (Contaminants_Organic_Carbon_Water_Partition_Coefficient_Koc  Contaminants_Species7)","v":0},{"$f":" (Attenuation_Fraction_organic_carbon) * (Contaminants_Organic_Carbon_Water_Partition_Coefficient_Koc  Contaminants_Species7)","v":0},{"$f":" (Attenuation_Fraction_organic_carbon) * (Contaminants_Organic_Carbon_Water_Partition_Coefficient_Koc  Contaminants_Species7)","v":0},{"$f":" (Attenuation_Fraction_organic_carbon) * (Contaminants_Organic_Carbon_Water_Partition_Coefficient_Koc  Contaminants_Species7)","v":0},{"$f":" (Attenuation_Fraction_organic_carbon) * (Contaminants_Organic_Carbon_Water_Partition_Coefficient_Koc  Contaminants_Species7)","v":0},{"$f":" (Attenuation_Fraction_organic_carbon) * (Contaminants_Organic_Carbon_Water_Partition_Coefficient_Koc  Contaminants_Species7)","v":0},{"$f":" (Attenuation_Fraction_organic_carbon) * (Contaminants_Organic_Carbon_Water_Partition_Coefficient_Koc  Contaminants_Species7)","v":0},{"$f":" (Attenuation_Fraction_organic_carbon) * (Contaminants_Organic_Carbon_Water_Partition_Coefficient_Koc  Contaminants_Species7)","v":0},{"$f":" (Attenuation_Fraction_organic_carbon) * (Contaminants_Organic_Carbon_Water_Partition_Coefficient_Koc  Contaminants_Species7)","v":0},{"$f":" (Attenuation_Fraction_organic_carbon) * (Contaminants_Organic_Carbon_Water_Partition_Coefficient_Koc  Contaminants_Species7)","v":0},{"$f":" (Attenuation_Fraction_organic_carbon) * (Contaminants_Organic_Carbon_Water_Partition_Coefficient_Koc  Contaminants_Species7)","v":0}]
["Distribution",null,"constant","constant","constant","constant","constant","constant","constant","constant","constant","constant","constant","constant","constant","constant","constant","constant"]
["Attenuation_Partition_Coefficient_Kd_Species_7_param1"]
["Attenuation_Partition_Coefficient_Kd_Species_7_param2"]
["Attenuation_Partition_Coefficient_Kd_Species_7_param3"]
[]
[]
["Attenuation_Retardation_Species_7","[-]",{"$f":" 1 + 0.001 * (Attenuation_Partition_Coefficient_Kd_Species_7) * (Attenuation_Dry_bulk_density) / (Hydrogeology_Porosity    Hydrogeology!$C:$C)","v":17385},{"$f":" 1 + 0.001 * (Attenuation_Partition_Coefficient_Kd_Species_7) * (Attenuation_Dry_bulk_density) / (Hydrogeology_Porosity    Hydrogeology!$D:$D)","v":2161},{"$f":" 1 + 0.001 * (Attenuation_Partition_Coefficient_Kd_Species_7) * (Attenuation_Dry_bulk_density) / (Hydrogeology_Porosity    Hydrogeology!$E:$E)","v":{"$error":"#DIV/0!"}},{"$f":" 1 + 0.001 * (Attenuation_Partition_Coefficient_Kd_Species_7) * (Attenuation_Dry_bulk_density) / (Hydrogeology_Porosity    Hydrogeology!$F:$F)","v":{"$error":"#DIV/0!"}},{"$f":" 1 + 0.001 * (Attenuation_Partition_Coefficient_Kd_Species_7) * (Attenuation_Dry_bulk_density) / (Hydrogeology_Porosity    Hydrogeology!$G:$G)","v":{"$error":"#DIV/0!"}},{"$f":" 1 + 0.001 * (Attenuation_Partition_Coefficient_Kd_Species_7) * (Attenuation_Dry_bulk_density) / (Hydrogeology_Porosity    Hydrogeology!$H:$H)","v":{"$error":"#DIV/0!"}},{"$f":" 1 + 0.001 * (Attenuation_Partition_Coefficient_Kd_Species_7) * (Attenuation_Dry_bulk_density) / (Hydrogeology_Porosity    Hydrogeology!$I:$I)","v":{"$error":"#DIV/0!"}},{"$f":" 1 + 0.001 * (Attenuation_Partition_Coefficient_Kd_Species_7) * (Attenuation_Dry_bulk_density) / (Hydrogeology_Porosity    Hydrogeology!$J:$J)","v":{"$error":"#DIV/0!"}},{"$f":" 1 + 0.001 * (Attenuation_Partition_Coefficient_Kd_Species_7) * (Attenuation_Dry_bulk_density) / (Hydrogeology_Porosity    Hydrogeology!$K:$K)","v":{"$error":"#DIV/0!"}},{"$f":" 1 + 0.001 * (Attenuation_Partition_Coefficient_Kd_Species_7) * (Attenuation_Dry_bulk_density) / (Hydrogeology_Porosity    Hydrogeology!$L:$L)","v":{"$error":"#DIV/0!"}},{"$f":" 1 + 0.001 * (Attenuation_Partition_Coefficient_Kd_Species_7) * (Attenuation_Dry_bulk_density) / (Hydrogeology_Porosity    Hydrogeology!$M:$M)","v":{"$error":"#DIV/0!"}},{"$f":" 1 + 0.001 * (Attenuation_Partition_Coefficient_Kd_Species_7) * (Attenuation_Dry_bulk_density) / (Hydrogeology_Porosity    Hydrogeology!$N:$N)","v":{"$error":"#DIV/0!"}},{"$f":" 1 + 0.001 * (Attenuation_Partition_Coefficient_Kd_Species_7) * (Attenuation_Dry_bulk_density) / (Hydrogeology_Porosity    Hydrogeology!$O:$O)","v":{"$error":"#DIV/0!"}},{"$f":" 1 + 0.001 * (Attenuation_Partition_Coefficient_Kd_Species_7) * (Attenuation_Dry_bulk_density) / (Hydrogeology_Porosity    Hydrogeology!$P:$P)","v":{"$error":"#DIV/0!"}},{"$f":" 1 + 0.001 * (Attenuation_Partition_Coefficient_Kd_Species_7) * (Attenuation_Dry_bulk_density) / (Hydrogeology_Porosity    Hydrogeology!$Q:$Q)","v":{"$error":"#DIV/0!"}},{"$f":" 1 + 0.001 * (Attenuation_Partition_Coefficient_Kd_Species_7) * (Attenuation_Dry_bulk_density) / (Hydrogeology_Porosity    Hydrogeology!$R:$R)","v":{"$error":"#DIV/0!"}}]
["Distribution",null,"constant","constant","constant","constant","constant","constant","constant","constant","constant","constant","constant","constant","constant","constant","constant","constant"]
["Attenuation_Retardation_Species_7_param1"]
["Attenuation_Retardation_Species_7_param2"]
["Attenuation_Retardation_Species_7_param3"]
[]
[]
["Attenuation_Half_Life_Species_7","days","No Decay","No Decay","No Decay","No Decay","No Decay","No Decay","No Decay","No Decay","No Decay","No Decay","No Decay","No Decay","No Decay","No Decay","No Decay","No Decay"]
["Distribution",null,"constant","constant","constant","constant","constant","constant","constant","constant","constant","constant","constant","constant","constant","constant","constant","constant"]
["Attenuation_Half_Life_Species_7_param1"]
["Attenuation_Half_Life_Species_7_param2"]
["Attenuation_Half_Life_Species_7_param3"]
[]
[]
["Attenuation_Decay_Coefficient_Species_7","1/s",{"$f":" IF((_xlfn.SINGLE(Attenuation_Half_Life_Species_7))<>\"No Decay\", LN(2) / ((_xlfn.SINGLE(Attenuation_Half_Life_Species_7)) *_xlfn.SINGLE( s_per_day)),0)","v":0},0,0,0,0,0,0,0,0,0,0,0,0,0,0,0]
["Distribution",null,"constant","constant","constant","constant","constant","constant","constant","constant","constant","constant","constant","constant","constant","constant","constant","constant"]
["Attenuation_Decay_Coefficient_Species_7_param1"]
["Attenuation_Decay_Coefficient_Species_7_param2"]
["Attenuation_Decay_Coefficient_Species_7_param3"]
[]
[]
[{"$f":" IF((Contaminants_Source_determinand_names   Contaminants_Species8)=0,\"Undefined\",(Contaminants_Source_determinand_names   Contaminants_Species8))","v":"Antimony"}]
[]
["Attenuation_Partition_Coefficient_Kd_Species_8","L/kg",{"$f":"AL_Kd_Sb","v":140},{"$f":"BGF_Kd_Sb","v":17},{"$f":" (Attenuation_Fraction_organic_carbon) * (Contaminants_Organic_Carbon_Water_Partition_Coefficient_Koc  Contaminants_Species8)","v":0},{"$f":" (Attenuation_Fraction_organic_carbon) * (Contaminants_Organic_Carbon_Water_Partition_Coefficient_Koc  Contaminants_Species8)","v":0},{"$f":" (Attenuation_Fraction_organic_carbon) * (Contaminants_Organic_Carbon_Water_Partition_Coefficient_Koc  Contaminants_Species8)","v":0},{"$f":" (Attenuation_Fraction_organic_carbon) * (Contaminants_Organic_Carbon_Water_Partition_Coefficient_Koc  Contaminants_Species8)","v":0},{"$f":" (Attenuation_Fraction_organic_carbon) * (Contaminants_Organic_Carbon_Water_Partition_Coefficient_Koc  Contaminants_Species8)","v":0},{"$f":" (Attenuation_Fraction_organic_carbon) * (Contaminants_Organic_Carbon_Water_Partition_Coefficient_Koc  Contaminants_Species8)","v":0},{"$f":" (Attenuation_Fraction_organic_carbon) * (Contaminants_Organic_Carbon_Water_Partition_Coefficient_Koc  Contaminants_Species8)","v":0},{"$f":" (Attenuation_Fraction_organic_carbon) * (Contaminants_Organic_Carbon_Water_Partition_Coefficient_Koc  Contaminants_Species8)","v":0},{"$f":" (Attenuation_Fraction_organic_carbon) * (Contaminants_Organic_Carbon_Water_Partition_Coefficient_Koc  Contaminants_Species8)","v":0},{"$f":" (Attenuation_Fraction_organic_carbon) * (Contaminants_Organic_Carbon_Water_Partition_Coefficient_Koc  Contaminants_Species8)","v":0},{"$f":" (Attenuation_Fraction_organic_carbon) * (Contaminants_Organic_Carbon_Water_Partition_Coefficient_Koc  Contaminants_Species8)","v":0},{"$f":" (Attenuation_Fraction_organic_carbon) * (Contaminants_Organic_Carbon_Water_Partition_Coefficient_Koc  Contaminants_Species8)","v":0},{"$f":" (Attenuation_Fraction_organic_carbon) * (Contaminants_Organic_Carbon_Water_Partition_Coefficient_Koc  Contaminants_Species8)","v":0},{"$f":" (Attenuation_Fraction_organic_carbon) * (Contaminants_Organic_Carbon_Water_Partition_Coefficient_Koc  Contaminants_Species8)","v":0}]
["Distribution",null,"constant","constant","constant","constant","constant","constant","constant","constant","constant","constant","constant","constant","constant","constant","constant","constant"]
["Attenuation_Partition_Coefficient_Kd_Species_8_param1"]
["Attenuation_Partition_Coefficient_Kd_Species_8_param2"]
["Attenuation_Partition_Coefficient_Kd_Species_8_param3"]
[]
[]
["Attenuation_Retardation_Species_8","[-]",{"$f":" 1 + 0.001 * (Attenuation_Partition_Coefficient_Kd_Species_8) * (Attenuation_Dry_bulk_density) / (Hydrogeology_Porosity    Hydrogeology!$C:$C)","v":5601},{"$f":" 1 + 0.001 * (Attenuation_Partition_Coefficient_Kd_Species_8) * (Attenuation_Dry_bulk_density) / (Hydrogeology_Porosity    Hydrogeology!$D:$D)","v":137},{"$f":" 1 + 0.001 * (Attenuation_Partition_Coefficient_Kd_Species_8) * (Attenuation_Dry_bulk_density) / (Hydrogeology_Porosity    Hydrogeology!$E:$E)","v":{"$error":"#DIV/0!"}},{"$f":" 1 + 0.001 * (Attenuation_Partition_Coefficient_Kd_Species_8) * (Attenuation_Dry_bulk_density) / (Hydrogeology_Porosity    Hydrogeology!$F:$F)","v":{"$error":"#DIV/0!"}},{"$f":" 1 + 0.001 * (Attenuation_Partition_Coefficient_Kd_Species_8) * (Attenuation_Dry_bulk_density) / (Hydrogeology_Porosity    Hydrogeology!$G:$G)","v":{"$error":"#DIV/0!"}},{"$f":" 1 + 0.001 * (Attenuation_Partition_Coefficient_Kd_Species_8) * (Attenuation_Dry_bulk_density) / (Hydrogeology_Porosity    Hydrogeology!$H:$H)","v":{"$error":"#DIV/0!"}},{"$f":" 1 + 0.001 * (Attenuation_Partition_Coefficient_Kd_Species_8) * (Attenuation_Dry_bulk_density) / (Hydrogeology_Porosity    Hydrogeology!$I:$I)","v":{"$error":"#DIV/0!"}},{"$f":" 1 + 0.001 * (Attenuation_Partition_Coefficient_Kd_Species_8) * (Attenuation_Dry_bulk_density) / (Hydrogeology_Porosity    Hydrogeology!$J:$J)","v":{"$error":"#DIV/0!"}},{"$f":" 1 + 0.001 * (Attenuation_Partition_Coefficient_Kd_Species_8) * (Attenuation_Dry_bulk_density) / (Hydrogeology_Porosity    Hydrogeology!$K:$K)","v":{"$error":"#DIV/0!"}},{"$f":" 1 + 0.001 * (Attenuation_Partition_Coefficient_Kd_Species_8) * (Attenuation_Dry_bulk_density) / (Hydrogeology_Porosity    Hydrogeology!$L:$L)","v":{"$error":"#DIV/0!"}},{"$f":" 1 + 0.001 * (Attenuation_Partition_Coefficient_Kd_Species_8) * (Attenuation_Dry_bulk_density) / (Hydrogeology_Porosity    Hydrogeology!$M:$M)","v":{"$error":"#DIV/0!"}},{"$f":" 1 + 0.001 * (Attenuation_Partition_Coefficient_Kd_Species_8) * (Attenuation_Dry_bulk_density) / (Hydrogeology_Porosity    Hydrogeology!$N:$N)","v":{"$error":"#DIV/0!"}},{"$f":" 1 + 0.001 * (Attenuation_Partition_Coefficient_Kd_Species_8) * (Attenuation_Dry_bulk_density) / (Hydrogeology_Porosity    Hydrogeology!$O:$O)","v":{"$error":"#DIV/0!"}},{"$f":" 1 + 0.001 * (Attenuation_Partition_Coefficient_Kd_Species_8) * (Attenuation_Dry_bulk_density) / (Hydrogeology_Porosity    Hydrogeology!$P:$P)","v":{"$error":"#DIV/0!"}},{"$f":" 1 + 0.001 * (Attenuation_Partition_Coefficient_Kd_Species_8) * (Attenuation_Dry_bulk_density) / (Hydrogeology_Porosity    Hydrogeology!$Q:$Q)","v":{"$error":"#DIV/0!"}},{"$f":" 1 + 0.001 * (Attenuation_Partition_Coefficient_Kd_Species_8) * (Attenuation_Dry_bulk_density) / (Hydrogeology_Porosity    Hydrogeology!$R:$R)","v":{"$error":"#DIV/0!"}}]
["Distribution",null,"constant","constant","constant","constant","constant","constant","constant","constant","constant","constant","constant","constant","constant","constant","constant","constant"]
["Attenuation_Retardation_Species_8_param1"]
["Attenuation_Retardation_Species_8_param2"]
["Attenuation_Retardation_Species_8_param3"]
[]
[]
["Attenuation_Half_Life_Species_8","days","No Decay","No Decay","No Decay","No Decay","No Decay","No Decay","No Decay","No Decay","No Decay","No Decay","No Decay","No Decay","No Decay","No Decay","No Decay","No Decay"]
["Distribution",null,"constant","constant","constant","constant","constant","constant","constant","constant","constant","constant","constant","constant","constant","constant","constant","constant"]
["Attenuation_Half_Life_Species_8_param1"]
["Attenuation_Half_Life_Species_8_param2"]
["Attenuation_Half_Life_Species_8_param3"]
[]
[]
["Attenuation_Decay_Coefficient_Species_8","1/s",{"$f":" IF((_xlfn.SINGLE(Attenuation_Half_Life_Species_8))<>\"No Decay\", LN(2) / ((_xlfn.SINGLE(Attenuation_Half_Life_Species_8)) *_xlfn.SINGLE( s_per_day)),0)","v":0},0,0,0,0,0,0,0,0,0,0,0,0,0,0,0]
["Distribution",null,"constant","constant","constant","constant","constant","constant","constant","constant","constant","constant","constant","constant","constant","constant","constant","constant"]
["Attenuation_Decay_Coefficient_Species_8_param1"]
["Attenuation_Decay_Coefficient_Species_8_param2"]
["Attenuation_Decay_Coefficient_Species_8_param3"]

{"sheet":"WaterBalance","index":5,"n_rows":6,"n_cols":1,"rows_kept":6,"cut":false,"hidden":false,"merged":[]}
["WATER BALANCE"]
[]
["User defined"]
[]
["Enter your own calculations for the water balance"]
["Carry fluxes and velocities over onto the Pathway sheet"]

{"sheet":"Pathways","index":6,"n_rows":26,"n_cols":9,"rows_kept":26,"cut":false,"hidden":false,"merged":[]}
["PATHWAY SUMMARY"]
[]
["Path 1",null,"Section 1",null,"Section 2",null,"Section 3"]
["Path 1  Type",null,"Source",null,"Unit",null,"Unit"]
["Path 1  Name",null,"Inert Restoration Material",null,"Attenuation Layer: Node 1",null,"Beenham Grange Formation: Node 1"]
["Path 1  Process",null,"Declining source",null,"ADRD (1D) + Dilution",null,"Aquifer Dilution Only"]
["Path 1  Standards",null,null,null,null,"Target Standard","EAL (GW)"]
["Path 1  Parameter1","Q_managed [m3/s]",0,"Velocity [m/s]",{"$f":" (Attenuation_Lay   Hydrogeology_Velocity)","v":4.8117647058823564E-8}]
["Path 1  Parameter2","Managed time [years]",0,"Dispersivity [m]",{"$f":"E10/10","v":0.1}]
["Path 1  Parameter3","Q_path [m3/s]",{"$f":"Qside_c","v":2.8205049000000064E-5},"Travel Distance [m]",{"$f":"AL_traveldis","v":1}]
["Path 1  Parameter4","Q_decline [m3/s]",{"$f":"Qside_c","v":2.8205049000000064E-5},"Mixing Depth [m]",null,"Mixing Depth [m]"]
["Path 1  Parameter5",null,null,"Mixing Width [m]",null,"Mixing Width [m]"]
["Path 1  Parameter6",null,null,"Q_Dilute [m3/s]",{"$f":"Q_RO","v":1.1810153657640791E-3},"Q_Dilute [m3/s]",{"$f":" Path1_Param5*Path1_Param4*(Beenham_Grange_   Hydrogeology_Hydraulic_Conductivity)*(Beenham_Grange_   Hydrogeology_Hydraulic_Gradient)","v":0}]
[]
[]
["Path 2",null,"Section 1",null,"Section 2",null,"Section 3",null,"Section 4"]
["Path 2  Type",null,"Source",null,"Unit",null,"Unit",null,"Receptor"]
["Path 2  Name",null,"Inert Restoration Material",null,"Attenuation Layer: Node 2",null,"Beenham Grange Formation: Node 2",null,"Groundwater"]
["Path 2  Process",null,"Declining source",null,"ADRD (1D) + Dilution",null,"ADRD (1D) + Dilution",null,"Monitoring Borehole"]
["Path 2  Standards",null,null,null,null,null,null,"Target Standard","EAL (GW)"]
["Path 2  Parameter1","Q_managed [m3/s]",0,"Velocity [m/s]",{"$f":" (Attenuation_Lay   Hydrogeology_Velocity)","v":4.8117647058823564E-8},"Velocity [m/s]",{"$f":" (Beenham_Grange_   Hydrogeology_Velocity)","v":2.1180000000000001E-5}]
["Path 2  Parameter2","Managed time [years]",0,"Dispersivity [m]",{"$f":"E23/10","v":0.1},"Dispersivity [m]",{"$f":"G23/10","v":0.1}]
["Path 2  Parameter3","Q_path [m3/s]",{"$f":"Qside_c","v":2.8205049000000064E-5},"Travel Distance [m]",{"$f":"AL_traveldis","v":1},"Travel Distance [m]",{"$f":"dis_gw_c","v":1}]
["Path 2  Parameter4","Q_decline [m3/s]",{"$f":"Qside_c","v":2.8205049000000064E-5},"Mixing Depth [m]",null,"Mixing Depth [m]"]
["Path 2  Parameter5",null,null,"Mixing Width [m]",null,"Mixing Width [m]"]
["Path 2  Parameter6",null,null,"Q_Dilute [m3/s]",{"$f":"Q_RO","v":1.1810153657640791E-3},"Q_Dilute [m3/s]",{"$f":" Path2_Param5*Path2_Param4*(Beenham_Grange_   Hydrogeology_Hydraulic_Conductivity)*(Beenham_Grange_   Hydrogeology_Hydraulic_Gradient)","v":0},"Q_dilute [m3/s]",0]

{"sheet":"Simulation","index":7,"n_rows":126,"n_cols":12,"rows_kept":126,"cut":false,"hidden":false,"merged":[]}
["SIMULATION PARAMETERS"]
[]
[null,"Monte Carlo Analysis with Crystal Ball",null,null,null,null,null,null,null,"Named Constants"]
[]
[null,null,"Reported Percentile",null,null,95,null,null,null,null,"s_per_year",{"$f":"365.25*60*60*24","v":31557600}]
[null,null,"Number of simulations",null,null,10000,null,null,null,null,"s_per_day",{"$f":"60*60*24","v":86400}]
[]
[]
[null,null,null,null,null,null,null,null,null,"Laplace Transform Solution Parameters"]
[]
[null,null,"Minimise while running:",null,null,null,null,null,null,null,"sigma",0]
[null,null,null,null,null,null,null,null,null,null,"nu",1]
[null,null,null,null,null,null,null,null,null,null,"nsum",16]
[null,null,null,null,null,null,null,null,null,null,"omega",11]
[]
[]
[null,"Reporting Options"]
[]
[]
[]
[]
[null,null,"Number of timeslices for breakthrough curves",null,null,null,100]
[]
[null," The timeslices specified on the results sheets are saved below."]
[null,null,"Path1 timeslices in years",null,"Path2 timeslices in years"]
[null,null,"TS_Path1",null,"TS_Path2"]
[null,null,10,null,10]
[null,null,20,null,20]
[null,null,30,null,30]
[null,null,40,null,40]
[null,null,50,null,50]
[null,null,60,null,60]
[null,null,70,null,70]
[null,null,80,null,80]
[null,null,90,null,90]
[null,null,100,null,100]
[null,null,110,null,110]
[null,null,120,null,120]
[null,null,130,null,130]
[null,null,140,null,140]
[null,null,150,null,150]
[null,null,160,null,160]
[null,null,170,null,170]
[null,null,180,null,180]
[null,null,190,null,190]
[null,null,200,null,200]
[null,null,210,null,210]
[null,null,220,null,220]
[null,null,230,null,230]
[null,null,240,null,240]
[null,null,250,null,250]
[null,null,260,null,260]
[null,null,270,null,270]
[null,null,280,null,280]
[null,null,290,null,290]
[null,null,300,null,300]
[null,null,310,null,310]
[null,null,320,null,320]
[null,null,330,null,330]
[null,null,340,null,340]
[null,null,350,null,350]
[null,null,360,null,360]
[null,null,370,null,370]
[null,null,380,null,380]
[null,null,390,null,390]
[null,null,400,null,400]
[null,null,410,null,410]
[null,null,420,null,420]
[null,null,430,null,430]
[null,null,440,null,440]
[null,null,450,null,450]
[null,null,460,null,460]
[null,null,470,null,470]
[null,null,480,null,480]
[null,null,490,null,490]
[null,null,500,null,500]
[null,null,510,null,510]
[null,null,520,null,520]
[null,null,530,null,530]
[null,null,540,null,540]
[null,null,550,null,550]
[null,null,560,null,560]
[null,null,570,null,570]
[null,null,580,null,580]
[null,null,590,null,590]
[null,null,600,null,600]
[null,null,610,null,610]
[null,null,620,null,620]
[null,null,630,null,630]
[null,null,640,null,640]
[null,null,650,null,650]
[null,null,660,null,660]
[null,null,670,null,670]
[null,null,680,null,680]
[null,null,690,null,690]
[null,null,700,null,700]
[null,null,710,null,710]
[null,null,720,null,720]
[null,null,730,null,730]
[null,null,740,null,740]
[null,null,750,null,750]
[null,null,760,null,760]
[null,null,770,null,770]
[null,null,780,null,780]
[null,null,790,null,790]
[null,null,800,null,800]
[null,null,810,null,810]
[null,null,820,null,820]
[null,null,830,null,830]
[null,null,840,null,840]
[null,null,850,null,850]
[null,null,860,null,860]
[null,null,870,null,870]
[null,null,880,null,880]
[null,null,890,null,890]
[null,null,900,null,900]
[null,null,910,null,910]
[null,null,920,null,920]
[null,null,930,null,930]
[null,null,940,null,940]
[null,null,950,null,950]
[null,null,960,null,960]
[null,null,970,null,970]
[null,null,980,null,980]
[null,null,990,null,990]
[null,null,1000,null,1000]

{"sheet":"Audit","index":8,"n_rows":2513,"n_cols":19,"rows_kept":2513,"cut":false,"hidden":false,"merged":[]}
["AUDIT TRAIL SHEET"]
[]
["Author","Date","Time",null,"Cell Address",null,"New Value","Old Value","Cell Name"]
[]
[]
["Saved  27/02/2023: 14:52:22  Level Number: 5"]
[]
["BREAKTHROUGH RESULTS"]
[]
["Advanced"]
["Pollutant Linkage: Inert Restorati, Attenuation Layer, Beenham Grange Formation",null,null,null,null,"Pollutant Linkage: Inert Restorati, Attenuation Layer, Beenham Grange Formation, Groundwater",null,null,null,null,"Pollutant Linkage: Inert Restorati, Attenuation Layer, Beenham Grange Formation, River Enborne"]
["Concentrations in mg/L in Beenham Grange Formation",null,null,null,null,"Concentrations in mg/L in Groundwater",null,null,null,null,"Concentrations in mg/L in River Enborne"]
[]
["Compared with EAL (GW) target concentration in mg/L",null,null,null,null,"Compared with EAL (GW) target concentration in mg/L",null,null,null,null,"Compared with EAL (River Enborne) target concentration in mg/L"]
[null,0.26600000000000001,2.0000000000000001E-4,5.9999999999999995E-4,null,null,0.26600000000000001,2.0000000000000001E-4,5.9999999999999995E-4,null,null,0.26600000000000001,1.1999999999999999E-3,1E-3]
[]
["Time(years)","Species1","Species2","Species3",null,"Time(years)","Species1","Species2","Species3",null,"Time(years)","Species1","Species2","Species3"]
[null,"Ammoniacial Nitrogen","Lead","Antimony",null,null,"Ammoniacial Nitrogen","Lead","Antimony",null,null,"Ammoniacial Nitrogen","Lead","Antimony"]
[10,0,0,4.6769188393062662E-4,null,10,0,0,4.6419848587778931E-4,null,10,0,0,3.3793540877325017E-7]
[20,0,0,6.8150175894104276E-4,null,20,0,0,6.7649300795767956E-4,null,20,0,0,4.9422434820995658E-7]
[30,0,0,7.2208948836924931E-4,null,30,0,0,7.1679319410533052E-4,null,30,0,0,5.2389548037967933E-7]
[40,0,0,7.2917503387660073E-4,null,40,0,0,7.2382883525113901E-4,null,40,0,0,5.290817192689623E-7]
[50,0,0,7.2918271389181381E-4,null,50,0,0,7.2383691434870564E-4,null,50,0,0,5.2909731618362928E-7]
[60,0,0,7.275725712023066E-4,null,60,0,0,7.222386841018014E-4,null,60,0,0,5.2793137140693669E-7]
[70,0,0,7.2557446906556958E-4,null,70,0,0,7.2025525714230522E-4,null,70,0,0,5.2648212856995537E-7]
[80,0,0,7.2348290827160832E-4,null,80,0,0,7.1817903660632983E-4,null,80,0,0,5.2496462977020946E-7]
[90,0,0,7.213715756678393E-4,null,90,0,0,7.160831840770797E-4,null,90,0,0,5.2343267149016978E-7]
[100,0,0,7.192595140458406E-4,null,100,0,0,7.1398660652453297E-4,null,100,0,0,5.2190015455146097E-7]
[110,0,0,7.1715176089641778E-4,null,110,0,0,7.1189430549716958E-4,null,110,0,0,5.2037075590299084E-7]
[120,0,0,7.1504966613935759E-4,null,120,0,0,7.0980762128111381E-4,null,120,0,0,5.1884546084537823E-7]
[130,0,0,7.1295358791911877E-4,null,130,0,0,7.077269094666682E-4,null,130,0,0,5.1732453082885885E-7]
[140,0,0,7.1086361304679166E-4,null,140,0,0,7.0565225624971359E-4,null,140,0,0,5.1580802927811692E-7]
[150,0,0,7.0877975307206444E-4,null,150,0,0,7.0358367309922515E-4,null,150,0,0,5.1429596469443463E-7]
[160,0,0,7.0670199844849739E-4,null,160,0,0,7.0152115054006097E-4,null,160,0,0,5.1278833018709794E-7]
[170,0,0,7.0463033368758292E-4,null,170,0,0,6.9946467319919757E-4,null,170,0,0,5.1128511452488501E-7]
[180,0,0,7.0256474163042941E-4,null,180,0,0,6.9741422404489021E-4,null,180,0,0,5.09786305261484E-7]
[190,0,0,7.0050520467836727E-4,null,190,0,0,6.9536978560065185E-4,null,190,0,0,5.0829188962928341E-7]
[200,0,0,6.9845170514090129E-4,null,200,0,0,6.9333134031500094E-4,null,200,0,0,5.0680185478977735E-7]
[210,0,0,6.964042253358978E-4,null,210,0,0,6.9129887062936376E-4,null,210,0,0,5.0531618791303938E-7]
[220,0,0,6.9436274762553507E-4,null,220,0,0,6.8927235903829356E-4,null,220,0,0,5.0383487620251333E-7]
[230,0,0,6.9232725441211742E-4,null,230,0,0,6.8725178807087586E-4,null,230,0,0,5.0235790688967495E-7]
[240,0,0,6.9029772815831206E-4,null,240,0,0,6.8523714031834028E-4,null,240,0,0,5.0088526724601973E-7]
[250,0,0,6.8827415137096275E-4,null,250,0,0,6.8322839841569206E-4,null,250,0,0,4.9941694458038739E-7]
[260,0,0,6.8625650660611014E-4,null,260,0,0,6.8122554505007618E-4,null,260,0,0,4.9795292623692439E-7]
[270,0,0,6.8424477648004083E-4,null,270,0,0,6.7922856296202903E-4,null,270,0,0,4.9649319959689176E-7]
[280,0,0,6.8223894365285881E-4,null,280,0,0,6.7723743493808177E-4,null,280,0,0,4.9503775208522122E-7]
[290,0,0,6.802389908325872E-4,null,290,0,0,6.7525214381445741E-4,null,290,0,0,4.9358657114878495E-7]
[300,0,0,6.7824490078947626E-4,null,300,0,1.0171481118534195E-40,6.7327267249131333E-4,null,300,0,0,4.9213964428815081E-7]
[310,0,0,6.7625665633001949E-4,null,310,0,0,6.7129900389397757E-4,null,310,0,0,4.9069695902845491E-7]
[320,0,3.9053188220893292E-40,6.742742403224748E-4,null,320,0,3.193505124684305E-40,6.6933112102396505E-4,null,320,0,0,4.8925850293742475E-7]
[330,0,2.3002575474202131E-38,6.72297635680812E-4,null,330,0,2.2619233032985663E-38,6.6736900691387812E-4,null,330,0,0,4.8782426361788231E-7]
[340,0,1.0871549281961128E-37,6.7032682536645612E-4,null,340,0,1.071738912461662E-37,6.6541264465292869E-4,null,340,0,0,4.8639422870491526E-7]
[350,0,4.4255910260648106E-37,6.683617923974297E-4,null,350,0,4.3469997798962143E-37,6.6346201738390418E-4,null,350,0,2.3995020084052743E-40,4.8496838587877487E-7]
[360,0,2.1487690722697538E-36,6.6640251983479735E-4,null,360,0,2.1097526347433075E-36,6.6151710829347578E-4,null,360,0,1.1185290975582899E-39,4.8354672284707676E-7]
[370,0,9.8789689345926377E-36,6.6444899079435215E-4,null,370,0,9.7198972370697978E-36,6.5957790061681014E-4,null,370,0,5.4607579688836755E-39,4.8212922735773933E-7]
[380,0,3.79200494305051E-35,6.6250118843723762E-4,null,380,0,3.7377234282758693E-35,6.5764437763921242E-4,null,380,0,2.2203308045016172E-38,4.8071588719371097E-7]
[390,0,1.2337884476620421E-34,6.605590959752666E-4,null,390,0,1.2176181035673158E-34,6.5571652270094718E-4,null,390,0,7.5026566800328799E-38,4.7930669017245583E-7]
[400,0,3.5223251125190387E-34,6.5862269667456709E-4,null,400,0,3.4796351498640122E-34,6.5379431918751504E-4,null,400,0,2.2040942013116873E-37,4.7790162415375117E-7]
[410,0,8.937229893687103E-34,6.5669197383977709E-4,null,410,0,8.8388901073201093E-34,6.5187775052405646E-4,null,410,0,5.7699351470358161E-37,4.7650067702075218E-7]
[420,0,1.9856356629565307E-33,6.5476691083491334E-4,null,420,0,1.9667412702972892E-33,6.4996680019857394E-4,null,420,0,1.3365739832223836E-36,4.751038367029797E-7]
[430,0,3.6905782736074964E-33,6.528474910636108E-4,null,430,0,3.6636430890103894E-33,6.4806145173367403E-4,null,430,0,2.6414020233256175E-36,4.737110911586757E-7]
[440,0,5.0724729701513546E-33,6.509336979925853E-4,null,440,0,5.0582909786968975E-33,6.461616887242813E-4,null,440,0,4.0785436301773574E-36,4.7232242839099814E-7]
[450,0,2.3344162191423836E-33,6.4902551511446379E-4,null,450,0,2.4066011900422015E-33,6.4426749477585756E-4,null,450,0,3.4303674783606586E-36,4.7093783642101777E-7]
[460,0,0,6.4712292599409995E-4,null,460,0,0,6.4237885357833061E-4,null,460,0,0,4.6955730332474458E-7]
[470,0,0,6.4522591422591516E-4,null,470,0,0,6.4049574884536781E-4,null,470,0,0,4.6818081719745466E-7]
[480,0,0,6.4333446346703479E-4,null,480,0,0,6.3861816435267608E-4,null,480,0,0,4.6680836617936726E-7]
[490,0,0,6.4144855740656283E-4,null,490,0,0,6.3674608391093733E-4,null,490,0,0,4.6543993843930316E-7]
[500,0,0,6.395681798040721E-4,null,500,0,0,6.3487949139883902E-4,null,500,0,0,4.6407552218904967E-7]
[510,0,0,6.3769331443702909E-4,null,510,0,0,6.3301837071146245E-4,null,510,0,0,4.6271510565804818E-7]
[520,0,0,6.3582394515883508E-4,null,520,0,0,6.3116270581994123E-4,null,520,0,0,4.6135867713118144E-7]
[530,0,0,6.3396005585227889E-4,null,530,0,0,6.2931248072687468E-4,null,530,0,0,4.6000622491308443E-7]
[540,0,1.6631159286651832E-30,6.3210163045495944E-4,null,540,0,1.6183125430004232E-30,6.2746767948622395E-4,null,540,0,5.1576689685355505E-34,4.5865773734886556E-7]
[550,0,7.341243859818024E-30,6.3024865294736851E-4,null,550,0,7.2349292573824391E-30,6.256282861983732E-4,null,550,0,4.1764313667609328E-33,4.5731320281415788E-7]
[560,0,1.7991026245715066E-29,6.2840110736391475E-4,null,560,0,1.7790233704200667E-29,6.2379428501366534E-4,null,560,0,1.1481760604562801E-32,4.5597260972624463E-7]
[570,0,3.4720245098839315E-29,6.2655897777307782E-4,null,570,0,3.4399921088157856E-29,6.2196566011326194E-4,null,570,0,2.3570507181836011E-32,4.5463594652261849E-7]
[580,0,5.6649518266567063E-29,6.2472224830499004E-4,null,580,0,5.6217544686234499E-29,6.2014239575014399E-4,null,580,0,4.0380059954515519E-32,4.5330320168987491E-7]
[590,0,7.8831009483212761E-29,6.2289090312846E-4,null,590,0,7.8366954076415565E-29,6.1832447620595299E-4,null,590,0,5.9118604961341345E-32,4.5197436373882548E-7]
[600,0,8.9792077868436361E-29,6.2106492645810116E-4,null,600,0,8.9496386444798307E-29,6.165118858095747E-4,null,600,0,7.2335489043270062E-32,4.5064942121805952E-7]
[610,0,6.9434448755442525E-29,6.1924430255826557E-4,null,610,0,6.9677150207539701E-29,6.14704608941794E-4,null,610,0,6.6063592335634276E-32,4.4932836270702491E-7]
[620,0,0,6.174290157318136E-4,null,620,0,0,6.1290263002332888E-4,null,620,0,1.8901690646373391E-32,4.4801117681802363E-7]
[630,0,0,6.1561905034015064E-4,null,630,0,0,6.1110593352886003E-4,null,630,0,0,4.4669785220302844E-7]
[640,0,0,6.1381439077908136E-4,null,640,0,0,6.093145039664349E-4,null,640,0,0,4.4538837753763244E-7]
[650,0,0,6.1201502150129395E-4,null,650,0,0,6.0752832590705165E-4,null,650,0,0,4.4408274154193394E-7]
[660,0,0,6.102209269906988E-4,null,660,0,0,6.0574738394263085E-4,null,660,0,0,4.4278093295629474E-7]
[670,0,0,6.0843209178896521E-4,null,670,0,0,6.0397166273017436E-4,null,670,0,0,4.414829405668556E-7]
[680,0,0,6.0664850047639361E-4,null,680,0,0,6.0220114696469022E-4,null,680,0,0,4.4018875317914228E-7]
[690,0,0,6.0487013768229035E-4,null,690,0,0,6.0043582138927742E-4,null,690,0,0,4.3889835964836976E-7]
[700,0,0,6.0309698808102294E-4,null,700,0,0,5.9867567078554843E-4,null,700,0,0,4.3761174884977321E-7]
[710,0,0,6.0132903638843854E-4,null,710,0,0,5.969206799849308E-4,null,710,0,0,4.3632890969128466E-7]
[720,0,2.8896069074381013E-27,5.995662673648199E-4,null,720,0,2.8309415183491899E-27,5.9517083385962535E-4,null,720,0,1.2581108869131991E-30,4.3504983111853521E-7]
[730,0,8.4057762764711969E-27,5.9780866582164263E-4,null,730,0,8.3015587030831069E-27,5.9342611733128215E-4,null,730,0,5.1215860173632271E-30,4.3377450210827614E-7]
[740,0,1.6156339948056717E-26,5.9605621660738088E-4,null,740,0,1.5997207698284516E-26,5.9168651536297605E-4,null,740,0,1.0752219135442124E-29,4.3250291166469715E-7]
[750,0,2.5907397393644387E-26,5.9430890461876216E-4,null,750,0,2.5689965972809808E-26,5.8995201295496168E-4,null,750,0,1.8077044116047417E-29,4.3123504883395743E-7]
[760,0,3.6840175480481817E-26,5.9256671479793427E-4,null,760,0,3.657138428514935E-26,5.8822259516876768E-4,null,760,0,2.6602884787071803E-29,4.2997090268533247E-7]
[770,0,4.7389436932843394E-26,5.908296321295982E-4,null,770,0,4.7091216235849631E-26,5.8649824708988726E-4,null,770,0,3.5280297406485493E-29,4.287104623276943E-7]
[780,0,5.5145308441687723E-26,5.8909764163925921E-4,null,780,0,5.4858861833270306E-26,5.84778953860505E-4,null,780,0,4.2407700306393495E-29,4.27453716891244E-7]
[790,0,5.6863772315606823E-26,5.8737072840458798E-4,null,790,0,5.6652547001196913E-26,5.8306470066405466E-4,null,790,0,4.5610802251478678E-29,4.262006555498934E-7]
[800,0,4.8628992354683126E-26,5.8564887753440552E-4,null,800,0,4.8579264070726694E-26,5.8135547272137862E-4,null,800,0,4.1932363304213364E-29,4.2495126749885931E-7]
[810,0,2.6200659864902679E-26,5.8393207419573463E-4,null,810,0,2.6418635943348102E-26,5.7965125530546203E-4,null,810,0,2.8061271690562994E-29,4.2370554197518215E-7]
[820,0,0,5.8222030358768943E-4,null,820,0,0,5.7795203372521453E-4,null,820,0,7.1729038158558405E-31,4.2246346823919794E-7]
[830,0,0,5.8051355095870688E-4,null,830,0,0,5.7625779333754859E-4,null,830,0,0,4.2122503558473211E-7]
[840,0,0,5.7881180159823032E-4,null,840,0,0,5.7456851953890963E-4,null,840,0,0,4.1999023334241549E-7]
[850,0,0,5.7711504083982046E-4,null,850,0,0,5.7288419777055868E-4,null,850,0,0,4.1875905086549633E-7]
[860,0,0,5.7542325405775187E-4,null,860,0,0,5.7120481351361104E-4,null,860,0,0,4.1753147754678451E-7]
[870,0,0,5.7373642667676145E-4,null,870,0,0,5.6953035230275235E-4,null,870,0,0,4.1630750280283254E-7]
[880,0,0,5.7205454415452158E-4,null,880,0,0,5.6786079969844516E-4,null,880,0,0,4.1508711608766237E-7]
[890,2.5815365096520559E-40,0,5.7037759199058584E-4,null,890,2.4132541036782925E-40,0,5.6619614130836696E-4,null,890,0,0,4.1387030687938631E-7]
[900,5.4575942805573034E-40,0,5.6870555573913112E-4,null,900,5.3513177269441318E-40,0,5.6453636278955234E-4,null,900,0,0,4.1265706469364828E-7]
[910,8.5677873912141228E-40,0,5.6703842098634405E-4,null,910,8.6848136537453702E-40,0,5.6288144984007805E-4,null,910,0,0,4.1144737907044113E-7]
[920,1.0111289988311044E-39,0,5.6537617336563394E-4,null,920,1.0656867374971453E-39,0,5.6123138819236436E-4,null,920,0,0,4.1024123959230933E-7]
[930,7.1654964544209278E-40,0,5.6371879854960573E-4,null,930,8.2954774541393713E-40,0,5.595861636293613E-4,null,930,0,0,4.090386358550942E-7]
[940,0,1.2689338131386841E-25,5.6206628225157732E-4,null,940,0,1.2092061199757218E-25,5.5794576196439123E-4,null,940,0,0,4.0783955749509336E-7]
[950,0,7.1695340082309569E-25,5.6041861023093862E-4,null,950,0,7.0648026441626559E-25,5.5631016906034652E-4,null,950,0,4.0028823934946319E-28,4.0664399417945984E-7]
[960,0,1.4691260609512109E-24,5.5877576828875528E-4,null,960,0,1.4534524060229956E-24,5.5467937083082295E-4,null,960,0,9.5096934195375284E-28,4.0545193560553909E-7]
[970,0,2.3667054180635673E-24,5.5713774226468925E-4,null,970,0,2.3453840697428271E-24,5.5305335321188115E-4,null,970,0,1.6208296861641758E-27,4.0426337149851213E-7]
[980,0,3.3741805155783333E-24,5.555045180342706E-4,null,980,0,3.3471339562697986E-24,5.5143210218275502E-4,null,980,0,2.3867147697585539E-27,4.0307829161086415E-7]
[990,0,4.4353230618356246E-24,5.5387608153442507E-4,null,990,0,4.402958954306243E-24,5.4981560378750366E-4,null,990,0,3.2096658540399969E-27,4.0189668573417582E-7]
[1000,1.6537672206524914E-38,5.4726060405857825E-24,5.5225241872130983E-4,null,1000,1.3272788631633799E-38,5.435921869183418E-24,5.4820384408241197E-4,null,1000,0,4.0341498149133545E-27,4.0071854368033105E-7]
[1010,5.3136004025901876E-38,6.3882567196571029E-24,5.5063351559946939E-4,null,1010,4.8145307970971913E-38,6.3489229013074379E-24,5.4659680917580741E-4,null,1010,0,4.7885004030522151E-27,3.9954385529825046E-7]
[1020,1.1600086723872367E-37,7.0671626316019447E-24,5.4901935822163192E-4,null,1020,1.0886671878002604E-37,7.0275732121159226E-24,5.4499448522031589E-4,null,1020,0,5.38676064267048E-27,3.9837261046083408E-7]
[1030,2.1398582805554935E-37,7.3817363998975061E-24,5.4740993267259259E-4,null,1030,2.0399949592941928E-37,7.3450170001707048E-24,5.4339685840632695E-4,null,1030,0,5.7320337734187009E-27,3.972047990758568E-7]
[1040,3.5855003745542054E-37,7.198711192251865E-24,5.4580522508376002E-4,null,1040,3.4414204570851234E-37,7.1686752486304925E-24,5.4180391496269132E-4,null,1040,0,5.7213497561160094E-27,3.9604041107682308E-7]
[1050,5.683109527264077E-37,6.3876915956880473E-24,5.4420522162467984E-4,null,1050,5.4597718295855967E-37,6.3687381375723906E-24,5.4021564116543859E-4,null,1050,1.2430393096191318E-40,5.2519421611799948E-27,3.9487943643186035E-7]
[1060,8.7883064350114111E-37,4.8311348005554199E-24,5.4260990849965755E-4,null,1060,8.4135933069556204E-37,4.8280839539651513E-24,5.3863202331451193E-4,null,1060,2.7073488898968663E-40,4.228713753851603E-27,3.937218651289839E-7]
[1070,1.3603433104301401E-36,2.43529486401417E-24,5.4101927196333771E-4,null,1070,1.2941439053913929E-36,2.4531608339827925E-24,5.3705304777134245E-4,null,1070,4.7465613043242807E-40,2.5725565150684952E-27,3.9256768719324099E-7]
[1080,2.1464844625236932E-36,0,5.3943329830860522E-4,null,1080,2.0278244375914019E-36,0,5.3547870092354429E-4,null,1080,7.3337171265131258E-40,2.2909152906058905E-28,3.9141689268155336E-7]
[1090,3.4772486055333178E-36,0,5.3785197386465537E-4,null,1090,3.267203256566041E-36,0,5.3390896920288953E-4,null,1090,1.044006881001087E-39,0,3.9026947167150448E-7]
[1100,5.7594450493329549E-36,0,5.3627528500251162E-4,null,1100,5.3973331455094717E-36,0,5.323438390829958E-4,null,1100,1.4198466323750485E-39,0,3.8912541427261504E-7]
[1110,9.6480166143587224E-36,0,5.3470321813273191E-4,null,1110,9.0430002460620736E-36,0,5.3078329706869782E-4,null,1110,1.9213489831690129E-39,0,3.8798471063026482E-7]
[1120,1.6152018647219727E-35,0,5.331357597068157E-4,null,1120,1.5172359625810362E-35,0,5.2922732971484717E-4,null,1120,2.7057882557990055E-39,0,3.8684735090681385E-7]
[1130,2.6770173550172185E-35,0,5.3157289621316738E-4,null,1130,2.5229346466018712E-35,0,5.2767592361178234E-4,null,1130,4.0983681701596715E-39,0,3.8571332530245394E-7]
[1140,4.3663032440605803E-35,0,5.3001461418422896E-4,null,1140,4.1301511658177375E-35,0,5.2612906538103291E-4,null,1140,6.6860773934682642E-39,0,3.845826240437068E-7]
[1150,6.9872022942145287E-35,0,5.284609001855844E-4,null,1150,6.6333150610493516E-35,0,5.2458674169247009E-4,null,1150,1.1434047482787527E-38,0,3.8345523738082263E-7]
[1160,1.0959980827027486E-34,0,5.2691174083436068E-4,null,1160,1.0439783829796634E-34,0,5.230489392624363E-4,null,1160,1.9823472395832001E-38,0,3.8233115560681993E-7]
[1170,1.6857063795758931E-34,0,5.2536712277448882E-4,null,1170,1.6104903260403515E-34,0,5.2151564483301767E-4,null,1170,3.4011165756241023E-38,0,3.8121036902506532E-7]
[1180,2.544922237971988E-34,0,5.2382703269120558E-4,null,1180,2.4377081855053686E-34,0,5.1998684518540848E-4,null,1180,5.7014424401291977E-38,0,3.8009286797906869E-7]
[1190,3.776398045830294E-34,0,5.2229145731407163E-4,null,1190,3.6255086839389838E-34,0,5.1846252714143567E-4,null,1190,9.2931558201612326E-38,0,3.7897864283982482E-7]
[1200,5.5157536691484619E-34,0,5.2076038340490331E-4,null,1200,5.3059120487876612E-34,0,5.1694267756883421E-4,null,1200,1.4721807949490489E-37,0,3.7786768399974499E-7]
[1210,7.9399675893115979E-34,0,5.1923379777181759E-4,null,1210,7.651556479565535E-34,0,5.1542728336838794E-4,null,1210,2.2704992737364659E-37,0,3.7675998188537715E-7]
[1220,1.1276786921354609E-33,0,5.1771168725626884E-4,null,1220,1.088521850325293E-33,0,5.1391633147884156E-4,null,1220,3.4181571798538318E-37,0,3.7565552695016793E-7]
[1230,1.5814166028588623E-33,0,5.1619403873566397E-4,null,1230,1.5289566915490195E-33,0,5.1240980887536298E-4,null,1230,5.0378590264907851E-37,0,3.74554309672546E-7]
[1240,2.1908120469888467E-33,0,5.1468083913704154E-4,null,1240,2.1215633461572934E-33,0,5.109077025749005E-4,null,1240,7.290026014045105E-37,0,3.7345632056485298E-7]
[1250,2.9986431166282951E-33,1.5226051840007273E-23,5.1317207541232189E-4,null,1250,2.9087547587974033E-33,1.4902540244636775E-23,5.0940999963068167E-4,null,1250,1.0384135918109135E-36,6.2018136208168011E-27,3.7236155016473032E-7]
[1260,4.054445618510957E-33,4.0320144822596707E-23,5.116677345625984E-4,null,1260,3.9399916611012255E-33,3.9825685868029794E-23,5.0791668713418524E-4,null,1260,1.4592311581263326E-36,2.4667755757623383E-26,3.7126998903383121E-7]
[1270,5.4127931452372345E-33,6.8853979682882297E-23,5.1016780362009328E-4,null,1270,5.270286142288572E-33,6.8173925750910835E-23,5.0642775221939283E-4,null,1270,2.0264257851294953E-36,4.5868159034621493E-26,3.7018162776501392E-7]
[1280,7.1296120786142661E-33,1.0028846319184377E-22,5.0867226965731021E-4,null,1280,6.9568193097151749E-33,9.9412564655101797E-23,5.0494318205042182E-4,null,1280,2.7841625311980247E-36,6.9424081825627136E-26,3.6909645697808938E-7]
[1290,9.2557091767162576E-33,1.3390521292202976E-22,5.07181119786323E-4,null,1290,9.0528617298342853E-33,1.3282845024874149E-22,5.03462963830562E-4,null,1290,3.7868538943972963E-36,9.481603509479471E-26,3.6801446732250168E-7]
[1300,1.1826535734791048E-32,1.688181122793242E-22,5.0569434115306088E-4,null,1300,1.1598028926821083E-32,1.6754135829372671E-22,5.0198708480554731E-4,null,1300,5.0993404902855741E-36,1.2139048602913314E-25,3.6693564946992225E-7]
[1310,1.4847077225756051E-32,2.0399430537474424E-22,5.0421192094575831E-4,null,1310,1.4603764821105809E-32,2.0252475097996649E-22,5.0051553225497511E-4,null,1310,6.7955274816826563E-36,1.4837328730599358E-25,3.6585999412458235E-7]
[1320,1.827065756635144E-32,2.3828523562000387E-22,5.0273384638531806E-4,null,1320,1.8032840013320511E-32,2.3663650702897258E-22,4.9904829349211243E-4,null,1320,8.9546120245962027E-36,1.7489046079341617E-25,3.6478749201191488E-7]
[1330,2.1970402606434394E-32,2.7046822204750591E-22,5.0126010473303454E-4,null,1330,2.1771598682870652E-32,2.6866011182324771E-22,4.9758535587154202E-4,null,1330,1.165384985513438E-35,1.9999665695380147E-25,3.6371813388959639E-7]
[1340,2.5702141606086797E-32,2.9929900483081396E-22,4.997906832907358E-4,null,1340,2.559371047871514E-32,2.9735673212818292E-22,4.9612670679049413E-4,null,1340,1.4956644466872219E-35,2.2271153226018658E-25,3.6265191054786999E-7]
[1350,2.9057666180349211E-32,3.2357569778709684E-22,4.9832556938723678E-4,null,1350,2.9114309237069477E-32,3.2152860439988319E-22,4.946723336689212E-4,null,1350,1.8894617838113372E-35,2.4206425214291436E-25,3.6158881278477685E-7]
[1360,3.1407546447308738E-32,3.4221468267419556E-22,4.9686475040084256E-4,null,1360,3.173366085338323E-32,3.4009425979747688E-22,4.9322222397983389E-4,null,1360,2.3442254789226709E-35,2.5714635163363064E-25,3.605288314504832E-7]
[1370,3.1833162803583412E-32,3.5433919041782185E-22,4.9540821374084471E-4,null,1370,3.256993627152332E-32,3.5217631531089925E-22,4.9177636521903826E-4,null,1370,2.8482720403576893E-35,2.6717328589781757E-25,3.5947195740109115E-7]
[1380,2.9048293979305972E-32,3.5938166522707989E-22,4.9395594685124977E-4,null,1380,3.0381316830355822E-32,3.5720290583377686E-22,4.9033474493215766E-4,null,1380,3.3763547734826155E-35,2.7155519723104949E-25,3.5841818153204196E-7]
[1390,2.1311558597380526E-32,3.5720152445732563E-22,4.9250793721976869E-4,null,1390,2.347857870228264E-32,3.5502434177220041E-22,4.8889735069037666E-4,null,1390,3.8841098470199222E-35,2.6997773131935582E-25,3.5736749476065183E-7]
[1400,6.3322930772566967E-33,3.4822063723886894E-22,4.9106417236153481E-4,null,1400,9.6305459587471309E-33,3.4604727802733956E-22,4.8746417010372072E-4,null,1400,4.3013032990341385E-35,2.6249417223891107E-25,3.5631988802919666E-7]
[1410,0,3.335797859460077E-22,4.8962463983555544E-4,null,1410,0,3.313896100347237E-22,4.8603519082395728E-4,null,1410,4.5238515561821208E-35,2.4963075815289363E-25,3.5527535230968606E-7]
[1420,0,3.1532057256468679E-22,4.8818932723379511E-4,null,1420,0,3.1306049665627653E-22,4.8461040052825868E-4,null,1420,4.4046562111763663E-35,2.3250780514912947E-25,3.5423387859993819E-7]
[1430,0,2.9659873556020501E-22,4.8675822218759011E-4,null,1430,0,2.9417139658715138E-22,4.8318978694465833E-4,null,1430,3.7433861176467841E-35,2.1298023785417789E-25,3.5319545792339164E-7]
[1440,0,2.8193668847427928E-22,4.8533131235870805E-4,null,1440,0,2.7918583028032767E-22,4.8177333782464224E-4,null,1440,2.2754625073544672E-35,1.9380232581130993E-25,3.5216008132897137E-7]
[1450,0,2.7752533400515403E-22,4.8390858545406399E-4,null,1450,0,2.7421779777413532E-22,4.8036104096224938E-4,null,1450,0,1.7882289090987712E-25,3.5112773989642767E-7]
[1460,0,2.9158790292723312E-22,4.8249002920802697E-4,null,1460,0,2.8739144944205975E-22,4.7895288418218856E-4,null,1460,0,1.7321901959894963E-25,3.5009842472518455E-7]
[1470,0,3.3482178066495767E-22,4.8107563139423987E-4,null,1470,0,3.2927778638933271E-22,4.7754885534824883E-4,null,1470,0,1.8377842761804686E-25,3.4907212694303283E-7]
[1480,0,4.2093809710147436E-22,4.7966537982871719E-4,null,1480,0,4.1342793945597001E-22,4.7614894236891486E-4,null,1480,0,2.1924313749070524E-25,3.4804883771094648E-7]
[1490,0,5.6732334368406849E-22,4.7825926235064986E-4,null,1490,0,5.570270172690761E-22,4.7475313317035871E-4,null,1490,0,2.9073009066534654E-25,3.470285482046073E-7]
[1500,0,7.9585256665710211E-22,4.7685726684016164E-4,null,1500,0,7.816977434643623E-22,4.7336141571984521E-4,null,1500,0,4.1224780786725745E-25,3.4601124962752832E-7]
[1510,0,1.1338898561790444E-21,4.7545938121768948E-4,null,1510,0,1.1144892093602625E-21,4.7197377802752401E-4,null,1510,0,6.0133229037000047E-25,3.4499693321859059E-7]
[1520,0,1.6155190689779338E-21,4.7406559343392572E-4,null,1520,0,1.5890932115444349E-21,4.7059020813267316E-4,null,1520,0,8.7983013156373905E-25,3.4398559023035595E-7]
[1530,0,2.2830561120107477E-21,4.7267589147732228E-4,null,1530,0,2.2473389466049882E-21,4.6921069411197137E-4,null,1530,0,1.2748623639021676E-24,3.4297721195022524E-7]
[1540,0,3.1889038701282512E-21,4.7129026336772842E-4,null,1540,0,3.1410264894455706E-21,4.6783522407180684E-4,null,1540,0,1.8200090318014516E-24,3.4197178968362098E-7]
[1550,0,4.397822159471963E-21,4.6990869716572207E-4,null,1550,0,4.3341706644472769E-21,4.6646378616165305E-4,null,1550,0,2.5567619761473503E-24,3.4096931476968334E-7]
[1560,0,5.9896981608925441E-21,4.6853118096185141E-4,null,1560,0,5.9057398565482847E-21,4.6509636856012764E-4,null,1560,0,3.5363019960679471E-24,3.3996977856364149E-7]
[1570,0,8.0629178745999672E-21,4.6715770288715262E-4,null,1570,0,7.9529892422590005E-21,4.6373295948316329E-4,null,1570,0,4.821666581675092E-24,3.3897317245485832E-7]
[1580,0,1.0738456508805136E-20,4.6578825110069847E-4,null,1580,0,1.0595505113522999E-20,4.6237354717800015E-4,null,1580,0,6.4903859703418658E-24,3.379794878508716E-7]
[1590,0,1.4164825695105613E-20,4.6442281379852936E-4,null,1590,0,1.3980096746753057E-20,4.6101811992740383E-4,null,1590,0,8.6376785903663064E-24,3.3698871618966619E-7]
[1600,0,1.8524038316729789E-20,4.6306137921690198E-4,null,1600,0,1.8286694929174855E-20,4.5966666605090856E-4,null,1600,0,1.1380312226864457E-23,3.3600084893064277E-7]
[1610,0,2.403877797085938E-20,4.6170393561897693E-4,null,1610,0,2.3735442224712677E-20,4.5831917390387269E-4,null,1610,0,1.4861254766182585E-23,3.3501587756080364E-7]
[1620,0,3.0980990014611133E-20,4.6035047130470592E-4,null,1620,0,3.0595189694027007E-20,4.5697563186609713E-4,null,1620,0,1.9255258393482403E-23,3.34033793588447E-7]
[1630,0,3.9682145269117825E-20,4.5900097461114173E-4,null,1630,0,3.9193648561532942E-20,4.556360283621942E-4,null,1630,0,2.4775543970200926E-23,3.3305458855154349E-7]
[1640,0,5.0545466269795202E-20,4.5765543390570001E-4,null,1640,0,4.9929483755216639E-20,4.543003518447682E-4,null,1640,0,3.1681778351139247E-23,3.3207825401088534E-7]
[1650,0,6.406044994951161E-20,4.5631383759229291E-4,null,1650,0,6.328667980664385E-20,4.5296859080166501E-4,null,1650,0,4.0289566948170626E-23,3.3110478154907262E-7]
[1660,1.8271701315440601E-30,8.0820070478502773E-20,4.5497617410853689E-4,null,1660,1.0196524504141784E-30,7.9851558944639636E-20,4.5164073376206576E-4,null,1660,0,5.0981717368782553E-23,3.3013416278093533E-7]
[1670,7.7421649391001602E-30,1.0154110228655055E-19,4.5364243192473435E-4,null,1670,6.7114998715816332E-30,1.003328869674407E-19,4.5031676926898611E-4,null,1670,0,6.4221567872744954E-23,3.2916638933597298E-7]
[1680,1.5683093308349725E-29,1.2708806672081367E-19,4.5231259954729545E-4,null,1680,1.4397598233719716E-29,1.2558556528823101E-19,4.4899668592170757E-4,null,1680,0,8.0568717173669909E-23,3.282014528776639E-7]
[1690,2.6015305687478374E-29,1.5850137711069374E-19,4.5098666551309495E-4,null,1690,2.4444941240303483E-29,1.5663847817249698E-19,4.4768047233992466E-4,null,1690,0,1.0069754027544677E-22,3.2723934508401838E-7]
[1700,3.9115728445830534E-29,1.97030337088144E-19,4.4966461839304961E-4,null,1700,3.7234172827850346E-29,1.94727143492448E-19,4.4636811717704535E-4,null,1700,0,1.2541892919013409E-22,3.2628005766872804E-7]
[1710,5.5358540489109936E-29,2.4417173664129311E-19,4.4834644679760062E-4,null,1710,5.3145750618100394E-29,2.4133190409125117E-19,4.4505960912779598E-4,null,1710,3.574388432809859E-33,1.5570575808845461E-22,3.253235823582397E-7]
[1720,7.5096483352000476E-29,3.0171489043300412E-19,4.4703213935864684E-4,null,1720,7.2541769567775316E-29,2.9822249594284342E-19,4.4375493690271262E-4,null,1720,1.1649880310623788E-32,1.9272264027568929E-22,3.2436991091280937E-7]
[1730,9.8637372246568647E-29,3.7179407472426825E-19,4.4572168475871083E-4,null,1730,9.5742998042608002E-29,3.6750994004342842E-19,4.4245408927539242E-4,null,1730,2.237650478856281E-32,2.3786062031408134E-22,3.234190351169056E-7]
[1740,1.2621546597521728E-28,4.5694944323175663E-19,4.4441507169339973E-4,null,1740,1.2300076472144664E-28,4.5170682777771249E-19,4.4115705502192551E-4,null,1740,3.6209635431769286E-32,2.9277752890516566E-22,3.2247094676667921E-7]
[1750,1.5795747998137441E-28,5.6019764040701914E-19,4.4311228890744669E-4,null,1750,1.5446345668787151E-28,5.5379720636327983E-19,4.39863822963361E-4,null,1750,5.3613549708803541E-32,3.5944482220630977E-22,3.2152563769495961E-7]
[1760,1.9384319192956575E-28,6.8511348314218428E-19,4.4181332517221873E-4,null,1760,1.9013754975306445E-28,6.7731742204976042E-19,4.3857438196032226E-4,null,1760,7.5042504648153297E-32,4.4020183120360672E-22,3.2058309975669418E-7]
[1770,2.3366079495183868E-28,8.3592425128890649E-19,4.4051816928560982E-4,null,1770,2.2984329351715701E-28,8.2644944657413451E-19,4.3728872088891874E-4,null,1770,1.0091647506423375E-31,5.3781846236661689E-22,3.1964332482112254E-7]
[1780,2.7695740075565133E-28,1.0176183133909526E-18,4.392268100898514E-4,null,1780,2.7316541679815381E-28,1.0061283966024012E-18,4.3600682867801191E-4,null,1780,1.3159110245858863E-31,6.5556751789167245E-22,3.1870630479428949E-7]
[1790,3.229853824212665E-28,1.2360700200298037E-18,4.3793923645909887E-4,null,1790,3.1939950331758717E-28,1.2221661600458582E-18,4.3472869427470853E-4,null,1790,1.6732152662596614E-31,7.9730794477371297E-22,3.1777203160175902E-7]
[1800,3.7064557254256925E-28,1.4981830225565892E-18,4.3665543729287399E-4,null,1800,3.6749501078433508E-28,1.4813932663585873E-18,4.3345430667049195E-4,null,1800,2.0821993780897511E-31,9.6758047627296191E-22,3.1684049718946584E-7]
[1810,4.1842869216178684E-28,1.8120544233429466E-18,4.353754015250433E-4,null,1810,4.1599626478826408E-28,1.7918213840564527E-18,4.3218365487242868E-4,null,1810,2.5420689742307252E-31,1.1717172996476238E-21,3.159116935286893E-7]
[1820,4.6435677349163395E-28,2.1871624348550406E-18,4.3409911812279845E-4,null,1820,4.6298314623245302E-28,2.1628290973514795E-18,4.3091672793329854E-4,null,1820,3.0495673121999282E-31,1.4159675701236347E-21,3.149856126126906E-7]
[1830,5.0592674637094284E-28,2.6345805221390621E-18,4.3282657608972115E-4,null,1830,5.0601359930893496E-28,2.6053739083630742E-18,4.2965351493284327E-4,null,1830,3.5983760015685116E-31,1.7076407953770562E-21,3.1406224646136756E-7]
[1840,5.4005877424898715E-28,3.1672213272883522E-18,4.315577644577857E-4,null,1840,5.4207050598161697E-28,3.1322337324410215E-18,4.2839400498709702E-4,null,1840,4.1784719940826003E-31,2.0552703376313254E-21,3.1314158711671558E-7]
[1850,5.6305233757123013E-28,3.8001140275046281E-18,4.3029267228937053E-4,null,1850,5.6751589012552893E-28,3.7582815039152354E-18,4.271381872361113E-4,null,1850,4.7754542123267668E-31,2.468799523601099E-21,3.1222362664366743E-7]
[1860,5.7055345599716408E-28,4.5507191630070288E-18,4.2903128867843762E-4,null,1860,5.7805581531306316E-28,4.5007968908343194E-18,4.2588605085639667E-4,null,1860,5.3698573702964656E-31,2.9597931176239106E-21,3.1130835712874427E-7]
[1870,5.5753679927129797E-28,5.4392853877972475E-18,4.2777360275939074E-4,null,1870,5.6871970821908685E-28,5.3798195301827182E-18,4.2463758506198682E-4,null,1870,5.9364749991674031E-31,3.541677200898992E-21,3.1039577068658811E-7]
[1880,5.1830674149927761E-28,6.489253049079668E-18,4.2651960368923796E-4,null,1880,5.3385815651885816E-28,6.4185486438855802E-18,4.2339277908388066E-4,null,1880,6.4437183119530372E-31,4.2300108124934145E-21,3.0948585944909498E-7]
[1890,4.4652164546188459E-28,7.7277099905836654E-18,4.2526928066167715E-4,null,1890,4.6716347639018382E-28,7.6437943808893955E-18,4.221516222041452E-4,null,1890,6.8530421947592574E-31,5.0427930461418221E-21,3.0857861557836027E-7]
[1900,3.3524580199672818E-28,9.1859055042368912E-18,4.2402262289880049E-4,null,1900,3.6171749979736858E-28,9.086486755228262E-18,4.2091410371432428E-4,null,1900,7.1184741499009324E-31,6.0008096631229485E-21,3.076740312507657E-7]
[1910,1.7703347362420622E-28,1.0899828925883789E-17,4.2277961965652203E-4,null,1910,2.1007107470337034E-28,1.0782248616022428E-17,4.1968021295819781E-4,null,1910,7.1862862651734482E-31,7.1280236771777178E-21,3.0677209866989927E-7]
[1920,0,1.2910859985664845E-17,4.2154026022689258E-4,null,1920,4.3596815070418042E-30,1.2772039694989034E-17,4.1844993929949435E-4,null,1920,6.9948540523153119E-31,8.4520147937695365E-21,3.0587281006805481E-7]
[1930,0,1.5266498685773288E-17,4.2030453391954392E-4,null,1930,0,1.510287943320299E-17,4.1722327212901489E-4,null,1930,6.474749077852968E-31,1.00044730455253E-20,3.0497615768620755E-7]
[1940,0,1.8021183188913252E-17,4.1907243009145295E-4,null,1940,0,1.7828656993317469E-17,4.1600020088063155E-4,null,1940,5.5491144805010817E-31,1.1821752459194314E-20,3.0408213380389601E-7]
[1950,0,2.1237204963402535E-17,4.1784393811522362E-4,null,1950,0,2.101103761931735E-17,4.1478071500870476E-4,null,1950,4.1343735035117161E-31,1.394549111980402E-20,3.0319073070821389E-7]
[1960,0,2.4985731247504616E-17,4.1661904740838832E-4,null,1960,0,2.4720475315476035E-17,4.1356480400136348E-4,null,1960,2.1413208392048662E-31,1.6423304565739923E-20,3.0230194072065563E-7]
[1970,0,2.9347945768475444E-17,4.1539774741582549E-4,null,1970,0,2.9037342681473147E-17,4.1235245738524106E-4,null,1970,0,1.9309560056633863E-20,3.0141575618259301E-7]
[1980,0,3.441631958520743E-17,4.1418002761307756E-4,null,1980,0,3.4053189665981587E-17,4.1114366471217174E-4,null,1980,0,2.2666239906360661E-20,3.0053216945808197E-7]
[1990,0,4.0296024917038171E-17,4.1296587749625762E-4,null,1990,0,3.987214398605773E-17,4.0993841555614547E-4,null,1990,0,2.6563902766774868E-20,2.9965117292276243E-7]
[2000,0,4.7106505881978487E-17,4.1175528660822541E-4,null,2000,0,4.6612467011371716E-17,4.0873669953839898E-4,null,2000,0,3.108275248838908E-20,2.9877275899373802E-7]
[2010,0,5.4983221192946672E-17,4.1054824450776137E-4,null,2010,0,5.4408280027894443E-17,4.0753850628924337E-4,null,2010,0,3.6313824970496742E-20,2.9789692008971411E-7]
[2020,0,6.4079575058484287E-17,4.0934474080394831E-4,null,2020,0,6.3411476983356858E-17,4.0634382549755647E-4,null,2020,0,4.2360304251004112E-20,2.97023648674246E-7]
[2030,0,7.456905380369629E-17,4.0814476511377679E-4,null,2030,0,7.3793841075191367E-17,4.0515264685561734E-4,null,2030,0,4.9338979974690481E-20,2.9615293721243054E-7]
[2040,0,8.664758707184481E-17,4.069483070962374E-4,null,2040,0,8.5749383875046916E-17,4.0396496009735105E-4,null,2040,0,5.7381859320293298E-20,2.9528477820101246E-7]
[2050,0,1.0053615389089348E-16,4.0575535644384801E-4,null,2050,0,9.9496927095692936E-17,4.0278075499160752E-4,null,2050,0,6.6637947465148693E-20,2.9441916415844572E-7]
[2060,0,1.1648365539247356E-16,4.0456590287057319E-4,null,2060,0,1.1528294859657758E-16,4.0160002133222597E-4,null,2060,0,7.7275211720570243E-20,2.9355608762388814E-7]
[2070,0,1.347700775591642E-16,4.0337993613029426E-4,null,2070,0,1.3338471579954494E-16,4.0042274893968701E-4,null,2070,0,8.9482745586256579E-20,2.9269554116285123E-7]
[2080,0,1.5570996904742369E-16,4.0219744599819999E-4,null,2080,0,1.5411373134330836E-16,3.9924892766568098E-4,null,2080,0,1.0347315014655802E-19,2.9183751735425569E-7]
[2090,0,1.7965626089670515E-16,4.0101842227921588E-4,null,2090,0,1.7781951755410939E-16,3.9807854739807279E-4,null,2090,0,1.1948515147079762E-19,2.9098200880053296E-7]
[2100,0,2.0700445678816002E-16,3.9984285481989811E-4,null,2100,0,2.0489376814715033E-16,3.9691159804793275E-4,null,2100,0,1.377864739840861E-19,2.9012900813633834E-7]
[2110,0,2.3819722445960855E-16,3.9867073348017574E-4,null,2110,0,2.3577489750039171E-16,3.9574806955653519E-4,null,2110,0,1.5867699114292837E-19,2.8927850800335123E-7]
[2120,0,2.7372942092917823E-16,3.9750204816131726E-4,null,2120,0,2.7095301987154558E-16,3.9458795189479981E-4,null,2120,0,1.8249217619157627E-19,2.8843050106946376E-7]
[2130,0,3.1415358631477074E-16,3.9633678879075727E-4,null,2130,0,3.1097539304558726E-16,3.9343123506600553E-4,null,2130,0,2.0960687728060953E-19,2.8758498003268377E-7]
[2140,0,3.6008594327781443E-16,3.9517494532465111E-4,null,2140,0,3.5645236312337526E-16,3.922779091014538E-4,null,2140,0,2.4043944281032638E-19,2.8674193760187596E-7]
[2150,0,4.1221294146378841E-16,3.9401650775224516E-4,null,2150,0,4.0806384948641267E-16,3.9112796405982422E-4,null,2150,0,2.7545622451698887E-19,2.8590136651290065E-7]
[2160,0,4.7129838874955635E-16,3.9286146608816014E-4,null,2160,0,4.665664113906793E-16,3.8998139002978908E-4,null,2160,0,3.1517648754234285E-19,2.8506325952135942E-7]
[2170,0,5.3819121366678943E-16,3.9170981037800869E-4,null,2170,0,5.3280094018026648E-16,3.8883817713594943E-4,null,2170,0,3.6017775853622062E-19,2.8422760940205166E-7]
[2180,0,6.1383390602167323E-16,3.905615306899328E-4,null,2180,0,6.0770102374142065E-16,3.8769831551191148E-4,null,2180,0,4.1110164471788257E-19,2.8339440895163993E-7]
[2190,0,6.9927168550348526E-16,3.8941661713608574E-4,null,2190,0,6.923020325670412E-16,3.8656179534388472E-4,null,2190,0,4.6866015878462704E-19,2.8256365099286371E-7]
[2200,0,7.9566245094459521E-16,3.8827505984340111E-4,null,2200,0,7.8775097964830012E-16,3.8542860683193431E-4,null,2200,0,5.3364258658957404E-19,2.8173532836298027E-7]
[2210,2.2258308299705336E-27,9.0428756589178397E-16,3.8713684897242985E-4,null,2210,1.1665828107795875E-27,8.9531720938360818E-16,3.8429874020988019E-4,null,2210,0,6.0692293663531465E-19,2.8090943392124267E-7]
[2220,9.2693976413769699E-27,1.0265635392382828E-15,3.8600197471941219E-4,null,2220,8.0654658153773671E-27,1.0164039737590287E-15,3.8317218574466155E-4,null,2220,0,6.8946801262220126E-19,2.800859605562103E-7]
[2230,1.7626366270767836E-26,1.164054662890311E-15,3.8487042729945319E-4,null,2230,1.627544755352844E-26,1.1525609572537089E-15,3.8204893372531192E-4,null,2230,0,7.8234615257867064E-19,2.7926490116587125E-7]
[2240,2.7375084310298544E-26,1.3184866717597133E-15,3.8374219695814984E-4,null,2240,2.5877625981149264E-26,1.3054978152131857E-15,3.8092897446447103E-4,null,2240,0,8.8673668045765205E-19,2.7844624867341761E-7]
[2250,3.8578861577024922E-26,1.4917614948268207E-15,3.8261727397064904E-4,null,2250,3.693852447553369E-26,1.4770987938610987E-15,3.798122983131018E-4,null,2250,0,1.0039401185373864E-18,2.7762999602202669E-7]
[2260,5.1282148239234574E-26,1.6859731695601945E-15,3.8149564864708448E-4,null,2260,4.9506277605078337E-26,1.6694385036312191E-15,3.7869889564711215E-4,null,2260,1.9860331628053652E-30,1.1353892114841504E-18,2.7681613617936762E-7]
[2270,6.5506500743179136E-26,1.9034249956656424E-15,3.8037731131616338E-4,null,2270,6.3606596563954027E-26,1.8847989211599545E-15,3.7758875687419135E-4,null,2270,1.0177500643764741E-29,1.2826608155573661E-18,2.7600466212970764E-7]
[2280,8.1246383905531204E-26,2.146648007913189E-15,3.7926225234297621E-4,null,2280,7.9238561625029573E-26,2.125687699025136E-15,3.7648187242298814E-4,null,2280,1.9881858417694639E-29,1.4474887091272483E-18,2.7519556688216468E-7]
[2290,9.8464866594992906E-26,2.4184208516932574E-15,3.7815046211336494E-4,null,2290,9.6370298083071869E-26,2.3948578661881855E-15,3.7537823275193621E-4,null,2290,3.1185968276166975E-29,1.6317773834543811E-18,2.7438884345826123E-7]
[2300,1.1708927740213737E-25,2.7217911489714037E-15,3.7704193104303862E-4,null,2300,1.1493460122045858E-25,2.6953290060843991E-15,3.7427782834547442E-4,null,2300,4.4159098642244615E-29,1.8376168755476334E-18,2.7358448490450101E-7]
[2310,1.3700689541332981E-25,3.0600984464226496E-15,3.759366495905883E-4,null,2310,1.348245846528388E-25,3.0304100033831462E-15,3.7318064973616009E-4,null,2310,5.8848630060856893E-29,2.0672987078480438E-18,2.7278248430137781E-7]
[2320,1.5806075947779705E-25,3.4369988417930689E-15,3.7483460821360887E-4,null,2320,1.5588943481839061E-25,3.403723454675107E-15,3.720866874505425E-4,null,2320,7.5275543030906335E-29,2.3233330025328254E-18,2.719828347198934E-7]
[2330,1.8004568699910882E-25,3.8564913888517114E-15,3.7373579742395774E-4,null,2330,1.7793036217254976E-25,3.819231842623865E-15,3.7099593206443192E-4,null,2330,9.3429744587710773E-29,2.6084668413163914E-18,2.7118552927605033E-7]
[2340,2.0270460009421362E-25,4.3229463857809893E-15,3.7264020774990315E-4,null,2340,2.0069684664113624E-25,4.2812655775697068E-15,3.6990837418399483E-4,null,2340,1.1326529986950602E-28,2.92570394482946E-18,2.7039056109785618E-7]
[2350,2.2572526275215274E-25,4.8411356564077274E-15,3.7154782974977563E-4,null,2350,2.2388328087411472E-25,4.7945530150911592E-15,3.6882400443131807E-4,null,2350,1.3469564454825017E-28,3.2783257489161724E-18,2.6959792333564376E-7]
[2360,2.4873753720187607E-25,5.4162649383469799E-15,3.7045865400004726E-4,null,2360,2.4712611963861076E-25,5.3642525626653526E-15,3.6774281345396527E-4,null,2360,1.5758886327962715E-28,3.6699139585275123E-18,2.6880760915162752E-7]
[2370,2.7131127086949432E-25,6.0540084969139661E-15,3.6937267112250238E-4,null,2370,2.7000164709771958E-25,5.995986993310508E-15,3.6666479193857163E-4,null,2370,1.8176312802249983E-28,4.10437466331748E-18,2.680196117400348E-7]
[2380,2.9295492691010207E-25,6.7605460885275569E-15,3.6828987175588595E-4,null,2380,2.9202447557663931E-25,6.6958800889306093E-15,3.6558993059867195E-4,null,2380,2.0698239799167393E-28,4.5859641025331945E-18,2.6723392430655672E-7]
[2390,3.1311507116194617E-25,7.542602402303613E-15,3.6721024656652639E-4,null,2390,3.1264688954168824E-25,7.470595741010528E-15,3.6451822016625858E-4,null,2390,2.3295248992270761E-28,5.1193161703573791E-18,2.6645054007921183E-7]
[2400,3.3117682635964636E-25,8.4074891136128976E-15,3.661337862503742E-4,null,2400,3.3125914677554207E-25,8.3273796413543362E-15,3.6344965140081633E-4,null,2400,2.5931763303891129E-28,5.7094717565028954E-18,2.6566945230883286E-7]
[2410,3.4646540043321602E-25,9.3631496885285914E-15,3.6506048152858692E-4,null,2410,3.4719084499384904E-25,9.2741037006668564E-15,3.6238421510357524E-4,null,2410,2.8565762741493153E-28,6.3619100205540711E-18,2.6489065426425022E-7]
[2420,3.5824878961266232E-25,1.0418207083353242E-14,3.6399032315073622E-4,null,2420,3.5971345631221747E-25,1.0319313338002782E-14,3.6132190207908694E-4,null,2420,3.1148572713292912E-28,7.0825817023325163E-18,2.6411413922778048E-7]
[2430,3.6574174878753441E-25,1.1582014488729869E-14,3.6292330189625536E-4,null,2430,3.6804412396771482E-25,1.1472277789382891E-14,3.6026270318278671E-4,null,2430,3.3624737054872185E-28,7.877944574379158E-18,2.6333990051238594E-7]
[2440,3.6811111109427182E-25,1.2864709273282274E-14,3.6185940856413377E-4,null,2440,3.7135080547786405E-25,1.2743043589276211E-14,3.5920660927449272E-4,null,2440,3.5931987896205344E-28,8.7550011465636935E-18,2.6256793144131969E-7]
[2450,3.6448252602427843E-25,1.4277270287206124E-14,3.6079863398747998E-4,null,2450,3.6875883398051182E-25,1.4142491384080023E-14,3.581536112599456E-4,null,2450,3.8001324187941835E-28,9.7213387367616167E-18,2.6179822536370011E-7]
[2460,3.5394867047274262E-25,1.5831578691814839E-14,3.5974096902232147E-4,null,2460,3.5935895484607187E-25,1.5682396242270474E-14,3.5710370005860727E-4,null,2460,3.9757210174750386E-28,1.0785172025567267E-17,2.6103077564202732E-7]
[2470,3.3557897017117533E-25,1.7540482486652037E-14,3.5868640455698306E-4,null,2470,3.4221687787317278E-25,1.7375491631464744E-14,3.5605686662839334E-4,null,2470,4.1117904344207022E-28,1.1955388217043983E-17,2.6026557566659357E-7]
[2480,3.084308499396252E-25,1.9417864911521857E-14,3.5763493150154155E-4,null,2480,3.1638436653942865E-25,1.9235537238324242E-14,3.5501310194479017E-4,null,2480,4.1995928385213865E-28,1.3241594931650788E-17,2.5950261884288517E-7]
[2490,2.7156251032084997E-25,2.1478716906514973E-14,3.5658654078978995E-4,null,2490,2.8091186504044856E-25,2.1277390812923326E-14,3.5397239701058872E-4,null,2490,4.2298684459587212E-28,1.4654170961615095E-17,2.587418985913776E-7]
[2500,2.2404720556850341E-25,2.3739213818927109E-14,3.5554122338563732E-4,null,2500,2.3486264135631675E-25,2.3517084224968427E-14,3.5293474284939382E-4,null,2500,4.1929227623817864E-28,1.6204320023217007E-17,2.5798340835328766E-7]
[2510,1.6498897388966377E-25,2.6216796551822463E-14,3.5449897028653815E-4,null,2510,1.7732840057096286E-25,2.5971903925082798E-14,3.5190013052933283E-4,null,2510,4.0787198542117649E-28,1.7904127644681692E-17,2.5722714159978645E-7]
[2520,9.3539745511796111E-26,2.8930257354927025E-14,3.5345977250212106E-4,null,2520,1.0744629735094911E-25,2.8660476010240876E-14,3.5086855112833573E-4,null,2520,3.8769919714218165E-28,1.9766621332661776E-17,2.5647309180634763E-7]
[2530,8.9177278477017817E-27,3.1899830464424523E-14,3.5242362108162117E-4,null,2530,2.4417250159579903E-26,3.1602856098292128E-14,3.498399957587064E-4,null,2530,3.5773656315948558E-28,2.1805834164543264E-17,2.5572125247639066E-7]
[2540,0,3.5147287804222169E-14,3.5139050709338051E-4,null,2540,0,3.4820624222466164E-14,3.4881445555025716E-4,null,2540,3.169504043432213E-28,2.4036871958152562E-17,2.5497161713035578E-7]
[2550,0,3.8696039967282349E-14,3.5036042162948488E-4,null,2550,0,3.8336984962722659E-14,3.4779192166630628E-4,null,2550,2.643265499125285E-28,2.6475984174797517E-17,2.5422417930373201E-7]
[2560,0,4.2571242701553238E-14,3.4933335581614788E-4,null,2560,0,4.2176873036717157E-14,3.4677238529256046E-4,null,2560,1.9888771018715422E-28,2.9140638715882499E-17,2.5347893256200997E-7]
[2570,0,4.6799909131129626E-14,3.4830930080219521E-4,null,2570,0,4.63670645791957E-14,3.457558376504972E-4,null,2570,1.1971229196639294E-28,3.2049600777754849E-17,2.5273587047581014E-7]
[2580,0,5.1411027949264976E-14,3.4728824775720344E-4,null,2580,0,5.0936294344585014E-14,3.4474226996595041E-4,null,2580,2.595453729795016E-29,3.5223015933779055E-17,2.5199498664088657E-7]
[2590,0,5.6435687825886885E-14,3.4627018788158499E-4,null,2590,0,5.591537907352541E-14,3.4373167351205353E-4,null,2590,0,3.8682497617022771E-17,2.5125627467366031E-7]
[2600,0,6.1907208278315286E-14,3.4525511240581723E-4,null,2600,0,6.1337347270106174E-14,3.4272403957705434E-4,null,2600,0,4.2451219181320264E-17,2.5051972820938592E-7]
[2610,0,6.7861277259869618E-14,3.4424301257835192E-4,null,2610,0,6.7237575642494555E-14,3.4171935947524318E-4,null,2610,0,4.6554010722834633E-17,2.4978534089829734E-7]
[2620,0,7.4336095726999018E-14,3.4323387967330037E-4,null,2620,0,7.3653932465556884E-14,3.4071762454477688E-4,null,2620,0,5.1017460848571016E-17,2.4905310641016047E-7]
[2630,0,8.1372529451636364E-14,3.4222770499445356E-4,null,2630,0,8.0626928130112348E-14,3.3971882615676244E-4,null,2630,0,5.587002358269418E-17,2.4832301843016328E-7]
[2640,0,8.9014268351267069E-14,3.4122447987586138E-4,null,2640,0,8.8199873149171082E-14,3.3872295570184482E-4,null,2640,0,6.1142130605736083E-17,2.4759507067493658E-7]
[2650,0,9.7307993615127978E-14,3.4022419566318165E-4,null,2650,0,9.6419043897429745E-14,3.3773000459495349E-4,null,2650,0,6.6866309026097707E-17,2.4686925686369916E-7]
[2660,0,1.06303552910856E-13,3.3922684374138626E-4,null,2660,0,1.0533385636613081E-13,3.3673996428259894E-4,null,2660,0,7.3077304887537094E-17,2.4614557074428551E-7]
[2670,0,1.1605414396149759E-13,3.3823241551130098E-4,null,2670,0,1.149970482209567E-13,3.3575282622716734E-4,null,2670,0,7.981221262044669E-17,2.4542400607801603E-7]
[2680,0,1.2661650678867923E-13,3.3724090240247484E-4,null,2680,0,1.2546486945648432E-13,3.3476858192335596E-4,null,2680,0,8.7110610649009672E-17,2.4470455664618912E-7]
[2690,0,1.3805112492324721E-13,3.3625229586667799E-4,null,2690,0,1.3679728194616501E-13,3.3378722288491982E-4,null,2690,0,9.5014703370351266E-17,2.4398721624584678E-7]
[2700,0,1.5042243589021578E-13,3.3526658738939724E-4,null,2700,0,1.4905816819233277E-13,3.3280874065696108E-4,null,2700,0,1.0356946972586575E-16,2.4327197869876196E-7]
[2710,0,1.6379905128050515E-13,3.3428376847016109E-4,null,2710,0,1.6231554958629891E-13,3.3183312680551131E-4,null,2710,0,1.1282281858902032E-16,2.4255883783504488E-7]
[2720,0,1.7825398672697236E-13,3.3330383064248076E-4,null,2720,0,1.7664181449361708E-13,3.3086037292497246E-4,null,2720,0,1.2282575119762964E-16,2.418477875163718E-7]
[2730,0,1.9386490210791194E-13,3.3232676545971566E-4,null,2730,0,1.9211395648520443E-13,3.2989047062674201E-4,null,2730,0,1.3363253086276024E-16,2.4113882160819259E-7]
[2740,0,2.1071435230600265E-13,3.3135256449646621E-4,null,2740,0,2.0881382303980665E-13,3.2892341155089434E-4,null,2740,0,1.4530086018994208E-16,2.4043193400012008E-7]
[2750,0,2.2889004885589943E-13,3.3038121936239243E-4,null,2750,0,2.2682837504843954E-13,3.279591873684548E-4,null,2750,0,1.5789206605224165E-16,2.3972711860230561E-7]
[2760,0,2.484851328184905E-13,3.2941272167777457E-4,null,2760,0,2.4624995745627496E-13,3.2699778976318946E-4,null,2760,0,1.7147129255825062E-16,2.3902436933834985E-7]
[2770,0,2.695984592246983E-13,3.2844706310658652E-4,null,2770,0,2.6717658138220695E-13,3.2603921045597971E-4,null,2770,0,1.8610770226168936E-16,2.3832368015519982E-7]
[2780,0,2.9233489343626426E-13,3.2748423531533412E-4,null,2780,0,2.8971221806094401E-13,3.2508344117835827E-4,null,2780,0,2.0187468586264877E-16,2.3762504500671852E-7]
[2790,0,3.1680561977539012E-13,3.2652423001311361E-4,null,2790,0,3.1396710495678543E-13,3.2413047369531399E-4,null,2790,0,2.1885008065380669E-16,2.3692845787950558E-7]
[2800,0,3.4312846277962506E-13,3.2556703892355201E-4,null,2800,0,3.4005806440279618E-13,3.2318029979438751E-4,null,2800,0,2.371163979682882E-16,2.3623391276421514E-7]
[2810,0,3.7142822144236399E-13,3.2461265379485289E-4,null,2810,0,3.6810883512301807E-13,3.2223291128474551E-4,null,2810,0,2.5676105988878734E-16,2.3554140367569905E-7]
[2820,0,4.0183701680348966E-13,3.2366106640540249E-4,null,2820,0,3.9825041699949375E-13,3.2128830000199328E-4,null,2820,0,2.7787664548070014E-16,2.3485092464898016E-7]
[2830,0,4.3449465325829281E-13,3.2271226855365079E-4,null,2830,0,4.3062142944945611E-13,3.203464578091182E-4,null,2830,0,3.0056114681466633E-16,2.3416246973055245E-7]
[2840,0,4.6954899395683532E-13,3.217662520533989E-4,null,2840,0,4.653684837820777E-13,3.1940737657535609E-4,null,2840,0,3.2491823504695299E-16,2.3347603298097901E-7]
[2850,0,5.0715635066894783E-13,3.2082300876081258E-4,null,2850,0,5.0264656990708242E-13,3.1847104822336814E-4,null,2850,0,3.5105753682838747E-16,2.3279160849647599E-7]
[2860,0,5.474818884935679E-13,3.1988253054373547E-4,null,2860,0,5.4261945777119792E-13,3.1753746467069592E-4,null,2860,0,3.7909492131517832E-16,2.3210919036884169E-7]
[2870,0,5.9070004579430087E-13,3.1894480929654779E-4,null,2870,0,5.8546011390133996E-13,3.1660661787783487E-4,null,2870,0,4.0915279805735384E-16,2.3142877271808803E-7]
[2880,0,6.3699496974553553E-13,3.1800983693560379E-4,null,2880,0,6.3135113343608667E-13,3.1567849981987538E-4,null,2880,0,4.4136042604244045E-16,2.3075034968196618E-7]
[2890,0,6.8656096787667944E-13,3.1707760540264384E-4,null,2890,0,6.8048518803008081E-13,3.1475310249629967E-4,null,2890,0,4.7585423417438563E-16,2.3007391541108527E-7]
[2900,0,7.3960297600397613E-13,3.1614810666975363E-4,null,2900,0,7.3306549001789138E-13,3.1383041794012795E-4,null,2900,0,5.1277815346930589E-16,2.2939946407938998E-7]
[2910,6.7472883269752367E-25,7.9633704294178176E-13,3.1522133271736762E-4,null,2910,5.0225911934128757E-25,7.8930627322634722E-13,3.1291043818719352E-4,null,2910,0,5.5228396125137168E-16,2.287269898703233E-7]
[2920,1.7821710866975038E-24,8.5699083238751404E-13,3.1429727556271956E-4,null,2920,1.5977939580858051E-24,8.4943329082659733E-13,3.1199315531461592E-4,null,2920,0,5.9453163763402907E-16,2.2805648699190425E-7]
[2930,3.0023853739764426E-24,9.2180414237558826E-13,3.1337592723922617E-4,null,2930,2.806610547513721E-24,9.1368433061826209E-13,3.1107856141761406E-4,null,2930,0,6.3968973457260048E-16,2.2738794965878638E-7]
[2940,4.3355485388352613E-24,9.9102944269749764E-13,3.1245727980323492E-4,null,2940,4.1290424446403895E-24,9.8230974813996033E-13,3.101666486084056E-4,null,2940,0,6.8793575777582775E-16,2.2672137211174401E-7]
[2950,5.7807946893068941E-24,1.0649324306869719E-12,3.1154132534716217E-4,null,2950,5.5643878366385873E-24,1.0555730180021195E-12,3.0925740903296631E-4,null,2950,0,7.394565617651894E-16,2.2605674861217052E-7]
[2960,7.3361348895486938E-24,1.1437926057690373E-12,3.1062805596717308E-4,null,2960,7.1108283205863324E-24,1.133751303837969E-12,3.0835083484913507E-4,null,2960,5.2614517751620316E-28,7.9444875837100169E-16,2.253940734222372E-7]
[2970,8.9983809576266799E-24,1.2279038631737019E-12,3.0971746379432645E-4,null,2970,8.7653516734342399E-24,1.21713604727058E-12,3.0744691824741919E-4,null,2970,1.7039457703740036E-27,8.5311913895570357E-16,2.2473334083647142E-7]
[2980,1.076307430169916E-23,1.3175751072149802E-12,3.0880954098609989E-4,null,2980,1.0523679548069096E-23,1.3060335762935345E-12,3.0654565144335198E-4,null,2980,3.0012115604104519E-27,9.1568511065482988E-16,2.2407454516006246E-7]
[2990,1.2624420733388313E-23,1.4131308845362579E-12,3.0790427970847932E-4,null,2990,1.2380201038151933E-23,1.4007657334634829E-12,3.0564702665621395E-4,null,2990,4.4179709253810155E-27,9.8237514692659622E-16,2.234176807106315E-7]
[3000,1.4575232194104837E-23,1.5149120377231904E-12,3.0700167216287619E-4,null,3000,1.4327913052634334E-23,1.5016705243027103E-12,3.047510361464132E-4,null,3000,5.9531447359569744E-27,1.0534292527011528E-15,2.2276274182876658E-7]
[3010,1.660687631966672E-23,1.6232763796847805E-12,3.0610171057368125E-4,null,3010,1.6358368431389775E-23,1.6091027863094497E-12,3.0385767219388697E-4,null,3010,7.604464577280483E-27,1.1290994444203417E-15,2.2210972287531955E-7]
[3020,1.8709234748617579E-23,1.7385993892034942E-12,3.0520438717708185E-4,null,3020,1.8461632714625786E-23,1.7234348789739583E-12,3.0296692709540668E-4,null,3020,9.3683956384295266E-27,1.2096502452591365E-15,2.2145861821316983E-7]
[3030,2.0870671052493417E-23,1.8612749280531651E-12,3.0430969424874449E-4,null,3030,2.062625045269994E-23,1.8450573951960774E-12,3.0207879318151136E-4,null,3030,1.1240065235246556E-26,1.2953591958183363E-15,2.2080942223552913E-7]
[3040,2.3078009127924527E-23,1.9917159800840164E-12,3.0341762406863157E-4,null,3040,2.283922190538351E-23,1.9743798945007763E-12,3.0119326278727534E-4,null,3040,1.321319793152437E-26,1.3865173805788645E-15,2.2016212934824172E-7]
[3050,2.5316522848904819E-23,2.1303554126715669E-12,3.0252816895384775E-4,null,3050,2.5085990939447773E-23,2.1118316584455864E-12,3.0031032828692621E-4,null,3050,1.5280058217346958E-26,1.483429970406112E-15,2.1951673396973978E-7]
[3060,2.7569937718290638E-23,2.2776467609249498E-12,3.0164132123520598E-4,null,3060,2.7350444874574004E-23,2.2578624686125267E-12,2.9942998206966358E-4,null,3060,1.7431401683899009E-26,1.5864167813920548E-15,2.1887323053989157E-7]
[3070,2.9820445202420289E-23,2.4340650350486776E-12,3.0075707327108746E-4,null,3070,2.9614926973782217E-23,2.412943407575711E-12,2.9855221654454304E-4,null,3070,1.9656435611786118E-26,1.6958128503219234E-15,2.1823161351131598E-7]
[3080,3.2048730357127232E-23,2.6001075512490295E-12,2.9987541744135374E-4,null,3080,3.1860262199314581E-23,2.5775676832331102E-12,2.9767702415555434E-4,null,3080,2.1942789852918385E-26,1.8119690270502324E-15,2.175918773533275E-7]
[3090,3.4234013279459325E-23,2.776294786574952E-12,2.9899634614590176E-4,null,3090,3.4065796781925113E-23,2.7522514768893275E-12,2.9680439734864955E-4,null,3090,2.4276498844374734E-26,1.9352525840701258E-15,2.1695401655380036E-7]
[3100,3.635410483234519E-23,2.9631712580787553E-12,2.9811985180572189E-4,null,3100,3.6209452064900345E-23,2.9375348154721741E-12,2.9593432861086885E-4,null,3100,2.6641995539616068E-26,2.0660478435569163E-15,2.1631802561224251E-7]
[3110,3.838547700085275E-23,3.1613064266811351E-12,2.972459268721016E-4,null,3110,3.826779299602741E-23,3.1339824682645689E-12,2.9506681043873996E-4,null,3110,2.902211798370264E-26,2.2047568221660726E-15,2.1568389905355037E-7]
[3120,4.0303348136834556E-23,3.3712956261203805E-12,2.9637456380867278E-4,null,3120,4.0216111539486915E-23,3.3421848685290648E-12,2.9420183535551773E-4,null,3120,3.1398129187880859E-26,2.3517998938628386E-15,2.1505163140466483E-7]
[3130,4.2081783249667587E-23,3.5937610173620497E-12,2.9550575510780305E-4,null,3130,4.2028525180553078E-23,3.5627590603986013E-12,2.9333939591163593E-4,null,3130,3.3749750884615715E-26,2.5076164710580504E-15,2.1442121722207807E-7]
[3140,4.369380938992177E-23,3.8293525688428075E-12,2.9463949328228576E-4,null,3140,4.3678090585578132E-23,3.7963496714043463E-12,2.9247948467033349E-4,null,3140,3.6055211658785085E-26,2.6726657043230549E-15,2.1379265107127604E-7]
[3150,4.5111546060905613E-23,4.0787490629160549E-12,2.9377577086088155E-4,null,3150,4.5136932367674729E-23,4.0436299110059108E-12,2.916220942180882E-4,null,3150,3.8291309859143503E-26,2.8474272009523065E-15,2.1316592753106464E-7]
[3160,4.6306350477117238E-23,4.3426591288647929E-12,2.9291458040528294E-4,null,3160,4.637638679268848E-23,4.3053025954865473E-12,2.9076721716806553E-4,null,3160,4.0433491596829309E-26,3.0324017626408182E-15,2.1254104120456088E-7]
[3170,4.7248977369318054E-23,4.6218223028409537E-12,2.9205591448844677E-4,null,3170,4.7367160140537745E-23,4.5821011995702077E-12,2.8991484614869311E-4,null,3170,4.2455944033478936E-26,3.228112142539103E-15,2.1191798670333024E-7]
[3180,4.7909752921032904E-23,4.9170101150859685E-12,2.9119976571423135E-4,null,3180,4.8079501321847791E-23,4.8747909351126002E-12,2.8906497382054152E-4,null,3180,4.4331704055485595E-26,3.4351038219454014E-15,2.1129675865753086E-7]
[3190,4.8258762286448107E-23,5.2290272047820894E-12,2.9034612669830422E-4,null,3190,4.8483388214253579E-23,5.1841698572134076E-12,2.8821759285099866E-4,null,3190,4.6032782309801429E-26,3.6539458068909809E-15,2.1067735171505789E-7]
[3200,4.826605003746193E-23,5.5587124628793658E-12,2.894949900922983E-4,null,3200,4.8548727080558749E-23,5.5110699980920807E-12,2.8737269594803833E-4,null,3200,4.7530302470905942E-26,3.8852314448713596E-15,2.1005976053825642E-7]
[3210,4.7901832751424762E-23,5.9069402032357367E-12,2.8864634854851382E-4,null,3210,4.824556429361957E-23,5.8563585290623666E-12,2.8653027581189633E-4,null,3210,4.8794655478541279E-26,4.1295792619706965E-15,2.0944397979695145E-7]
[3220,4.7136722835724878E-23,6.2746213624030371E-12,2.8780019476560453E-4,null,3220,4.754430947659794E-23,6.2209389509360386E-12,2.8569032520207801E-4,null,3220,4.9795668366927217E-26,4.3876338206238185E-15,2.0883000419145887E-7]
[3230,4.5941962580499859E-23,6.6627047283852966E-12,2.8695652144155725E-4,null,3230,4.6415969062045404E-23,6.6057523131798798E-12,2.8485283686661126E-4,null,3230,5.0502787188120683E-26,4.6600665982551815E-15,2.082178284294479E-7]
[3240,4.4289667300718809E-23,7.0721781986888751E-12,2.861153213077935E-4,null,3240,4.4832389141686873E-23,7.0117784621434195E-12,2.8401780358858501E-4,null,3240,5.0885273398974819E-26,4.9475768870297639E-15,2.0760744723370496E-7]
[3250,4.215307633318958E-23,7.504070067976968E-12,2.8527658711414094E-4,null,3250,4.2766506382523099E-23,7.4400373186675838E-12,2.8318521817265212E-4,null,3250,5.0912412966001219E-26,5.2508927149456774E-15,2.0699885533929487E-7]
[3260,3.950681055462883E-23,7.9594503456345093E-12,2.844403116316266E-4,null,3260,4.0192605683267424E-23,7.8915901853783742E-12,2.8235507344365765E-4,null,3260,5.0553737321672939E-26,5.5707717884936284E-15,2.0639204750745797E-7]
[3270,3.6327134971721562E-23,8.4394321035420638E-12,2.8360648765457416E-4,null,3270,3.7086583130568415E-23,8.3675410839620972E-12,2.8152736225178641E-4,null,3270,4.9779255177795094E-26,5.9080024571032145E-15,2.0578701850401534E-7]
[3280,3.2592224872689731E-23,8.9451728543501727E-12,2.8277510799389847E-4,null,3280,3.342621274941149E-23,8.8690381227114276E-12,2.807020774520461E-4,null,3280,4.8559694100764886E-26,6.2634046995908974E-15,2.0518376311786303E-7]
[3290,2.8282433919006713E-23,9.4778759605357325E-12,2.8194616548441582E-4,null,3290,2.9191415432073552E-23,9.3972748946223518E-12,2.7987921194108563E-4,null,3290,4.6866750627576144E-26,6.6378311328174915E-15,2.0458227614557843E-7]
[3300,2.3380562512388555E-23,1.0038792074518012E-11,2.8111965298374566E-4,null,3300,2.4364528382486281E-23,9.9534919063173913E-12,2.7905875861999831E-4,null,3300,4.4673347611348504E-26,7.0321680427600559E-15,2.0398255240684088E-7]
[3310,1.7872124680055007E-23,1.0629220610098864E-11,2.8029556336684407E-4,null,3310,1.8930573322482735E-23,1.0538978038058034E-11,2.782407104228872E-4,null,3310,4.1953897370171495E-26,7.4473364381940472E-15,2.0338458672999938E-7]
[3320,1.1745611697565326E-23,1.1250511245488151E-11,2.7947388953232771E-4,null,3320,1.2877521678139418E-23,1.1155072035105673E-11,2.7742506029528573E-4,null,3320,3.8684569138617949E-26,7.8842931271787435E-15,2.0278837396274663E-7]
[3330,4.9927505892073252E-24,1.1904065458160726E-11,2.7865462439662271E-4,null,3330,6.1965548843261871E-24,1.1803164030675746E-11,2.766118012111879E-4,null,3330,3.4843559214782699E-26,8.3440318165287175E-15,2.021939089685439E-7]
[3340,0,1.2591338091789971E-11,2.7783776090033077E-4,null,3340,0,1.2484697100728286E-11,2.7580092615993014E-4,null,3340,3.0411362143920145E-26,8.827584234452965E-15,2.0160118661919699E-7]
[3350,0,1.3313838955486322E-11,2.7702329200348584E-4,null,3350,0,1.3201168850822345E-11,2.7499242814957379E-4,null,3350,2.537104119435085E-26,9.3360212765317174E-15,2.010102018083528E-7]
[3360,0,1.407313445556418E-11,2.762112106841194E-4,null,3360,0,1.3954133035255535E-11,2.7418630021814472E-4,null,3360,1.9708496333981844E-26,9.870454175197112E-15,2.0042094944468244E-7]
[3370,0,1.4870849260050842E-11,2.7540150994275733E-4,null,3370,0,1.4745201208701536E-11,2.7338253541182048E-4,null,3370,1.3412727865597718E-26,1.0432035692877019E-14,1.9983342444589396E-7]
[3380,0,1.5708667996139144E-11,2.7459418280772601E-4,null,3380,0,1.5576044410545506E-11,2.7258112680792417E-4,null,3380,6.4760938465117084E-27,1.1021961338952674E-14,1.9924762175325101E-7]
[3390,0,1.6588336980777726E-11,2.7378922231204749E-4,null,3390,0,1.6448394882110794E-11,2.7178206749525372E-4,null,3390,0,1.1641470610675483E-14,1.9866353631220427E-7]
[3400,0,1.7511665984582134E-11,2.7298662152368735E-4,null,3400,0,1.7364047816958068E-11,2.7098535059121671E-4,null,3400,0,1.229184825818017E-14,1.9808116309230141E-7]
[3410,0,1.8480530029238378E-11,2.7218637352286243E-4,null,3410,0,1.8324863144428194E-11,2.7019096922639122E-4,null,3410,0,1.2974425573723695E-14,1.9750049707402757E-7]
[3420,0,1.9496871218561404E-11,2.7138847141217016E-4,null,3420,0,1.9332767346590131E-11,2.6939891655404871E-4,null,3420,0,1.3690581705272269E-14,1.9692153325026281E-7]
[3430,0,2.0562700603361788E-11,2.7059290831677618E-4,null,3430,0,2.0389755308746147E-11,2.6860918574924959E-4,null,3430,0,1.4441744994552696E-14,1.9634426663332927E-7]
[3440,0,2.1680100080257912E-11,2.6979967737619234E-4,null,3440,0,2.1497892203630817E-11,2.6782177000194074E-4,null,3440,0,1.5229394339672254E-14,1.957686922476691E-7]
[3450,0,2.2851224324566049E-11,2.6900877176239254E-4,null,3450,0,2.2659315409435709E-11,2.6703666253434191E-4,null,3450,0,1.605506058240836E-14,1.9519480513457792E-7]
[3460,0,2.4078302757386183E-11,2.682201846464038E-4,null,3460,0,2.3876236461776631E-11,2.6625385656790584E-4,null,3460,0,1.6920327920258267E-14,1.946226003439518E-7]
[3470,0,2.5363641546990624E-11,2.6743390924083559E-4,null,3470,0,2.5150943039710353E-11,2.6547334536446821E-4,null,3470,0,1.7826835343331555E-14,1.9405207294535282E-7]
[3480,0,2.6709625644610194E-11,2.6664993876594843E-4,null,3480,0,2.6485800985894674E-11,2.646951221960693E-4,null,3480,0,1.8776278096159555E-14,1.9348321802336615E-7]
[3490,0,2.8118720854704831E-11,2.658682664635944E-4,null,3490,0,2.7883256360978356E-11,2.639191803507126E-4,null,3490,0,1.9770409164489464E-14,1.9291603067097245E-7]
[3500,0,2.9593475939789053E-11,2.6508888560187929E-4,null,3500,0,2.9345837532291805E-11,2.6314551314710326E-4,null,3500,0,2.0811040787119631E-14,1.9235050600587723E-7]
[3510,0,3.1136524759873668E-11,2.6431178945882675E-4,null,3510,0,3.0876157296898379E-11,2.6237411391135101E-4,null,3510,0,2.1900045992826163E-14,1.9178663914868709E-7]
[3520,0,3.2750588446573939E-11,2.6353697133880028E-4,null,3520,0,3.2476915039057481E-11,2.6160497600216355E-4,null,3520,0,2.3039360162421974E-14,1.9122442524557894E-7]
[3530,0,3.4438477611918018E-11,2.6276442456006909E-4,null,3530,0,3.4150898922132986E-11,2.6083809278141937E-4,null,3530,0,2.4230982615978735E-14,1.9066385944520429E-7]
[3540,0,3.6203094591884917E-11,2.6199414246872897E-4,null,3540,0,3.5900988114975916E-11,2.6007345764289481E-4,null,3540,0,2.547697822523804E-14,1.9010493691590305E-7]
[3550,0,3.8047435724680863E-11,2.6122611842448813E-4,null,3550,0,3.7730155052790803E-11,2.593110639992572E-4,null,3550,0,2.6779479051223572E-14,1.8954765284418004E-7]
[3560,0,3.9974593663756194E-11,2.6046034580790408E-4,null,3560,0,3.9641467732488199E-11,2.5855090528000468E-4,null,3560,0,2.8140686007061813E-14,1.8899200242506753E-7]
[3570,0,4.1987759725550347E-11,2.5969681802231082E-4,null,3570,0,4.1638092042510694E-11,2.5779297493176386E-4,null,3570,0,2.9562870546007283E-14,1.8843798087396978E-7]
[3580,0,4.4090226271942187E-11,2.5893552848086504E-4,null,3580,0,4.3723294127110648E-11,2.5703726642060975E-4,null,3580,0,3.1048376374661333E-14,1.8788558340821084E-7]
[3590,0,4.6285389127364789E-11,2.5817647062853385E-4,null,3590,0,4.5900442785039148E-11,2.562837732393875E-4,null,3590,0,3.2599621191360667E-14,1.8733480527297125E-7]
[3600,0,4.857675003054177E-11,2.5741963791619231E-4,null,3600,0,4.8173011902603632E-11,2.5553248888280722E-4,null,3600,0,3.4219098449710231E-14,1.8678564171754187E-7]
[3610,0,5.0967919120775039E-11,2.5666502382797491E-4,null,3610,0,5.0544582921025316E-11,2.5478340688798122E-4,null,3610,0,3.5909379147214382E-14,1.8623808801148934E-7]
[3620,0,5.3462617458718715E-11,2.5591262185719813E-4,null,3620,0,5.3018847338031178E-11,2.5403652079300493E-4,null,3620,0,3.7673113638965462E-14,1.8569213943332934E-7]
[3630,0,5.6064679581542529E-11,2.5516242551667709E-4,null,3630,0,5.5599609243585686E-11,2.5329182415793715E-4,null,3630,0,3.9513033476324826E-14,1.8514779127993432E-7]
[3640,0,5.8778056092395705E-11,2.5441442834165247E-4,null,3640,0,5.8290787889672875E-11,2.5254931056630035E-4,null,3640,0,4.1431953270537602E-14,1.846050388561506E-7]
[3650,0,6.160681628404447E-11,2.5366862388914697E-4,null,3650,0,6.1096420294005389E-11,2.5180897362196155E-4,null,3650,0,4.3432772581194695E-14,1.8406387748943978E-7]
[3660,0,6.4555150796575085E-11,2.5292500572969957E-4,null,3660,0,6.402066387755019E-11,2.5107080694445813E-4,null,3660,0,4.5518477829468922E-14,1.8352430250965237E-7]
[3670,0,6.7627374309011024E-11,2.5218356745438384E-4,null,3670,0,6.7067799135724115E-11,2.5033480416880604E-4,null,3670,0,4.7692144236021985E-14,1.829863092768545E-7]
[3680,0,7.0827928264697132E-11,2.5144430266892505E-4,null,3680,0,7.0242232343111006E-11,2.4960095895131418E-4,null,3680,0,4.9956937783480418E-14,1.824498931401437E-7]
[3690,0,7.4161383630293153E-11,2.5070720500714692E-4,null,3690,0,7.3548498291546392E-11,2.4886926496727081E-4,null,3690,0,5.2316117203371664E-14,1.8191504948745938E-7]
[3700,0,7.7632443688194497E-11,2.4997226811354878E-4,null,3700,0,7.6991263061386711E-11,2.4813971591590574E-4,null,3700,0,5.4773035987394652E-14,1.8138177370150303E-7]
[3710,0,8.1245946862192198E-11,2.4923948565347078E-4,null,3710,0,8.0575326825779134E-11,2.4741230549807993E-4,null,3710,0,5.7331144422893175E-14,1.8085006119044405E-7]
[3720,0,8.5006869576173477E-11,2.4850885131117199E-4,null,3720,0,8.4305626687733548E-11,2.4668702745284218E-4,null,3720,0,5.999399165239414E-14,1.8031990736989365E-7]
[3730,0,8.8920329145648351E-11,2.4778035878767721E-4,null,3730,0,8.818723954978395E-11,2.4596387552223607E-4,null,3730,0,6.2765227757060358E-14,1.7979130767076401E-7]
[3740,0,9.2991586701876752E-11,2.470540018139597E-4,null,3740,0,9.2225385016016717E-11,2.4524284348765603E-4,null,3740,0,6.5648605863899685E-14,1.7926425754036963E-7]
[3750,0,9.7226050148352353E-11,2.4632977412185743E-4,null,3750,0,9.6425428326223303E-11,2.4452392512354533E-4,null,3750,0,6.864798427656027E-14,1.7873875243571549E-7]
[3760,0,1.0162927714940003E-10,2.4560766946800432E-4,null,3760,0,1.0079288332193602E-10,2.4380711423552367E-4,null,3760,0,7.1767328629538589E-14,1.7821478782069555E-7]
[3770,0,1.0620697815061663E-10,2.4488768163415369E-4,null,3770,0,1.0533341544407923E-10,2.4309240464942338E-4,null,3770,0,7.501071406561293E-14,1.7769235918772686E-7]
[3780,0,1.1096501943088466E-10,2.4416980440916338E-4,null,3780,0,1.1005284476196767E-10,2.4237979019749262E-4,null,3780,0,7.8382327436308838E-14,1.7717146202796948E-7]
[3790,0,1.159094261856638E-10,2.4345403160976471E-4,null,3790,0,1.1495714903335966E-10,2.4166926474523747E-4,null,3790,0,8.1886469525188985E-14,1.7665209185773995E-7]
[3800,0,1.2104638564126783E-10,2.4274035706551959E-4,null,3800,0,1.2005246679527484E-10,2.4096082216495019E-4,null,3800,0,8.552755729376161E-14,1.7613424419443347E-7]
[3810,0,1.2638225019980801E-10,2.4202877462819363E-4,null,3810,0,1.2534510048525868E-10,2.4025445635468288E-4,null,3810,0,8.9310126149778928E-14,1.7561791457918806E-7]
[3820,0,1.3192354061448794E-10,2.4131927816227296E-4,null,3820,0,1.308415195927844E-10,2.39550161219788E-4,null,3820,0,9.3238832237705347E-14,1.7510309856208195E-7]
[3830,0,1.3767694919490019E-10,2.4061186155432273E-4,null,3830,0,1.3654836384044324E-10,2.388479307000948E-4,null,3830,0,9.7318454751104315E-14,1.7458979170750128E-7]
[3840,0,1.4364934304198813E-10,2.3990651870335595E-4,null,3840,0,1.4247244639458816E-10,2.3814775873450304E-4,null,3840,0,1.0155389826670712E-13,1.7407798958335566E-7]
[3850,9.4670226486589911E-24,1.4984776731231152E-10,2.3920324353648404E-4,null,3850,2.0864876822519437E-24,1.4862075710507618E-10,2.3744963929112355E-4,null,3850,0,1.0595019509990489E-13,1.7356768778824379E-7]
[3860,5.5461691834004242E-23,1.5627944851123871E-10,2.3850202998446028E-4,null,3860,4.7777722555099701E-23,1.5500046577373126E-10,2.3675356635212657E-4,null,3860,0,1.1051250768139581E-13,1.7305888191684014E-7]
[3870,1.0416846515030779E-22,1.6295179781469392E-10,2.3780287201249928E-4,null,3870,9.6194794716176922E-23,1.6161892545116142E-10,2.3605953392406528E-4,null,3870,0,1.1524613095472313E-13,1.7255156758875716E-7]
[3880,1.5553402414872053E-22,1.6987241441905199E-10,2.3710576359140749E-4,null,3880,1.472860592440399E-22,1.6848367576152453E-10,2.3536753601956521E-4,null,3880,0,1.2015649479441335E-13,1.720457404320752E-7]
[3890,2.094919157884001E-22,1.7704908891879114E-10,2.3641069870871442E-4,null,3890,2.0098672329340993E-22,1.7560244625485876E-10,2.3467756667303017E-4,null,3890,0,1.2524916644443796E-13,1.7154139608052596E-7]
[3900,2.6596235395761887E-22,1.8448980671147524E-10,2.3571767137831441E-4,null,3900,2.5721863844913101E-22,1.8298315978654771E-10,2.3398961994041949E-4,null,3900,2.7359493051828545E-27,1.3052985297668841E-13,1.7103853019315624E-7]
[3910,3.2485207451879612E-22,1.9220275142964413E-10,2.3502667562959748E-4,null,3910,3.1589014628726602E-22,1.9063393592350742E-10,2.3330368989672192E-4,null,3910,4.8255443484150221E-26,1.3600440376917E-13,1.7053713843724281E-7]
[3920,3.860542469024675E-22,2.00196308399177E-10,2.3433770549775263E-4,null,3920,3.7689598007233344E-22,1.9856309437666168E-10,2.3261977061961813E-4,null,3920,9.6414490966726474E-26,1.4167881300359931E-13,1.7003721648378506E-7]
[3930,4.4944844400047086E-22,2.084790681236796E-10,2.336507550572655E-4,null,3930,4.4011722442324257E-22,2.0677915845925729E-10,2.3193785622816092E-4,null,3930,1.4715419635963611E-25,1.4755922218208251E-13,1.6953876003541804E-7]
[3940,5.1490067338181197E-22,2.1705982979442604E-10,2.3296581837408472E-4,null,3940,5.0542133593526098E-22,2.1529085857055817E-10,2.3125794083165272E-4,null,3940,2.0040249852011269E-25,1.5365192266254562E-13,1.6904176478214578E-7]
[3950,5.8226347161308896E-22,2.2594760482541002E-10,2.3228288956025857E-4,null,3950,5.7266222653344053E-22,2.241071357044724E-10,2.3058001858401159E-4,null,3950,2.5607398196533744E-25,1.5996335821258933E-13,1.6854622645537611E-7]
[3960,6.5137606370112965E-22,2.3515162041300026E-10,2.316019627180985E-4,null,3960,6.4168041162925156E-22,2.332371449826165E-10,2.2990408363092463E-4,null,3960,3.1406973930111747E-25,1.665001275814146E-13,1.6805214077360391E-7]
[3970,7.2206459005159677E-22,2.4468132311973294E-10,2.3092303197805238E-4,null,3970,7.1230322540214782E-22,2.4269025921134521E-10,2.2923013014803712E-4,null,3970,3.7427728698644062E-25,1.7326898708947769E-13,1.6755950347894379E-7]
[3980,7.9414240215838501E-22,2.5454638248172678E-10,2.3024609149794714E-4,null,3980,7.8434510448271288E-22,2.5247607246224372E-10,2.2855815233401768E-4,null,3980,4.3657053610002311E-25,1.8027685323551034E-13,1.6706831033350023E-7]
[3990,8.6741042907251949E-22,2.6475669463922656E-10,2.2957113543496538E-4,null,3990,8.5760794201962239E-22,2.6260440367558942E-10,2.2788814438602707E-4,null,3990,5.0080982005868456E-25,1.8753080532054845E-13,1.665785570928575E-7]
[4000,9.4165761598829627E-22,2.7532238598974167E-10,2.2889815798073689E-4,null,4000,9.3188151353481173E-22,2.7308530028625199E-10,2.2722010054679914E-4,null,4000,5.6684198079708175E-25,1.9503808808858765E-13,1.6609023954938249E-7]
[4010,1.016661436681158E-21,2.8625381686327583E-10,2.2822715332354948E-4,null,4010,1.0069439762040518E-21,2.8392904187153489E-10,2.265540150388792E-4,null,4010,6.345005150936201E-25,2.0280611438350313E-13,1.6560335348020819E-7]
[4020,1.0921884806394993E-21,2.9756158521907737E-10,2.2755811568665019E-4,null,4020,1.0825624424505862E-21,2.9514614382039092E-10,2.2588988213093043E-4,null,4020,7.0360578197939066E-25,2.1084246782182444E-13,1.6511789469602015E-7]
[4030,1.1679951162521162E-21,3.0925653036341609E-10,2.2689103930786467E-4,null,4030,1.1584936291701485E-21,3.067473610235178E-10,2.2522769610454639E-4,null,4030,7.7396527259173072E-25,2.191549054810108E-13,1.646338590171925E-7]
[4040,1.243828231204572E-21,3.2134973668777145E-10,2.2622591843166249E-4,null,4040,1.2344845837312228E-21,3.1874369158373352E-10,2.2456745124286573E-4,null,4040,8.4537394330855968E-25,2.2775136060278406E-13,1.6415124226506311E-7]
[4050,1.3194260511787181E-21,3.3385253742692937E-10,2.2556274732710627E-4,null,4050,1.3102734877986673E-21,3.3114638054611844E-10,2.2390914186108963E-4,null,4050,9.1761461314196534E-25,2.3663994531115796E-13,1.6367004028118955E-7]
[4060,1.3945190375310459E-21,3.4677651843637731E-10,2.2490152027982617E-4,null,4060,1.3855905395898389E-21,3.439669236473314E-10,2.2325276228397827E-4,null,4060,9.9045842577693749E-25,2.4582895334472614E-13,1.6319024891911325E-7]
[4070,1.4688308642240243E-21,3.6013352198844308E-10,2.2424223158782825E-4,null,4070,1.4601589149581427E-21,3.5721707108354137E-10,2.2259830685305098E-4,null,4070,1.0636653764615339E-24,2.5532686280280691E-13,1.6271186404385263E-7]
[4080,1.5420794764445633E-21,3.7393565058656645E-10,2.2358487556913044E-4,null,4080,1.5336958094214641E-21,3.7090883129637072E-10,2.2194576992450837E-4,null,4080,1.1369849049175689E-24,2.6514233890500964E-13,1.6223488153106447E-7]
[4090,1.6139782293929493E-21,3.8819527079714949E-10,2.2292944656517798E-4,null,4090,1.6059135598057109E-21,3.8505447477630276E-10,2.2129514588231753E-4,null,4090,1.210156553150618E-24,2.7528423676381848E-13,1.6175929727466071E-7]
[4100,1.6842371098392938E-21,4.0292501709833315E-10,2.2227593891696254E-4,null,4100,1.676520847986144E-21,3.9966653788290104E-10,2.2064642911468182E-4,null,4100,1.2829106892450245E-24,2.8576160416972972E-13,1.6128510716840132E-7]
[4110,1.7525640400652457E-21,4.1813779574515218E-10,2.2162434700060728E-4,null,4110,1.7452239861363821E-21,4.1475782668130007E-10,2.1999961403442627E-4,null,4110,1.354969296277541E-24,2.9658368438854129E-13,1.6081230713260761E-7]
[4120,1.8186662656618626E-21,4.3384678865038765E-10,2.2097466519509129E-4,null,4120,1.8117282851169383E-21,4.3034142079429321E-10,2.1935469505893475E-4,null,4120,1.4260468264734748E-24,3.0775991897030944E-13,1.6034089308822499E-7]
[4130,1.8822518263311233E-21,4.500654572805522E-10,2.2032688790329363E-4,null,4130,1.8757395048440089E-21,4.4643067726945287E-10,2.1871166663796308E-4,null,4130,1.4958511194378171E-24,3.1929995056956538E-13,1.5987086097191727E-7]
[4140,1.9430311129535374E-21,4.6680754656634485E-10,2.1968100954239929E-4,null,4140,1.9369653899732405E-21,4.6303923446062746E-10,2.1807052322594627E-4,null,4140,1.5640843850322546E-24,3.3121362577630747E-13,1.5940220673249405E-7]
[4150,2.0007185101245579E-21,4.8408708882695573E-10,2.1903702454354905E-4,null,4150,1.995117289938569E-21,4.8018101592319825E-10,2.1743125929446963E-4,null,4150,1.6304442494768683E-24,3.4351099795732952E-13,1.5893492633408759E-7]
[4160,2.0550341252178556E-21,5.0191840770756345E-10,2.1839492735664751E-4,null,4160,2.0499118642324864E-21,4.9787023432245106E-10,2.1679386933575237E-4,null,4160,1.6946248638972414E-24,3.5620233010740833E-13,1.5846901574557313E-7]
[4170,2.1057056059268457E-21,5.2031612212941198E-10,2.1775471245048461E-4,null,4170,2.1010728748690175E-21,5.1612139535443995E-10,2.161583478586758E-4,null,4170,1.7563180748906707E-24,3.6929809770990546E-13,1.5800447095192305E-7]
[4180,2.1524700471420838E-21,5.3929515025176441E-10,2.1711637430441323E-4,null,4180,2.1483330667117963E-21,5.3494930167865964E-10,2.1552468938486547E-4,null,4180,1.8152146561321565E-24,3.8280899160628282E-13,1.5754128795308018E-7]
[4190,2.1950759888839333E-21,5.5887071344512145E-10,2.1647990741893586E-4,null,4190,2.1914361371832336E-21,5.5436905686191599E-10,2.1489288845079495E-4,null,4190,1.8710055998995985E-24,3.9674592087408114E-13,1.5707946275317668E-7]
[4200,2.2332855077443797E-21,5.7905834027501885E-10,2.158453063077253E-4,null,4200,2.2301387977229224E-21,5.7439606933270106E-10,2.1426293961571393E-4,null,4200,1.92338346833444E-24,4.1112001571287085E-13,1.5661899137192815E-7]
[4210,2.266876402361773E-21,5.9987387049572706E-10,2.1521256549953357E-4,null,4210,2.264212927330309E-21,5.9504605634542233E-10,2.1363483744288249E-4,null,4210,1.9720438021947382E-24,4.2594263033769512E-13,1.5615986984375426E-7]
[4220,2.2956444771309253E-21,6.2133345905320573E-10,2.1458167954379652E-4,null,4220,2.2934478221988711E-21,6.1633504795382941E-10,2.1300857652719769E-4,null,4220,2.0166865875543875E-24,4.4122534587951713E-13,1.5570209420966643E-7]
[4230,2.3194059264303995E-21,6.4345358009661791E-10,2.1395264299866834E-4,null,4230,2.31765254347497E-21,6.3827939099294664E-10,2.1238415146214107E-4,null,4230,2.0570177790091519E-24,4.569799732921871E-13,1.5524566052023487E-7]
[4240,2.3379998221106017E-21,6.6625103099770698E-10,2.1332545044891091E-4,null,4240,2.3366583657744116E-21,6.6089575306883154E-10,2.1176155687477476E-4,null,4240,2.0927508784854659E-24,4.7321855626542214E-13,1.5479056484814548E-7]
[4250,2.35129070929994E-21,6.8974293637738805E-10,2.1270009648628293E-4,null,4250,2.3503213312480099E-21,6.8420112655550541E-10,2.1114078739688623E-4,null,4250,2.123608569642993E-24,4.8995337414331915E-13,1.5433680327168853E-7]
[4260,2.3591713132979956E-21,7.1394675213882881E-10,2.1207657571814789E-4,null,4260,2.3585249114816325E-21,7.0821283259833868E-10,2.1052183767319394E-4,null,4260,2.1493244064342468E-24,5.0719694484789309E-13,1.5388437187272258E-7]
[4270,2.3615653631972921E-21,7.3888026950634667E-10,2.1145488277325142E-4,null,4270,2.3611827830969187E-21,7.3294852512323004E-10,2.0990470237235688E-4,null,4270,2.169644556011957E-24,5.249620278071427E-13,1.5343326675759948E-7]
[4280,2.3584305386073571E-21,7.6456161906940855E-10,2.1083501229622633E-4,null,4280,2.3582417226309089E-21,7.5842619485085473E-10,2.0928937617759773E-4,null,4280,2.184329596134417E-24,5.4326162688712409E-13,1.5298348403784209E-7]
[4290,2.3497615443148023E-21,7.9100927483104155E-10,2.1021695894019157E-4,null,4290,2.3496846254467859E-21,7.8466417331531676E-10,2.0867585378626992E-4,null,4290,2.1931563662812197E-24,5.6210899332755056E-13,1.5253501983436377E-7]
[4300,2.335593319008501E-21,8.1824205825995024E-10,2.0960071737904546E-4,null,4300,2.3355336545012077E-21,8.1168113688648808E-10,2.0806412990491735E-4,null,4300,2.1959198725171184E-24,5.8151762868038178E-13,1.5208787028329989E-7]
[4310,2.3160043903855948E-21,8.4627914234565043E-10,2.0898628230429315E-4,null,4310,2.3158535308383539E-21,8.3949611079535638E-10,2.0745419926707331E-4,null,4310,2.1924352489329878E-24,6.0150128775093052E-13,1.5164203153289874E-7]
[4320,2.2911203789154586E-21,8.7514005565585732E-10,2.0837364841482195E-4,null,4320,2.2907549677404809E-21,8.6812847316163091E-10,2.0684605660964463E-4,null,4320,2.1825397731853435E-24,6.2207398154091047E-13,1.5119749973671478E-7]
[4330,2.261117665127306E-21,9.0484468639546272E-10,2.0776281043785163E-4,null,4330,2.2603982628943461E-21,8.9759795902293312E-10,2.0623969670158226E-4,null,4330,2.1660949400310343E-24,6.4324998019296173E-13,1.5075427106838741E-7]
[4340,2.226227227953294E-21,9.3541328646641321E-10,2.0715376310392452E-4,null,4340,2.2249970559085212E-21,9.2792466436490451E-10,2.0563511430574946E-4,null,4340,2.142988593146688E-24,6.6504381593614819E-13,1.5031234170275578E-7]
[4350,2.1867386673993712E-21,9.6686647552768943E-10,2.0654650116291642E-4,null,4350,2.1848222638066014E-21,9.591290501514155E-10,2.050323042172625E-4,null,4350,2.1131371175580951E-24,6.8747028603184273E-13,1.4987170783180894E-7]
[4360,2.1430044242209587E-21,9.9922524505472967E-10,2.0594101938288737E-4,null,4360,2.1402062063384519E-21,9.9123194635425553E-10,2.0443126123611473E-4,null,4360,2.0764876958225264E-24,7.1054445571953445E-13,1.4943236566030296E-7]
[4370,2.095444209403517E-21,1.0325109623975852E-9,2.0533731255025032E-4,null,4370,2.0915469344368365E-21,1.0242545559815629E-9,2.0383198019141235E-4,null,4370,2.0330206295785853E-24,7.342816611620366E-13,1.4899431140339497E-7]
[4380,2.0445496622581433E-21,1.0667453748370463E-9,2.047353754515207E-4,null,4380,2.039312778649592E-21,1.0582184591042669E-9,2.0323445590779058E-4,null,4380,1.982751732121116E-24,7.5869751238953521E-13,1.4855754127998687E-7]
[4390,1.9908892490001295E-21,1.1019506136380606E-9,2.0413520290557796E-4,null,4390,1.9840471300216434E-21,1.0931456168798454E-9,2.0263868323917291E-4,null,4390,1.9257347936748907E-24,7.838078962420098E-13,1.4812205152870813E-7]
[4400,1.9351134267524152E-21,1.1381491980996483E-9,2.0353678973846799E-4,null,4400,1.9263734769371457E-21,1.1290583755726341E-9,2.0204465705069404E-4,null,4400,1.8620641273519321E-24,8.0962897930941729E-13,1.4768783839476173E-7]
[4410,1.8779600864139382E-21,1.1753640396007567E-9,2.0294013079189544E-4,null,4410,1.8670007110872281E-21,1.1659794705701002E-9,2.0145237222446395E-4,null,4410,1.7918771979054029E-24,8.361772108692647E-13,1.472548981388655E-7]
[4420,1.8202602998590425E-21,1.2136184456410819E-9,2.023452209264059E-4,null,4420,1.8067287275056375E-21,1.2039320303941519E-9,2.0086182365758949E-4,null,4420,1.7153573419387656E-24,8.6346932582084698E-13,1.4682322702597084E-7]
[4430,1.7629443985240079E-21,1.2529361238763697E-9,2.0175205501362482E-4,null,4430,1.7464543438960904E-21,1.2429395807069818E-9,2.0027300625705179E-4,null,4430,1.6327365876012231E-24,8.9152234761579826E-13,1.4639282134158231E-7]
[4440,1.7070483971029685E-21,1.2933411861473382E-9,2.0116062793651047E-4,null,4440,1.6871775535860081E-21,1.283026048310574E-9,1.9968591494488977E-4,null,4440,1.5442985764260437E-24,9.2035359118434834E-13,1.4596367736894634E-7]
[4450,1.6537208085894977E-21,1.3348581525015672E-9,2.0057093460319463E-4,null,4450,1.6300081568044077E-21,1.3242157651392714E-9,1.991005446661709E-4,null,4450,1.4503816058581138E-24,9.499806658567855E-13,1.455357914121306E-7]
[4460,1.6042298589103155E-21,1.3775119552075364E-9,1.9998296993032442E-4,null,4460,1.5761727771785312E-21,1.3665334722445409E-9,1.9851689037518884E-4,null,4460,1.3513817900209955E-24,9.8042147827955345E-13,1.4510915978843383E-7]
[4470,1.55997115363066E-21,1.4213279427602484E-9,1.9939672884835129E-4,null,4470,1.5270223157832505E-21,1.4100043237714149E-9,1.9793494703949008E-4,null,4470,1.2477563619812321E-24,1.0116942353255594E-12,1.446837788127182E-7]
[4480,1.5224758148703085E-21,1.4663318838775329E-9,1.9881220630497224E-4,null,4480,1.4840398593419636E-21,1.454653890925695E-9,1.9735470964317548E-4,null,4480,1.1400271195553542E-24,1.0438174469980398E-12,1.4425964482030758E-7]
[4490,1.4934191370743579E-21,1.5125499714864971E-9,1.9822939726221272E-4,null,4490,1.4488490904244963E-21,1.5005081659313731E-9,1.9677617318463375E-4,null,4490,1.02878403448979E-24,1.0768099293276126E-12,1.4383675416095452E-7]
[4500,1.4746297972564919E-21,1.560008826699228E-9,1.976482966978227E-4,null,4500,1.4232232335550023E-21,1.5475935659774234E-9,1.9619933268442779E-4,null,4500,9.1468903732671364E-25,1.1106908072618211E-12,1.4341510318062977E-7]
[4510,1.4680996566846397E-21,1.6087355027771894E-9,1.9706889960793486E-4,null,4510,1.4090945740891429E-21,1.595936937153365E-9,1.956241831658508E-4,null,4510,7.9847999049223791E-25,1.1454795175468266E-12,1.4299468825926037E-7]
[4520,1.47599421492628E-21,1.6587574890834429E-9,1.9649120098833738E-4,null,4520,1.4085646079504871E-21,1.645565558372766E-9,1.9505071966901966E-4,null,4520,6.8097487497290857E-25,1.1811958116005623E-12,1.4257550575836834E-7]
[4530,1.5006637443631839E-21,1.7101027150221537E-9,1.9591519586993907E-4,null,4530,1.423914850548457E-21,1.6965071452841262E-9,1.9447893725510761E-4,null,4530,5.6307619741665974E-25,1.2178597583769894E-12,1.421575520769565E-7]
[4540,1.544655177202852E-21,1.7627995539645061E-9,1.953408792829773E-4,null,4540,1.4576183744648989E-21,1.7487898541683052E-9,1.9390883099533918E-4,null,4540,4.4577564999169661E-25,1.2554917472208068E-12,1.4174082360598062E-7]
[4550,1.6107247937509844E-21,1.8168768271604072E-9,1.9476824628131227E-4,null,4550,1.5123521232486879E-21,1.8024422858218291E-9,1.9334039598033326E-4,null,4550,3.3015903936671752E-25,1.2941124907121605E-12,1.4132531675716951E-7]
[4560,1.7018517553166874E-21,1.8723638076353174E-9,1.9419729192561813E-4,null,4560,1.5910100433411216E-21,1.8574934894254763E-9,1.9277362730402359E-4,null,4560,2.1741150014366868E-25,1.3337430275008881E-12,1.4091102794423101E-7]
[4570,1.8212525812334087E-21,1.9292902240713464E-9,1.9362801129849369E-4,null,4570,1.6967171324154234E-21,1.9139729663972326E-9,1.9220852008629692E-4,null,4570,1.0882303830634757E-25,1.3744047251296377E-12,1.4049795360422254E-7]
[4580,1.9723966006032397E-21,1.9876862646721035E-9,1.9306039949109667E-4,null,4580,1.8328444311488661E-21,1.971910674229154E-9,1.9164506945145655E-4,null,4580,5.79441114561958E-27,1.4161192828455401E-12,1.4008609017188531E-7]
[4590,2.1590224691613424E-21,2.0475825810104594E-9,1.9249445161305753E-4,null,4590,2.0030250495518557E-21,2.0313370303072669E-9,1.9108327054846575E-4,null,4590,0,1.4589087343997676E-12,1.3967543409768344E-7]
[4600,2.3851558314878606E-21,2.1090102918586055E-9,1.9193016278120525E-4,null,4600,2.2111713037426751E-21,2.0922829157139206E-9,1.9052311853261976E-4,null,4600,0,1.5027954508345677E-12,1.392659818410052E-7]
[4610,2.6551281964915295E-21,2.1720009869996964E-9,1.9136752814104122E-4,null,4610,2.4614930301189049E-21,2.154779679011863E-9,1.899646085799245E-4,null,4610,0,1.5478021432572479E-12,1.3885772988010049E-7]
[4620,2.9735971180276792E-21,2.2365867310203775E-9,1.9080654284102521E-4,null,4620,2.7585171672639735E-21,2.2188591400093552E-9,1.8940773587511136E-4,null,4620,0,1.5939518656005772E-12,1.3845067469154484E-7]
[4630,3.3455677832006459E-21,2.3028000670835258E-9,1.9024720203887564E-4,null,4630,3.1071087031802991E-21,2.2845535935056729E-9,1.8885249561266643E-4,null,4630,0,1.641268017369167E-12,1.3804481276281246E-7]
[4640,3.7764160835376711E-21,2.3706740206805721E-9,1.8968950092383883E-4,null,4640,3.5124930640817247E-21,2.3518958130163251E-9,1.8829888301759868E-4,null,4640,0,1.6897743463712969E-12,1.3764014060302752E-7]
[4650,4.2719132881685316E-21,2.4402421033625542E-9,1.8913343468040522E-4,null,4650,3.9802800591614172E-21,2.4209190544772119E-9,1.8774689330715473E-4,null,4650,0,1.7394949514356498E-12,1.3723665471900563E-7]
[4660,4.8382524304655906E-21,2.5115383164495131E-9,1.8857899852430318E-4,null,4660,4.5164894891280963E-21,2.491657059927253E-9,1.8719652173453791E-4,null,4660,0,1.7904542851126121E-12,1.3683435163870442E-7]
[4670,5.4820765057262612E-21,2.5845971547173154E-9,1.8802618767065481E-4,null,4670,5.1275785163679247E-21,2.5641440611686653E-9,1.8664776354876094E-4,null,4670,0,1.8426771563594836E-12,1.3643322789219051E-7]
[4680,6.2105086208435884E-21,2.6594536100613591E-9,1.8747499735616524E-4,null,4680,5.8204709319932357E-21,2.6384147834042643E-9,1.8610061402329773E-4,null,4680,0,1.896188733209225E-12,1.3603328001923272E-7]
[4690,7.0311842139224926E-21,2.7361431751364647E-9,1.8692542283127388E-4,null,4690,6.6025884347052934E-21,2.7145044488511808E-9,1.8555506844201015E-4,null,4690,0,1.9510145454222145E-12,1.3563450457524039E-7]
[4700,7.9522854901807999E-21,2.814701846972339E-9,1.8637745936379323E-4,null,4700,7.4818840665772665E-21,2.7924487803303087E-9,1.8501112210566483E-4,null,4700,0,2.0071804871205703E-12,1.3523689812855147E-7]
[4710,8.9825781969791704E-21,2.8951661305639229E-9,1.858311022231356E-4,null,4710,8.4668779228152933E-21,2.8722840048308514E-9,1.844687703210893E-4,null,4710,5.5731207444876763E-26,2.0647128194045315E-12,1.3484045724153425E-7]
[4720,1.013145093075819E-20,2.9775730424359948E-9,1.8528634670369294E-4,null,4720,9.5666953248820816E-21,2.9540468570493266E-9,1.8392800841489449E-4,null,4720,2.5750692186005878E-25,2.1236381729504457E-12,1.34445178504511E-7]
[4730,1.1408957089773487E-20,3.061960114181438E-9,1.8474318810774993E-4,null,4730,1.0791107568405879E-20,3.0377745829024209E-9,1.8338883172812665E-4,null,4730,5.046036405476568E-25,2.1839835505899496E-12,1.3405105850849329E-7]
[4740,1.2825859668006742E-20,3.1483653959724143E-9,1.8420162176059789E-4,null,4740,1.215057543600024E-20,3.1235049430129987E-9,1.8285123561694559E-4,null,4740,8.0141699700128878E-25,2.2457763298697436E-12,1.3365809385939739E-7]
[4750,1.4393679086022859E-20,3.2368274600439875E-9,1.83661642991031E-4,null,4750,1.365629566659587E-20,3.211276216168735E-9,1.823152154446741E-4,null,4750,1.1526441471385127E-24,2.3090442655916801E-12,1.3326628116828605E-7]
[4760,1.6124744201402569E-20,3.3273854041494475E-9,1.8312324714263886E-4,null,4760,1.5320250519136675E-20,3.3011272027526967E-9,1.817807665868165E-4,null,4760,1.5633033922171265E-24,2.3738154923325716E-12,1.3287561705811881E-7]
[4770,1.8032246742887734E-20,3.4200788549867424E-9,1.8258642957844304E-4,null,4770,1.7155260670742728E-20,3.3930972281452539E-9,1.8124788444353438E-4,null,4770,2.0387552067276685E-24,2.4401185269433286E-12,1.3248609815939963E-7]
[4780,2.0130299356172808E-20,3.5149479715955123E-9,1.8205118567182448E-4,null,4780,1.9175041632838256E-20,3.4872261460967958E-9,1.807165644236738E-4,null,4780,2.5847247428590612E-24,2.5079822710270318E-12,1.3209772112213057E-7]
[4790,2.2433997483140246E-20,3.6120334487239327E-9,1.8151751080556036E-4,null,4790,2.1394263898485947E-20,3.583554342070522E-9,1.8018680193833671E-4,null,4790,3.2073259190962373E-24,2.5774360133953532E-12,1.3171048259124107E-7]
[4800,2.495948532279926E-20,3.7113765201649835E-9,1.8098540038676068E-4,null,4800,2.3828617069355335E-20,3.6821227365548923E-9,1.7965859243288478E-4,null,4800,3.9130872002666309E-24,2.6485094325030767E-12,1.3132437923551483E-7]
[4810,2.772402608240761E-20,3.8130189620613565E-9,1.8045484982531223E-4,null,4810,2.6494878158536074E-20,3.7829727883449113E-9,1.7913193134775523E-4,null,4810,4.7089791616176254E-24,2.7212325988601084E-12,1.3093940772456771E-7]
[4820,3.0746076850705128E-20,3.9170030961786305E-9,1.7992585454836566E-4,null,4820,2.9410984402045841E-20,3.8861464977920014E-9,1.7860681414577927E-4,null,4820,5.6024439953237316E-24,2.7956359774207486E-12,1.3055556473906076E-7]
[4830,3.4045368255183529E-20,4.0233717931458922E-9,1.7939840999640959E-4,null,4830,3.2596110726294605E-20,3.991686410021502E-9,1.7808323630302958E-4,null,4830,6.6014270165219594E-24,2.8717504299495604E-12,1.3017284697233576E-7]
[4840,3.7642989317758445E-20,4.1321684756633787E-9,1.7887251162420248E-4,null,4840,3.6070752289367777E-20,4.0996356181174879E-9,1.7756119330353509E-4,null,4840,7.7144103767535996E-24,2.9496072173635999E-12,1.2979125112385603E-7]
[4850,4.1561477674465007E-20,4.2434371216767211E-9,1.7834815490077663E-4,null,4850,3.9856812244232713E-20,4.2100377662744036E-9,1.7704068065140863E-4,null,4850,8.9504490386475587E-24,3.0292380020506419E-12,1.2941077390867751E-7]
[4860,4.5824915611175908E-20,4.3572222675168517E-9,1.7782533530727514E-4,null,4860,4.3977695176827552E-20,4.3229370529146998E-9,1.7652169385913379E-4,null,4860,1.0319209238474896E-23,3.1106748501627386E-12,1.2903141204563668E-7]
[4870,5.0459032133085973E-20,4.4735690110053353E-9,1.7730404832948157E-4,null,4870,4.845840642629857E-20,4.4383782337720593E-9,1.7600422844673357E-4,null,4870,1.1831009519007202E-23,3.1939502338849556E-12,1.2865316226143123E-7]
[4880,5.5491311488635703E-20,4.5925230145245598E-9,1.7678428948756148E-4,null,4880,5.3325657696731893E-20,4.5564066249398215E-9,1.7548827996905075E-4,null,4880,1.3496864534212688E-23,3.2790970336788266E-12,1.2827602130397051E-7]
[4890,6.0951108468989243E-20,4.7141305080520998E-9,1.76266054291326E-4,null,4890,5.8607979278579551E-20,4.6770681058838363E-9,1.7497384396642702E-4,null,4890,1.532853176871596E-23,3.366148540500059E-12,1.2789998591463303E-7]
[4900,6.6869770923868012E-20,4.8384382921587918E-9,1.7574933827870786E-4,null,4900,6.4335839310662874E-20,4.8004091224192917E-9,1.7446091601184383E-4,null,4900,1.7338561379885165E-23,3.4551384579901597E-12,1.2752505285628668E-7]
[4910,7.3280769811031632E-20,4.9654937409700724E-9,1.752341369981697E-4,null,4910,7.0541770386682057E-20,4.9264766896511098E-9,1.739494916825086E-4,null,4910,1.9540349297071135E-23,3.5461009046416005E-12,1.2715121890016163E-7]
[4920,8.0219837316522615E-20,5.0953448050900139E-9,1.7472044600328368E-4,null,4920,7.7260504037074961E-20,5.0553183948772731E-9,1.7343956656679706E-4,null,4920,2.1948193841959965E-23,3.6390704159361753E-12,1.2677848081654256E-7]
[4930,8.7725113382424503E-20,5.2280400144875838E-9,1.742082608726162E-4,null,4930,8.4529113415958662E-20,5.186982400454753E-9,1.7293113627698381E-4,null,4930,2.4577356008711099E-23,3.7340819464561899E-12,1.2640683540200698E-7]
[4940,9.583730116735019E-20,5.3636284813443847E-9,1.7369757719044827E-4,null,4940,9.238716470034896E-20,5.3215174466271128E-9,1.7242419642914084E-4,null,4940,2.7444123657863437E-23,3.8311708719678396E-12,1.2603627944962074E-7]
[4950,1.0459983193933379E-19,5.5021599028639192E-9,1.7318839055643445E-4,null,4950,1.0087687769719385E-19,5.4589728543139809E-9,1.7191874265223031E-4,null,4950,3.0565879854080107E-23,3.9303729914770097E-12,1.2566680976587213E-7]
[4960,1.140590398596343E-19,5.6436845640413176E-9,1.7268069657416373E-4,null,4960,1.10043296103238E-19,5.5993985278612941E-9,1.7141477058773151E-4,null,4960,3.3961175554060151E-23,4.0317245292564936E-12,1.2529842316265379E-7]
[4970,1.2426434724540019E-19,5.7882533403934304E-9,1.721744908775855E-4,null,4970,1.1993446799004796E-19,5.742844957752148E-9,1.7091227589423954E-4,null,4970,3.7649806926075078E-23,4.1352621368447295E-12,1.2493111646923184E-7]
[4980,1.3526846085655311E-19,5.935917700648692E-9,1.7166976909941176E-4,null,4980,1.3060163705230685E-19,5.8893632232778226E-9,1.7041125424409692E-4,null,4980,4.1652897551995311E-23,4.2410228950155184E-12,1.2456488651867733E-7]
[4990,1.4712757979058292E-19,6.0867297093962035E-9,1.711665268906815E-4,null,4990,1.4209944519015919E-19,6.0390049951682117E-9,1.6991170131547791E-4,null,4990,4.5992985784585753E-23,4.3490443157183936E-12,1.2419973015529088E-7]
[5000,1.5990161563977761E-19,6.2407420296938996E-9,1.7066475991323832E-4,null,5000,1.544861470594896E-19,6.1918225381817627E-9,1.6941361279985289E-4,null,5000,5.0694117567000176E-23,4.4593643439894566E-12,1.2383564422887776E-7]
[5010,1.7365442547547983E-19,6.3980079256348521E-9,1.7016446384603829E-4,null,5010,1.6782383714899064E-19,6.3478687136537777E-9,1.6891698441375306E-4,null,5010,5.5781944977811837E-23,4.5720213598320599E-12,1.2347262560857126E-7]
[5020,1.8845405840884826E-19,6.5585812648718123E-9,1.6966563437056923E-4,null,5020,1.8217869011373777E-19,6.5071969820033183E-9,1.6842181187098684E-4,null,5020,6.1283830850864223E-23,4.6870541800673935E-12,1.2311067115898143E-7]
[5030,2.0437301648478407E-19,6.7225165210992414E-9,1.6916826719294551E-4,null,5030,1.976212151082416E-19,6.6698614051979318E-9,1.6792809090130731E-4,null,5030,6.722895984221389E-23,4.8045020601543908E-12,1.2274977776233052E-7]
[5040,2.2148853047534909E-19,6.8898687764923785E-9,1.6867235802448717E-4,null,5040,2.1422652466683358E-19,6.8359166491756681E-9,1.6743581725464751E-4,null,5040,7.3648456184025627E-23,4.9244046959786386E-12,1.2238994230953512E-7]
[5050,2.3988285154931997E-19,7.0606937241032203E-9,1.6817790259298173E-4,null,5050,2.3207461909689319E-19,7.0054179862244093E-9,1.6694498668632155E-4,null,5050,8.0575508610628994E-23,5.0468022256102633E-12,1.220311616972057E-7]
[5060,2.5964355947056994E-19,7.2350476702127524E-9,1.6768489663116729E-4,null,5060,2.5125068701345801E-19,7.1784212973177371E-9,1.6645559496137257E-4,null,5060,8.8045502755684313E-23,5.1717352310301661E-12,1.2167343283189532E-7]
[5070,2.8086388833599371E-19,7.4129875366390422E-9,1.6719333589588283E-4,null,5070,2.7184542300886282E-19,7.3549830744070103E-9,1.6596763786777405E-4,null,5070,9.6096161503311743E-23,5.2992447398244699E-12,1.2131675263295048E-7]
[5080,3.0364307052071079E-19,7.594570863001146E-9,1.6670321615056479E-4,null,5080,2.9395536311545865E-19,7.5351604226695836E-9,1.6548111120289838E-4,null,5080,1.0476769360101061E-22,5.4293722268470575E-12,1.2096111802928669E-7]
[5090,3.280866999961014E-19,7.7798558089377638E-9,1.6621453316811242E-4,null,5090,3.1768323918595695E-19,7.7190110627120824E-9,1.6499601076604478E-4,null,5090,1.1410295110442956E-22,5.5621596158494542E-12,1.2060652595014903E-7]
[5100,3.5430711581252102E-19,7.9689011562812696E-9,1.6572728273610214E-4,null,5100,3.4313835299163545E-19,7.9065933327294841E-9,1.6451233237878729E-4,null,5100,1.24147596023753E-22,5.6976492810784475E-12,1.2025297334176826E-7]
[5110,3.8242380689697628E-19,8.1617663111856728E-9,1.6524146066169764E-4,null,5110,3.7043697114058744E-19,8.0979661906183176E-9,1.640300718760565E-4,null,5110,1.3495027672235963E-22,5.8358840488404978E-12,1.1990045715839786E-7]
[5120,4.1256383904008676E-19,8.3585113062090364E-9,1.6475706274846354E-4,null,5120,3.9970274168219008E-19,8.2931892160448365E-9,1.6354922509487053E-4,null,5120,1.4656281448098038E-22,5.9769071990332422E-12,1.1954897435901496E-7]
[5130,4.4486230540771179E-19,8.5591968023494963E-9,1.6427408482890641E-4,null,5130,4.3106713370857799E-19,8.4923226124669977E-9,1.6306978789512559E-4,null,5130,1.5904040088288189E-22,6.1207624666434617E-12,1.1919852191771624E-7]
[5140,4.7946280152254452E-19,8.7638840910346453E-9,1.637925227351164E-4,null,5140,4.6466990087031195E-19,8.6954272091102546E-9,1.6259175614463287E-4,null,5140,1.7244180646035338E-22,6.2674940432113642E-12,1.1884909681017155E-7]
[5150,5.1651792605236612E-19,8.9726350960643638E-9,1.6331237231797681E-4,null,5150,5.006595701176742E-19,8.9025644628970441E-9,1.6211512571992105E-4,null,5150,1.8682960125009981E-22,6.4171465782612707E-12,1.1850069602469726E-7]
[5160,5.5618980860219902E-19,9.1855123755059434E-9,1.6283362944394096E-4,null,5160,5.3919395685152622E-19,9.1137964603290724E-9,1.6163989252187402E-4,null,5160,2.0227038784889774E-22,6.5697651806977572E-12,1.1815331656450959E-7]
[5170,5.9865066584334325E-19,9.4025791235420794E-9,1.6235628997971177E-4,null,5170,5.8044070775764104E-19,9.3291859193225951E-9,1.6116605244455577E-4,null,5170,2.1883504758862391E-22,6.7253954201677985E-12,1.1780695542779803E-7]
[5180,6.4408338728320884E-19,9.6238991722708445E-9,1.6188034981433368E-4,null,5180,6.2457787264616651E-19,9.548796190996314E-9,1.6069360140666682E-4,null,5180,2.3659900048547917E-22,6.8840833283882043E-12,1.1746160963480284E-7]
[5190,6.9268215227721153E-19,9.849536993457698E-9,1.6140580485169963E-4,null,5190,6.7179450682218307E-19,9.7726912614114323E-9,1.6022253534430205E-4,null,5190,2.5564247973732577E-22,7.0458754004382898E-12,1.1711727621158319E-7]
[5200,7.446530794256476E-19,1.0079557700238912E-8,1.6093265099156247E-4,null,5200,7.2229130513257196E-19,1.0000935753263581E-8,1.5975285018463451E-4,null,5200,2.7605082130186718E-22,7.2108185960175488E-12,1.1677395218122407E-7]
[5210,8.0021491041615584E-19,1.0314027048776554E-8,1.604608841609618E-4,null,5210,7.7628126970047584E-19,1.0233594927526724E-8,1.5928454188653471E-4,null,5210,2.9791476961226324E-22,7.3789603406681931E-12,1.164316345917495E-7]
[5220,8.5959972929776164E-19,1.0553011439864324E-8,1.5999050029386213E-4,null,5220,8.339904123124537E-19,1.0470734685048158E-8,1.588176064128962E-4,null,5220,3.213307998377141E-22,7.5503485269622105E-12,1.1609032048882881E-7]
[5230,9.2305371953545407E-19,1.0796577920484417E-8,1.5952149533536168E-4,null,5230,8.9565849374990591E-19,1.0712421568094968E-8,1.5835203974114251E-4,null,5230,3.4640145792610229E-22,7.7250315156529794E-12,1.157500069339198E-7]
[5240,9.9083795989179448E-19,1.1044794185314721E-8,1.5905386524385322E-4,null,5240,9.615398011160143E-19,1.0958722761851254E-8,1.5788783785700036E-4,null,5240,3.7323571884537093E-22,7.9030581367909493E-12,1.1541069099348326E-7]
[5250,1.0632292617285426E-18,1.1297728578186696E-8,1.5858760598658675E-4,null,5250,1.0319039656740703E-18,1.1209706095866206E-8,1.574249967556613E-4,null,5250,4.0194936439982443E-22,8.0844776908036557E-12,1.1507236973864358E-7]
[5260,1.1405210488567281E-18,1.1555450093492814E-8,1.5812271355219819E-4,null,5260,1.1070368223018895E-18,1.1465440045452398E-8,1.5696351246020199E-4,null,5260,4.3266538108777142E-22,8.2693399495392551E-12,1.1473504026272436E-7]
[5270,1.2230242825103119E-18,1.1818028377544529E-8,1.5765918392947326E-4,null,5270,1.1872413131080425E-18,1.1725993733034675E-8,1.5650338098134375E-4,null,5270,4.6551437932052592E-22,8.457695157274168E-12,1.1439869965339802E-7]
[5280,1.3110684332350642E-18,1.2085533729879281E-8,1.5719701311902749E-4,null,5280,1.2728384369478988E-18,1.1991436929448725E-8,1.5604459835528826E-4,null,5280,5.0063503489188248E-22,8.6495940316840164E-12,1.1406334500756872E-7]
[5290,1.4050025016903363E-18,1.2358037104517611E-8,1.567361971427059E-4,null,5290,1.3641682468043023E-18,1.2261840055189913E-8,1.5558716063023708E-4,null,5290,5.3817455364608932E-22,8.8450877647782442E-12,1.1372897344055086E-7]
[5300,1.5051960910477986E-18,1.2635610111168781E-8,1.5627673202598286E-4,null,5300,1.461590897646695E-18,1.2537274181611178E-8,1.5513106386288582E-4,null,5300,5.782891607176577E-22,9.0442280237976257E-12,1.1339558206732586E-7]
[5310,1.6120405328253064E-18,1.291832501638633E-8,1.5581861381512376E-4,null,5310,1.5654877466105629E-18,1.2817811032071075E-8,1.5467630412750545E-4,null,5310,6.2114461525060096E-22,9.2470669520754127E-12,1.1306316801828207E-7]
[5320,1.725950068773596E-18,1.3206254744671721E-8,1.553618385550221E-4,null,5320,1.6762625080078335E-18,1.3103522983030409E-8,1.5422287749609892E-4,null,5320,6.6691675187134155E-22,9.4536571698609845E-12,1.1273172842586308E-7]
[5330,1.8473630913356621E-18,1.3499472879527249E-8,1.5490640231148953E-4,null,5330,1.7943424656829196E-18,1.339448306509851E-8,1.5377078006740039E-4,null,5330,7.1579205020102098E-22,9.6640517751067281E-12,1.1240126042985974E-7]
[5340,1.9767434453002685E-18,1.3798053664457532E-8,1.5445230115978859E-4,null,5340,1.9201797452812654E-18,1.3690764964028338E-8,1.5332000794043464E-4,null,5340,7.6796823372600804E-22,9.8783043442176094E-12,1.1207176119264739E-7]
[5350,2.1145817932062372E-18,1.4102072003919042E-8,1.5399953117892229E-4,null,5350,2.0542526488876309E-18,1.3992443021660218E-8,1.5287055722718157E-4,null,5350,8.2365489927026774E-22,1.0096468932763277E-11,1.1174322786097172E-7]
[5360,2.2613970475208516E-18,1.4411603464218138E-8,1.535480884778873E-4,null,5360,2.1970670550807594E-18,1.4299592236814209E-8,1.5242242406017596E-4,null,5360,8.8307417863049601E-22,1.0318600076152628E-11,1.1141565761207121E-7]
[5370,2.4177378722058054E-18,1.4726724274357384E-8,1.5309796916098943E-4,null,5370,2.349157886883043E-18,1.4612288266131392E-8,1.5197560457805303E-4,null,5370,9.464614336515523E-22,1.0544752790271164E-11,1.1108904762368192E-7]
[5380,2.5841842571036005E-18,1.5047511326829674E-8,1.5264916934606954E-4,null,5380,2.5110906510349188E-18,1.493060742486318E-8,1.5153009492625168E-4,null,5380,1.0140659864870975E-21,1.0774982572080306E-11,1.1076339507205795E-7]
[5390,2.7613491679568153E-18,1.5374042178360187E-8,1.5220168517161218E-4,null,5390,2.6834630513072425E-18,1.5254626687608863E-8,1.510858912656129E-4,null,5390,1.086151886496262E-21,1.1009345400179095E-11,1.1043869716121058E-7]
[5400,2.9498802754482403E-18,1.5706395050596513E-8,1.5175551277356111E-4,null,5400,2.8669066792308798E-18,1.5584423689001803E-8,1.5064298976861129E-4,null,5400,1.1629987154052609E-21,1.1247897735328212E-11,1.1011495108519571E-7]
[5410,3.1504617667089739E-18,1.6044648830745956E-8,1.5131064831107023E-4,null,5410,3.0620887855302422E-18,1.5920076724343107E-8,1.5020138661804157E-4,null,5410,1.2449024325927907E-21,1.1490696520935746E-11,1.0979215405788014E-7]
[5420,3.3638162427423902E-18,1.6388883072160783E-8,1.5086708794744217E-4,null,5420,3.2697141357492108E-18,1.6261664750183652E-8,1.4976107800440913E-4,null,5420,1.3321762621633281E-21,1.1737799183505224E-11,1.094703032929879E-7]
[5430,3.5907067054609124E-18,1.673917799487088E-8,1.5042482786603107E-4,null,5430,3.4905269536441188E-18,1.6609267384853859E-8,1.4932206014279587E-4,null,5430,1.4251516237233168E-21,1.1989263633045575E-11,1.091493960238666E-7]
[5440,3.8319386378985539E-18,1.7095614486063827E-8,1.4998386424303704E-4,null,5440,3.7253129557968197E-18,1.6962964908941374E-8,1.4888432923170413E-4,null,5440,1.52417910864982E-21,1.2245148263442908E-11,1.0882942947494368E-7]
[5450,4.088362182128185E-18,1.7458274100512322E-8,1.4954419328985327E-4,null,5450,3.9749014819977223E-18,1.7322838265716443E-8,1.4844788151610857E-4,null,5450,1.629629504238232E-21,1.2505511952794138E-11,1.0851040089583878E-7]
[5460,4.3608744182365638E-18,1.7827239060948687E-8,1.4910581121150608E-4,null,5460,4.2401677245730647E-18,1.7688969061504694E-8,1.480127132264651E-4,null,5460,1.7418948673432055E-21,1.2770414063702268E-11,1.0819230753515171E-7]
[5470,4.6504217487913065E-18,1.8202592258387361E-8,1.486687142277849E-4,null,5470,4.5220350611049201E-18,1.8061439566008359E-8,1.4757882061135615E-4,null,5470,1.861389649831029E-21,1.3039914443533897E-11,1.0787514664679446E-7]
[5480,4.9580023938636667E-18,1.858441725239364E-8,1.4823289857545429E-4,null,5480,4.821477495441422E-18,1.8440332712574118E-8,1.4714619993274017E-4,null,5480,1.9885518784993643E-21,1.3314073424637789E-11,1.0755891550676851E-7]
[5490,5.2846689999510588E-18,1.8972798271300017E-8,1.4779836049863429E-4,null,5490,5.1395222103083663E-18,1.8825732098408976E-8,1.4671484746396231E-4,null,5490,2.1238443910619948E-21,1.3592951824525451E-11,1.0724361137967668E-7]
[5500,5.6315313683099699E-18,1.9367820212369878E-8,1.4736509625084689E-4,null,5500,5.4772522369319567E-18,1.9217721984743697E-8,1.4628475948415181E-4,null,5500,2.2677561311374109E-21,1.3876610946013456E-11,1.0692923155485875E-7]
[5510,5.9997593076127357E-18,1.9769568641907851E-8,1.4693310209816022E-4,null,5510,5.8358092465131253E-18,1.9616387296943645E-8,1.4585593229161437E-4,null,5510,2.4208035047592437E-21,1.4165112577327192E-11,1.0661577332092398E-7]
[5520,6.3905856155356944E-18,2.0178129795317753E-8,1.4650237431161037E-4,null,5520,6.2163964679964767E-18,2.0021813624567124E-8,1.4542836218025355E-4,null,5520,2.5835318007563265E-21,1.4458518992166373E-11,1.0630323397353234E-7]
[5530,6.805309194617407E-18,2.0593590577107026E-8,1.4607290918944256E-4,null,5530,6.6202817375094301E-18,2.0434087221371079E-8,1.4500204547518374E-4,null,5530,2.7565166777879981E-21,1.4756892949732001E-11,1.0599161082278269E-7]
[5540,7.2452983080335301E-18,2.1016038560838907E-8,1.4564470302263357E-4,null,5540,7.0488006848486695E-18,2.0853295005264531E-8,1.4457697849823087E-4,null,5540,2.9403657209770072E-21,1.5060297694715209E-11,1.0568090118028424E-7]
[5550,7.7119939807105267E-18,2.1445561989031173E-8,1.4521775212154343E-4,null,5550,7.5033600625049616E-18,2.1279524558209287E-8,1.4415315758294203E-4,null,5550,3.135720070939642E-21,1.5368796957247355E-11,1.0537110236791189E-7]
[5560,8.2069135517606886E-18,2.1882249773002506E-8,1.4479205281072268E-4,null,5560,7.9854412229637147E-18,2.1712864126068364E-8,1.4373057908365918E-4,null,5560,3.3432561283666571E-21,1.5682454952812225E-11,1.0506221172015847E-7]
[5570,8.7316543835534324E-18,2.2326191492665304E-8,1.4436760141912778E-4,null,5570,8.4966037495675817E-18,2.2153402618401462E-8,1.4330923935445205E-4,null,5570,3.5636873368292535E-21,1.6001336382119175E-11,1.0475422657174421E-7]
[5580,9.2878977348066272E-18,2.2777477396266592E-8,1.4394439428485234E-4,null,5580,9.0384892481956636E-18,2.260122960820888E-8,1.4288913476290661E-4,null,5580,3.7977660478198807E-21,1.6325506430938775E-11,1.0444714426328882E-7]
[5590,9.8774128029778052E-18,2.3236198400075185E-8,1.4352242776665135E-4,null,5590,9.6128253049108656E-18,2.3056435331621989E-8,1.4247026168836212E-4,null,5590,4.0462854706541351E-21,1.6655030769899338E-11,1.0414096215730488E-7]
[5600,1.0502060943202401E-17,2.3702446088017132E-8,1.4310169821985866E-4,null,5600,1.022142961669123E-17,2.3519110687542476E-8,1.4205261652174095E-4,null,5600,4.3100817111138834E-21,1.6989975554245939E-11,1.038356776086063E-7]
[5610,1.1163800070639459E-17,2.4176312711257441E-8,1.4268220202646092E-4,null,5610,1.0866214302018773E-17,2.3989347237228106E-8,1.4163619566354236E-4,null,5610,4.5900359023959422E-21,1.7330407423560345E-11,1.0353128798924672E-7]
[5620,1.1864689252841968E-17,2.4657891187729848E-8,1.4226393556401922E-4,null,5620,1.1549190397808203E-17,2.4467237203827172E-8,1.4122099551975152E-4,null,5620,4.8870764318845708E-21,1.7676393501443427E-11,1.0322779067126733E-7]
[5630,1.2606893500273252E-17,2.5147275101614256E-8,1.4184689523592402E-4,null,5630,1.2272472550628238E-17,2.4952873471860662E-8,1.4080701252467396E-4,null,5630,5.2021812679969815E-21,1.8028001395159266E-11,1.0292518304428516E-7]
[5640,1.3392688761805778E-17,2.5644558702760668E-8,1.4143107743783045E-4,null,5640,1.3038283908959294E-17,2.5446349586651575E-8,1.4039424309483607E-4,null,5640,5.5363803907375018E-21,1.8385299195240724E-11,1.0262346249668105E-7]
[5650,1.4224467133204938E-17,2.6149836906061853E-8,1.4101647859445228E-4,null,5650,1.3848961224314067E-17,2.5947759753703268E-8,1.3998268368647977E-4,null,5650,5.8907583301345788E-21,1.874835547505751E-11,1.0232262643244234E-7]
[5660,1.5104742286871956E-17,2.6663205290773094E-8,1.4060309512861697E-4,null,5660,1.4706960169425122E-17,2.6457198838025199E-8,1.395723307434556E-4,null,5660,6.2664568170343934E-21,1.9117239290345979E-11,1.020226722533324E-7]
[5670,1.6036155131723565E-17,2.7184760099780092E-8,1.4019092347459803E-4,null,5670,1.5614860882108322E-17,2.6974762363407275E-8,1.3916318072866669E-4,null,5670,6.6646775509366102E-21,1.9492020178701154E-11,1.0172359737476108E-7]
[5680,1.7021479710185195E-17,2.7714598238814145E-8,1.3977996008379567E-4,null,5680,1.6575373741757375E-17,2.7500546511641884E-8,1.3875523011964918E-4,null,5680,7.0866850884769023E-21,1.9872768159030581E-11,1.0142539922176449E-7]
[5690,1.8063629342788789E-17,2.8252817275616186E-8,1.3937020141427021E-4,null,5690,1.7591345388695891E-17,2.8034648121695023E-8,1.3834847539969224E-4,null,5690,7.5338098583003761E-21,2.0259553730970851E-11,1.0112807522251463E-7]
[5700,1.9165663029538269E-17,2.8799515439048422E-8,1.3896164393520412E-4,null,5700,1.8665764995486555E-17,2.8577164688825673E-8,1.3794291306394357E-4,null,5700,8.0074513071083884E-21,2.0652447874266236E-11,1.0083162281777876E-7]
[5710,2.03307921157813E-17,2.9354791618153988E-8,1.3855428412120236E-4,null,5710,1.9801770797683835E-17,2.9128194363653171E-8,1.3753853961387895E-4,null,5710,8.5090811810545211E-21,2.1051522048109436E-11,1.0053603944716855E-7]
[5720,2.1562387235001744E-17,2.9918745361165915E-8,1.3814811846837481E-4,null,5720,2.1002656896308789E-17,2.9687835951174716E-8,1.3713535157052848E-4,null,5720,9.0402469490946726E-21,2.1456848190445385E-11,1.0024132256823321E-7]
[5730,2.2863985536386894E-17,3.0491476874463492E-8,1.377431434699672E-4,null,5730,2.2271880339769097E-17,3.0256188909730257E-8,1.3673334545154765E-4,null,5730,9.6025753726041078E-21,2.1868498717237213E-11,9.9947469638409112E-8]
[5740,2.4239298208474658E-17,3.1073087021478368E-8,1.3733935563713893E-4,null,5740,2.3613068496278919E-17,3.08333533499177E-8,1.363325177964449E-4,null,5740,1.0197776227092113E-20,2.2286546521695052E-11,9.9654478122805484E-8]
[5750,2.569221831029445E-17,3.1663677321548197E-8,1.3693675148922265E-4,null,5750,2.5030026728037181E-17,3.141943003345621E-8,1.3593286515045034E-4,null,5750,1.0827646182517882E-20,2.2711064973467483E-11,9.9362345500925181E-8]
[5760,2.7226828919578521E-17,3.2263349948720753E-8,1.3653532755873493E-4,null,5760,2.6526746376568998E-17,3.2014520371999683E-8,1.3553438406706386E-4,null,5760,1.1494072846942478E-20,2.3142127917796191E-11,9.907106925210673E-8]
[5770,2.884741161134787E-17,3.287220773050605E-8,1.3613508038381615E-4,null,5770,2.8107413072275131E-17,3.2618726425899516E-8,1.3513707111299054E-4,null,5770,1.2199038981149416E-20,2.3579809674633496E-11,9.8780646866333906E-8]
[5780,3.0558455276220446E-17,3.3490354146577957E-8,1.3573600651284602E-4,null,5780,2.9776415377498926E-17,3.3232150902916473E-8,1.3474092286112804E-4,null,5780,1.2944626888783642E-20,2.4024185037722593E-11,9.8491075839878919E-8]
[5790,3.2364665293607368E-17,3.4117893327425837E-8,1.3533810251431896E-4,null,5790,3.1538353777778878E-17,3.3854897156883364E-8,1.3434593590499292E-4,null,5790,1.373302299065409E-20,2.4475329273641871E-11,9.820235367915077E-8]
[5800,3.4270973069451506E-17,3.4754930052954912E-8,1.3494136495021688E-4,null,5800,3.3398050031083718E-17,3.4487069186316598E-8,1.3395210683430842E-4,null,5800,1.4566522588215324E-20,2.4933318120811868E-11,9.7914477894730003E-8]
[5810,3.6282545953433646E-17,3.540156975103777E-8,1.3454579040559082E-4,null,5810,3.5360556889416909E-17,3.5128771632979423E-8,1.3355943225350052E-4,null,5810,1.5447534824252248E-20,2.5398227788466419E-11,9.7627446004556833E-8]
[5820,3.8404797548172942E-17,3.6057918496014339E-8,1.3415137546799765E-4,null,5820,3.7431168205304744E-17,3.5780109780393972E-8,1.3316790877994565E-4,null,5820,1.6378587847907551E-20,2.5870134955586641E-11,9.7341255534931862E-8]
[5830,4.064339842318807E-17,3.6724083007143223E-8,1.3375811674197887E-4,null,5830,3.9615429435647651E-17,3.6441189552304722E-8,1.3277753304255554E-4,null,5830,1.7362334190527819E-20,2.634911676979946E-11,9.7055904019542163E-8]
[5840,4.3004287250327503E-17,3.7400170647003396E-8,1.333660108384122E-4,null,5840,4.191914855933893E-17,3.7112117511093185E-8,1.3238830167656076E-4,null,5840,1.8401556361895982E-20,2.6835250846239806E-11,9.6771389002364633E-8]
[5850,4.5493682371876537E-17,3.8086289419845794E-8,1.3297505437093849E-4,null,5850,4.4348407419722352E-17,3.7793000856142283E-8,1.3200021132008901E-4,null,5850,1.9499172672645654E-20,2.7328615266376794E-11,9.6487708023134637E-8]
[5860,4.8118093819141333E-17,3.8782547969896534E-8,1.3258524397777096E-4,null,5860,4.6909573509336315E-17,3.8483947422153434E-8,1.3161325863421801E-4,null,5860,2.0658243292779777E-20,2.7829288576804291E-11,9.6204858646436588E-8]
[5870,5.0884335795118991E-17,3.9489055579610787E-8,1.3219657629505227E-4,null,5870,4.9609312210448908E-17,3.918506567741372E-8,1.3122744028391662E-4,null,5870,2.188197655366178E-20,2.8337349787995768E-11,9.5922838427111466E-8]
[5880,5.379953963778658E-17,4.020592216787803E-8,1.3180904797142695E-4,null,5880,5.2454599507410979E-17,3.9896464722015733E-8,1.3084275293850591E-4,null,5880,2.3173735502524868E-20,2.8852878373023776E-11,9.5641644935461515E-8]
[5890,5.6871167280734545E-17,4.0933258288179233E-8,1.3142265567384976E-4,null,5890,5.545273518756066E-17,4.0618254286028966E-8,1.304591932909949E-4,null,5890,2.4537044718854631E-20,2.9375954266244382E-11,9.5361275755166025E-8]
[5900,6.010702522619525E-17,4.1671175126694664E-8,1.3103739606634162E-4,null,5900,5.8611356545268857E-17,4.1350544727622528E-8,1.3007675803240203E-4,null,5900,2.5975597400611862E-20,2.9906657861945869E-11,9.5081728463621058E-8]
[5910,6.3515279050055393E-17,4.2419784500365539E-8,1.3065326582961713E-4,null,5910,6.1938452608532158E-17,4.2093447031142131E-8,1.2969544386210152E-4,null,5910,2.749326273144098E-20,3.0445070012963374E-11,9.4803000648480965E-8]
[5920,6.7104468455916838E-17,4.3179198854905459E-8,1.3027026165538492E-4,null,5920,6.544237890473397E-17,4.2847072805136828E-8,1.2931524749807319E-4,null,5920,2.9094093538094157E-20,3.0991272029257493E-11,9.452508991555103E-8]
[5930,7.088352289416606E-17,4.3949531262767374E-8,1.2988838024151196E-4,null,5930,6.913187278145535E-17,4.3611534280342088E-8,1.2893616566626262E-4,null,5930,3.0782334246821704E-20,3.15453456764604E-11,9.4247993863396035E-8]
[5940,7.4861777768659522E-17,4.4730895421060205E-8,1.2950761829027448E-4,null,5940,7.3016069304520289E-17,4.4386944307612496E-8,1.2855819508913969E-4,null,5940,3.2562429151406075E-20,3.2107373174384829E-11,9.3971710103522603E-8]
[5950,7.9048991246843183E-17,4.5523405649421117E-8,1.2912797252921115E-4,null,5950,7.7104517748720421E-17,4.517341635581056E-8,1.2818133251802532E-4,null,5950,3.4439031001549812E-20,3.2677437195501531E-11,9.3696236260496529E-8]
[5960,8.3455361696137648E-17,4.6327176887838831E-8,1.2874943968616519E-4,null,5960,8.1407198703903418E-17,4.5971064509647087E-8,1.2780557470980271E-4,null,5960,3.6417009924157313E-20,3.3255620863380545E-11,9.3421569959122961E-8]
[5970,8.8091545764382697E-17,4.7142324694432177E-8,1.283720164889373E-4,null,5970,8.5934541813629179E-17,4.6780003467476825E-8,1.274309184097698E-4,null,5970,3.8501462687712952E-20,3.3842007751100008E-11,9.3147708822650158E-8]
[5980,9.2968677127343158E-17,4.7968965243182203E-8,1.2799569969412815E-4,null,5980,9.0697444169413694E-17,4.7600348539048195E-8,1.2705736040155138E-4,null,5980,4.0697722322084081E-20,3.4436681879621249E-11,9.2874650503120687E-8]
[5990,9.8098385922455573E-17,4.8807215321616829E-8,1.2762048605064605E-4,null,5990,9.5707289379089776E-17,4.843221564320581E-8,1.2668489745755462E-4,null,5990,4.3011368104992768E-20,3.5039727716129127E-11,9.260239263918569E-8]
[6000,1.0349281889522189E-16,4.9657192328452167E-8,1.2724637233454074E-4,null,6000,1.0097596733536849E-16,4.9275721305550041E-8,1.2631352637683084E-4,null,6000,4.5448235929420525E-20,3.5651230172341039E-11,9.2330932888310874E-8]
[6010,1.0916466027442233E-16,5.0519014271186977E-8,1.2687335531417321E-4,null,6010,1.0651589470073497E-16,5.0130982656050061E-8,1.2594324395338497E-4,null,6010,4.8014429061233878E-20,3.6271274602781641E-11,9.2060268909292051E-8]
[6020,1.1512715340690879E-16,5.1392799763652666E-8,1.2650143177704798E-4,null,6020,1.12340036138574E-16,5.0998117426612676E-8,1.2557404699482856E-4,null,6020,5.0716329304252588E-20,3.6899946803025088E-11,9.1790398370439567E-8]
[6030,1.213941231695138E-16,5.2278668023518056E-8,1.2613059851338454E-4,null,6030,1.184619263080807E-16,5.187724394860625E-8,1.2520593231823567E-4,null,6030,5.3560608582342755E-20,3.7537333007904627E-11,9.1521318939432348E-8]
[6040,1.279799991876934E-16,5.3176738869750427E-8,1.2576085233407532E-4,null,6040,1.2489569265189401E-16,5.2768481150341391E-8,1.2483889675684909E-4,null,6040,5.6554240955678107E-20,3.8183519889690024E-11,9.1253028308224753E-8]
[6050,1.3489983988208106E-16,5.4087132720031721E-8,1.2539219004927956E-4,null,6050,1.3165607899775221E-16,5.3671948554506938E-8,1.2447293714419402E-4,null,6050,5.9704515082339308E-20,3.8838594556232544E-11,9.0985524159087252E-8]
[6060,1.4216935737202728E-16,5.5009970588131627E-8,1.250246084810137E-4,null,6060,1.3875847000185894E-16,5.4587766275562989E-8,1.2410805032303662E-4,null,6060,6.3019047142301541E-20,3.9502644549078226E-11,9.0718804183848458E-8]
[6070,1.498049432605978E-16,5.5945374081236438E-8,1.2465810446003186E-4,null,6070,1.4621891645924845E-16,5.551605501709069E-8,1.2374423314988963E-4,null,6070,6.6505794237180389E-20,4.017575784154937E-11,9.0452866087200295E-8]
[6080,1.5782369533112214E-16,5.6893465397235005E-8,1.2429267483139467E-4,null,6080,1.5405416150972732E-16,5.6456936069098446E-8,1.2338148249617839E-4,null,6080,7.0173068282872364E-20,4.0858022836794277E-11,9.0187707576312121E-8]
[6090,1.6624344517836213E-16,5.7854367321961509E-8,1.2392831643974608E-4,null,6090,1.6228166776275149E-16,5.7410531305286122E-8,1.2301979522529984E-4,null,6090,7.4029550408109801E-20,4.1549528365805808E-11,8.9923326364182102E-8]
[6100,1.7508278680985924E-16,5.8828203226396876E-8,1.2356502615229408E-4,null,6100,1.7091964537602856E-16,5.8376963180267734E-8,1.2265916822476813E-4,null,6100,7.8084305879083328E-20,4.2250363685409732E-11,8.9659720175190845E-8]
[6110,1.8436110623928088E-16,5.9815097063825856E-8,1.2320280082962203E-4,null,6110,1.7998708110925809E-16,5.9356354726750238E-8,1.2229959838495633E-4,null,6110,8.2346799562327582E-20,4.2960618476220714E-11,8.9396886736139949E-8]
[6120,1.9409861211080856E-16,6.0815173366954377E-8,1.2284163735922093E-4,null,6120,1.8950376839148718E-16,6.0348829552672701E-8,1.2194108261025657E-4,null,6120,8.6826911948284871E-20,4.3680382840569337E-11,8.9134823780621888E-8]
[6130,2.0431636737539037E-16,6.182855724498305E-8,1.2248153261895406E-4,null,6130,1.9949033842287092E-16,6.1354511838302495E-8,1.2158361780705346E-4,null,6130,9.1534955747150065E-20,4.4409747300397187E-11,8.8873529051423586E-8]
[6140,2.1503632206018656E-16,6.285537438064215E-8,1.2212248351244447E-4,null,6140,2.0996829235093852E-16,6.2373526333292444E-8,1.2122720089991291E-4,null,6140,9.6481693080608357E-20,4.5148802795123887E-11,8.8613000296112925E-8]
[6150,2.2628134715940689E-16,6.3895751027182719E-8,1.2176448694093814E-4,null,6150,2.2096003454984391E-16,6.3405998353695043E-8,1.208718288065207E-4,null,6150,1.0167835328556986E-19,4.5897640679481994E-11,8.8353235267901158E-8]
[6160,2.3807526967752631E-16,6.4949814005330044E-8,1.2140753982223308E-4,null,6160,2.3248890703248475E-16,6.4452053778939023E-8,1.2051749847600702E-4,null,6160,1.0713665134733248E-19,4.6656352721324582E-11,8.8094231730970798E-8]
[6170,2.5044290886407866E-16,6.6017690700193899E-8,1.2105163907412262E-4,null,6170,2.4457922503441027E-16,6.551181904876316E-8,1.2016420684415404E-4,null,6170,1.1286880698506716E-19,4.7425031099401253E-11,8.7835987449385626E-8]
[6180,2.634101136740572E-16,6.7099509058141643E-8,1.2069678163618457E-4,null,6180,2.5725631380326037E-16,6.6585421160112761E-8,1.1981195087278789E-4,null,6180,1.188875644083958E-19,4.8203768401106919E-11,8.7578500200435252E-8]
[6190,2.7700380148456554E-16,6.8195397583629451E-8,1.2034296444847027E-4,null,6190,2.7054654662314325E-16,6.7672987663995525E-8,1.1946072752465219E-4,null,6190,1.2520621276309617E-19,4.8992657620200409E-11,8.7321767765117418E-8]
[6200,2.9125199811491696E-16,6.9305485335997267E-8,1.1999018445340761E-4,null,6200,2.8447738412139228E-16,6.8774646662300241E-8,1.1911053376821805E-4,null,6200,1.3183860729297945E-19,4.9791792154496075E-11,8.7065787925817932E-8]
[6210,3.0618387917639398E-16,7.0429901926221211E-8,1.1963843862243696E-4,null,6210,2.9907741488288117E-16,6.9890526804573927E-8,1.1876136659350975E-4,null,6210,1.3879919123273746E-19,5.0601265803524803E-11,8.681055848334832E-8]
[6220,3.2182981279829817E-16,7.156877751363061E-8,1.1928772391600398E-4,null,6220,3.143763974181048E-16,7.1020757284763943E-8,1.1841322298633573E-4,null,6220,1.4610301845870049E-19,5.1421172766169095E-11,8.6556077232188234E-8]
[6230,3.3822140376695873E-16,7.2722242802585448E-8,1.1893803731555228E-4,null,6230,3.3040530352078624E-16,7.2165467837920525E-8,1.1806609994585257E-4,null,6230,1.5376577691843988E-19,5.2251607638269024E-11,8.630234198167309E-8]
[6240,3.5539153912069906E-16,7.3890429039117255E-8,1.185893758029925E-4,null,6240,3.4719636305808247E-16,7.332478873686259E-8,1.1771999447830369E-4,null,6240,1.6180381286456883E-19,5.3092665410201814E-11,8.604935054330614E-8]
[6250,3.7337443523506855E-16,7.5073468007529743E-8,1.1824173637918543E-4,null,6250,3.6478311022634472E-16,7.4498850788804762E-8,1.1737490360642592E-4,null,6250,1.7023415591154899E-19,5.3944441464431956E-11,8.5797100741383695E-8]
[6260,3.9220568645209256E-16,7.6271492026967405E-8,1.1789511604357148E-4,null,6260,3.8320043132617548E-16,7.5687785331951137E-8,1.1703082435352718E-4,null,6260,1.7907454494749576E-19,5.4807031573037578E-11,8.554559039700855E-8]
[6270,4.1192231528711911E-16,7.7484633947941929E-8,1.1754951181181034E-4,null,6270,4.0248461408902672E-16,7.6891724232048702E-8,1.1668775375209592E-4,null,6270,1.8834345491978814E-19,5.5680531895206884E-11,8.5294817344796178E-8]
[6280,4.3256282426248468E-16,7.8713027148827425E-8,1.1720492069955303E-4,null,6280,4.2267339860474044E-16,7.8110799878908282E-8,1.1634568884502533E-4,null,6280,1.9806012452329117E-19,5.6565038974710779E-11,8.5044779419478877E-8]
[6290,4.541672494134721E-16,7.9956805532314613E-8,1.1686133974265394E-4,null,6290,4.4380602989419318E-16,7.9345145182885977E-8,1.1600462668794206E-4,null,6290,2.0824458481747121E-19,5.7460649737346124E-11,8.4795474472304643E-8]
[6300,4.7677721551217291E-16,8.1216103521834732E-8,1.1651876597754625E-4,null,6300,4.6592331217196253E-16,8.0594893571333606E-8,1.1566456434023446E-4,null,6300,2.1891768879876649E-19,5.836746148835698E-11,8.4546900349032834E-8]
[6310,5.0043599305556588E-16,8.2491056057944398E-8,1.1617719645275917E-4,null,6310,4.8906766484549933E-16,8.1860178985011071E-8,1.1532549886668651E-4,null,6310,2.3010114195534403E-19,5.9285571909826856E-11,8.4299054911998088E-8]
[6320,5.2518855707135677E-16,8.378179859467851E-8,1.1583662822258328E-4,null,6320,5.1328318030217401E-16,8.3141135874466376E-8,1.1498742735085395E-4,null,6320,2.4181753383504326E-19,6.0215079058047874E-11,8.4051936020374236E-8]
[6330,5.5108164778465718E-16,8.5088467095865072E-8,1.154970583533427E-4,null,6330,5.3861568352812671E-16,8.4437899196378735E-8,1.1465034687589939E-4,null,6330,2.5409037065219976E-19,6.1156081360862458E-11,8.3805541547829165E-8]
[6340,5.7816383320247877E-16,8.6411198031411432E-8,1.1515848391737183E-4,null,6340,5.651127936139644E-16,8.5750604409872127E-8,1.1431425453554118E-4,null,6340,2.6694410896575723E-19,6.2108677614983309E-11,8.3559869369314058E-8]
[6350,6.0648557366675755E-16,8.7750128373551128E-8,1.1482090199743418E-4,null,6350,5.9282398719753506E-16,8.7079387472790428E-8,1.1397914743585676E-4,null,6350,2.8040419045920503E-19,6.3072966983285286E-11,8.3314917367893255E-8]
[6360,6.3609928842456919E-16,8.91053955930623E-8,1.1448430968119267E-4,null,6360,6.2180066389269946E-16,8.8424384837944722E-8,1.1364502268784746E-4,null,6360,2.9449707784987292E-19,6.4049048992076516E-11,8.3070683432036492E-8]
[6370,6.6705942427764583E-16,9.0477137655450298E-8,1.1414870407389513E-4,null,6370,6.5209621376337728E-16,8.9785733449324117E-8,1.1331187741071803E-4,null,6370,3.09250291964502E-19,6.5037023528342704E-11,8.2827165457289987E-8]
[6380,6.994225263607801E-16,9.1865493017099263E-8,1.1381408227825346E-4,null,6380,6.8376608689404328E-16,9.1163570738276071E-8,1.1297970873569705E-4,null,6380,3.2469245001031993E-19,6.6036990836969539E-11,8.2584361343537352E-8]
[6390,7.3324731110860243E-16,9.3270600621390947E-8,1.1348044141227692E-4,null,6390,7.1686786511324319E-16,9.2558034619654647E-8,1.126485137998142E-4,null,6390,3.4085330507568371E-19,6.7049051517940425E-11,8.2342269000476066E-8]
[6400,7.6859474147165233E-16,9.4692599894791683E-8,1.1314777859862258E-4,null,6400,7.5146133593144036E-16,9.3969263487936903E-8,1.1231828974192698E-4,null,6400,3.5776378689702371E-19,6.8073306523511714E-11,8.2100886339640358E-8]
[6410,8.0552810443345148E-16,9.6131630742911301E-8,1.1281609097066594E-4,null,6410,7.8760856874418901E-16,9.5397396213310714E-8,1.1198903372454879E-4,null,6410,3.754560439219358E-19,6.9109857155366539E-11,8.1860211280289096E-8]
[6420,8.4411309089523334E-16,9.7587833546524613E-8,1.1248537566989095E-4,null,6420,8.2537399336529375E-16,9.6842572137726682E-8,1.1166074290573048E-4,null,6420,3.9396348670763851E-19,7.0158805061742242E-11,8.1620241750815536E-8]
[6430,8.8441787799493534E-16,9.906134915756962E-8,1.1215562984564569E-4,null,6430,8.6482448095672469E-16,9.8304931070926218E-8,1.1133341445459396E-4,null,6430,4.1332083269437955E-19,7.1220252234539622E-11,8.1380975679915988E-8]
[6440,9.2651321391006378E-16,1.0055231889511023E-7,1.1182685065754469E-4,null,6440,9.0602942740369345E-16,9.978461328643404E-8,1.110070455536924E-4,null,6440,4.3356415238295624E-19,7.2294301006407494E-11,8.1142411006687333E-8]
[6450,9.7047250521999449E-16,1.02060884541273E-7,1.1149903527010388E-4,null,6450,9.4906083920941458E-16,1.0128175951752582E-7,1.1068163338629974E-4,null,6450,4.5473091696062264E-19,7.3381054047807211E-11,8.0904545676089813E-8]
[6460,1.0163719068944667E-15,1.0358718833715284E-7,1.1117218086113766E-4,null,6460,9.9399342197583129E-16,1.0279651095316403E-7,1.1035717515248212E-4,null,6460,4.7686004741527792E-19,7.4480614364055064E-11,8.0667377636787916E-8]
[6470,1.0642904149676278E-15,1.0513137297868867E-7,1.1084628460816393E-4,null,6470,1.0409046715276962E-15,1.0432900923390497E-7,1.1003366805485957E-4,null,6470,4.9999196517323066E-19,7.559308529234239E-11,8.0430904844261015E-8]
[6480,1.1143099619734274E-15,1.0669358161251524E-7,1.1052134370679886E-4,null,6480,1.0898749677559341E-15,1.0587939644778078E-7,1.0971110930338429E-4,null,6480,5.241686443047401E-19,7.6718570498738478E-11,8.0195125262419345E-8]
[6490,1.1665155152101566E-15,1.0827395783178074E-7,1.1019735535624107E-4,null,6490,1.1409876712470629E-15,1.0744781512614931E-7,1.0938949611645826E-4,null,6490,5.4943366533837503E-19,7.7857173975168064E-11,7.9960036856914203E-8]
[6500,1.2209951779067264E-15,1.0987264567194102E-7,1.09874316760678E-4,null,6500,1.194329222768955E-15,1.0903440823951891E-7,1.0906882572426737E-4,null,6500,5.7583227072641982E-19,7.9009000036372384E-11,7.972563760306557E-8]
[6510,1.2778402933605974E-15,1.1148978960652646E-7,1.0955222513834687E-4,null,6510,1.2499892456839437E-15,1.1063931919334695E-7,1.0874909536331174E-4,null,6510,6.0341142200417567E-19,8.0174153316849252E-11,7.9491925476828238E-8]
[6520,1.3371455521303793E-15,1.1312553454287778E-7,1.0923107771392732E-4,null,6520,1.3080606513693259E-15,1.1226269182380812E-7,1.0843030227910725E-4,null,6520,6.3221985869135891E-19,8.1352738767771234E-11,7.9258898471499999E-8]
[6530,1.3990091023456335E-15,1.1478002581786301E-7,1.089108717189181E-4,null,6530,1.3686397477072512E-15,1.1390467039354241E-7,1.0811244371989435E-4,null,6530,6.6230815897311448E-19,8.2544861653889649E-11,7.9026554572574043E-8]
[6540,1.4635326632283044E-15,1.1645340919356004E-7,1.085916043927187E-4,null,6540,1.4318263507389178E-15,1.1556539958737032E-7,1.0779551695024708E-4,null,6540,6.9372880221779505E-19,8.375062755041309E-11,7.8794891779425755E-8]
[6550,1.5308216418921046E-15,1.1814583085291917E-7,1.0827327298376733E-4,null,6550,1.497723899545746E-15,1.1724502450798817E-7,1.0747951923731552E-4,null,6550,7.2653623337007937E-19,8.4970142339872083E-11,7.8563908094770928E-8]
[6560,1.6009852535038922E-15,1.1985743739540012E-7,1.0795587475048012E-4,null,6560,1.5664395744422905E-15,1.1894369067163655E-7,1.0716444785639729E-4,null,6560,7.6078692927027876E-19,8.6203512208964287E-11,7.8333601527993488E-8]
[6570,1.6741366448992757E-15,1.2158837583257936E-7,1.0763940695514342E-4,null,6570,1.6380844185715149E-15,1.2066154400374128E-7,1.0685030009344184E-4,null,6570,7.965394669549446E-19,8.7450843645377967E-11,7.8103970096179261E-8]
[6580,1.7503930217141193E-15,1.2333879358374057E-7,1.0732386686975369E-4,null,6580,1.7127734629627164E-15,1.223987308345361E-7,1.0653707323763238E-4,null,6580,8.3385459397536781E-19,8.8712243434603995E-11,7.7875011817248385E-8]
[6590,1.8298757791470513E-15,1.2510883847143411E-7,1.0700925177743291E-4,null,6590,1.7906258551666102E-15,1.2415539789465581E-7,1.0622476459365241E-4,null,6590,8.7279530080399362E-19,8.9987818656723631E-11,7.7646724719948662E-8]
[6600,1.9127106364181078E-15,1.26898658717018E-7,1.0669555896490196E-4,null,6600,1.8717649915302767E-15,1.2593169231070941E-7,1.0591337147404497E-4,null,6600,9.1342689536620579E-19,9.1277676683184077E-11,7.7419106836872814E-8]
[6610,1.9990277750177171E-15,1.2870840293617207E-7,1.0638278572940843E-4,null,6610,1.9563186532072363E-15,1.2772776160082874E-7,1.0560289118540987E-4,null,6610,9.5581707975615762E-19,9.2581925173554032E-11,7.7192156205301825E-8]
[6620,2.0889619808443848E-15,1.3053822013439197E-7,1.060709293736504E-4,null,6620,2.044419145996891E-15,1.2954375367019533E-7,1.0529332105574178E-4,null,6620,1.0000360291938058E-18,9.3900672072263746E-11,7.696587086668216E-8]
[6630,2.1826527903176466E-15,1.3238825970245988E-7,1.0575998721173696E-4,null,6630,2.1362034441015151E-15,1.3137981680654488E-7,1.0498465841796514E-4,null,6630,1.0461564732771553E-18,9.523402560532906E-11,7.6740248874316352E-8]
[6640,2.2802446405592761E-15,1.3425867141189217E-7,1.0544995656087418E-4,null,6640,2.2318133378899581E-15,1.3323609967564886E-7,1.0467690060879038E-4,null,6640,1.0942537795840229E-18,9.6582094277057397E-11,7.6515288284636177E-8]
[6650,2.3818870237431843E-15,1.3614960541036855E-7,1.0514083475132161E-4,null,6650,2.331395585769815E-15,1.3511275131677716E-7,1.0437004497742321E-4,null,6650,1.1444060396854679E-18,9.7944986866741452E-11,7.6290987154229014E-8]
[6660,2.4877346457086971E-15,1.3806121221713423E-7,1.0483261911941019E-4,null,6660,2.4351020702585157E-15,1.370099211381352E-7,1.0406408887985364E-4,null,6660,1.1966941576274932E-18,9.9322812425331896E-11,7.6067343554218715E-8]
[6670,2.5979475889433598E-15,1.3999364271838987E-7,1.0452530700819889E-4,null,6670,2.5430899583606832E-15,1.3892775891228755E-7,1.0375902968104723E-4,null,6670,1.2512019409444158E-18,1.0071568027210192E-10,7.5844355555558142E-8]
[6680,2.7126914800240445E-15,1.4194704816265421E-7,1.0421889576562065E-4,null,6680,2.6555218663390775E-15,1.4086641477155446E-7,1.0345486474716822E-4,null,6680,1.3080161942595457E-18,1.0212369999129082E-10,7.5622021233390304E-8]
[6690,2.8321376616362529E-15,1.4392158015610788E-7,1.0391338275815914E-4,null,6690,2.7725660289941147E-15,1.4282603920339158E-7,1.0315159146048848E-4,null,6690,1.3672268155438564E-18,1.0354698142873516E-10,7.5400338678951761E-8]
[6700,2.9564633692607578E-15,1.4591739065792136E-7,1.0360876534513456E-4,null,6700,2.8943964735450341E-15,1.4480678304575131E-7,1.0284920720535642E-4,null,6700,1.4289268950879153E-18,1.0498563468848695E-10,7.5179305973650207E-8]
[6710,3.0858519126531119E-15,1.4793463197556108E-7,1.0330504090700832E-4,null,6710,3.0211931982334425E-15,1.4680879748242447E-7,1.0254770937832237E-4,null,6710,1.4932128172632969E-18,1.0643977012941606E-10,7.4958921217695509E-8]
[6720,3.2204928622058467E-15,1.4997345676007504E-7,1.0300220682111397E-4,null,6720,3.153142355737492E-15,1.4883223403836024E-7,1.0224709537492218E-4,null,6720,1.5601843651273186E-18,1.0790949836179827E-10,7.4739182507161616E-8]
[6730,3.3605822403183861E-15,1.5203401800136516E-7,1.0270026047878821E-4,null,6730,3.2904364415223459E-15,1.5087724457497414E-7,1.0194736260805036E-4,null,6730,1.629944827948303E-18,1.093949302438927E-10,7.4520087951856814E-8]
[6740,3.506322717888931E-15,1.5411646902343622E-7,1.0239919927832704E-4,null,6740,3.4332744872376555E-15,1.5294398128543153E-7,1.0164850849465429E-4,null,6740,1.7026011117196814E-18,1.1089617687850271E-10,7.4301635661460667E-8]
[6750,3.6579238160274434E-15,1.5622096347963103E-7,1.020990206299669E-4,null,6750,3.5818622592610659E-15,1.5503259668991884E-7,1.0135053046188305E-4,null,6750,1.7782638527246366E-18,1.1241334960952585E-10,7.4083823755449836E-8]
[6760,3.8156021131274915E-15,1.5834765534784872E-7,1.0179972193836696E-4,null,6760,3.7364124625239469E-15,1.5714324363089672E-7,1.0105342593389499E-4,null,6760,1.8570475342345508E-18,1.1394656001849232E-10,7.3866650356785468E-8]
[6770,3.9795814574043072E-15,1.604966989257438E-7,1.0150130062792338E-4,null,6770,3.897144949722657E-15,1.5927607526833422E-7,1.0075719235771438E-4,null,6770,1.939070606406811E-18,1.1549591992108861E-10,7.3650113590086906E-8]
[6780,4.1500931850240198E-15,1.6266824882590899E-7,1.0120375412590797E-4,null,6780,4.0642869360437192E-15,1.6143124507492875E-7,1.0046182717551612E-4,null,6780,2.0244556094600305E-18,1.1706154136366976E-10,7.3434211591151883E-8]
[6790,4.3273763439463623E-15,1.6486245997104604E-7,1.0090707986885479E-4,null,6790,4.2380732195179366E-15,1.6360890683131085E-7,1.0016732784429362E-4,null,6790,2.1133293001979697E-18,1.186435366197616E-10,7.3218942499978988E-8]
[6800,4.5116779236113614E-15,1.67079487589116E-7,1.0061127529748118E-4,null,6800,4.4187464071371845E-15,1.6580921462123142E-7,9.9873691822492967E-5,null,6800,2.2058227819666884E-18,1.2024201818654937E-10,7.3004304459482817E-8]
[6810,4.7032530905872583E-15,1.6931948720847911E-7,1.0031633786502837E-4,null,6810,4.6065571468456042E-15,1.6803232282673715E-7,9.9580916583587951E-5,null,6810,2.3020716381136597E-18,1.2185709878135783E-10,7.2790295622332355E-8]
[6820,4.9023654303246187E-15,1.7158261465301527E-7,1.0002226502901533E-4,null,6820,4.8017643655518849E-15,1.7027838612332785E-7,9.9288999601078223E-5,null,6820,2.4022160690381483E-18,1.2348889133811699E-10,7.2576914140785566E-8]
[6830,5.1092871951342739E-15,1.7386902603723495E-7,9.9729054255914601E-5,null,6830,5.004635513275883E-15,1.7254755947510169E-7,9.8997938363667043E-5,null,6830,2.5064010329067232E-18,1.2513750900382095E-10,7.2364158180710287E-8]
[6840,5.3242995585438995E-15,1.7617887776137212E-7,9.9436703011282314E-5,null,6840,5.2154468135840796E-15,1.7483999812988646E-7,9.8707730352503372E-5,null,6840,2.6147763901282105E-18,1.2680306513497406E-10,7.2152025899406921E-8]
[6850,5.5476928761354433E-15,1.785123265064668E-7,9.9145208783729644E-5,null,6850,5.4344835204140495E-15,1.7715585761435706E-7,9.8418373076182285E-5,null,6850,2.7274970516502821E-18,1.2848567329402783E-10,7.1940515476944979E-8]
[6860,5.7797669530466402E-15,1.808695292294334E-7,9.8854569059636082E-5,null,6860,5.6620401814699444E-15,1.7949529372914053E-7,9.8129864039318916E-5,null,6860,2.8447231311919515E-18,1.3018544724580911E-10,7.1729625089200561E-8]
[6870,6.0208313182378104E-15,1.8325064315811387E-7,9.8564781334481571E-5,null,6870,5.8984209082865601E-15,1.8185846254390648E-7,9.7842200752814955E-5,null,6870,2.9666201014740586E-18,1.3190250095393632E-10,7.1519352916627199E-8]
[6880,6.2712055057023067E-15,1.8565582578632504E-7,9.8275843102081845E-5,null,6880,6.1439396531412602E-15,1.8424552039244969E-7,9.7555380733400885E-5,null,6880,3.0933589545570201E-18,1.3363694857723107E-10,7.1309697145309052E-8]
[6890,6.5312193427385856E-15,1.8808523486888447E-7,9.7987751887345105E-5,null,6890,6.3989204929284238E-15,1.8665662386775398E-7,9.7269401521430003E-5,null,6890,3.2251163663602187E-18,1.3538890446611371E-10,7.1100655974403318E-8]
[6900,6.8012132454453673E-15,1.9053902841663487E-7,9.7700505196592869E-5,null,6900,6.6636979201540481E-15,1.8909192981705221E-7,9.6984260642160976E-5,null,6900,3.3620748654614404E-18,1.3715848315899942E-10,7.089222759710681E-8]
[6910,7.0815385215879239E-15,1.9301736469145042E-7,9.7414100553821616E-5,null,6910,6.9386171412024351E-15,1.915515953368702E-7,9.6699955639748938E-5,null,6910,3.5044230062689381E-18,1.3894579937867841E-10,7.0684410214546158E-8]
[6920,7.3725576810090395E-15,1.9552040220123409E-7,9.7128535495945162E-5,null,6920,7.2240343820391888E-15,1.9403577776806088E-7,9.6416484063751993E-5,null,6920,3.6523555466746334E-18,1.4075096802869189E-10,7.0477202043907244E-8]
[6930,7.6746447536879377E-15,1.9804829969490737E-7,9.684380755840343E-5,null,6930,7.5203172014575882E-15,1.9654463469083071E-7,9.6133843471118291E-5,null,6930,3.8060736302496714E-18,1.4257410418970053E-10,7.0270601292104834E-8]
[6940,7.9881856156804716E-15,2.0060121615738433E-7,9.6559914286874137E-5,null,6940,7.8278448120976992E-15,1.9907832391975023E-7,9.5852031428489968E-5,null,6940,3.9657849731299297E-18,1.4441532311584204E-10,7.0064606180520971E-8]
[6950,8.3135783230221553E-15,2.0317931080454367E-7,9.6276853236816064E-5,null,6950,8.1470084093166391E-15,2.0163700349876487E-7,9.5571045504281939E-5,null,6950,4.1317040556420887E-18,1.4627474023108787E-10,6.985921493678338E-8]
[6960,8.6512334538192118E-15,2.0578274307818205E-7,9.5994621967238078E-5,null,6960,8.4782115081355611E-15,2.042208316961834E-7,9.5290883280747037E-5,null,6960,4.3040523188079532E-18,1.4815247112558461E-10,6.9654425786678133E-8]
[6970,9.0015744586733032E-15,2.0841167264096754E-7,9.5713218048299167E-5,null,6970,8.8218702884051361E-15,2.0682996699966965E-7,9.5011542338972033E-5,null,6970,4.4830583658198813E-18,1.5004863155199694E-10,6.9450236970302538E-8]
[6980,9.3650380195853408E-15,2.1106625937138197E-7,9.5432639046384525E-5,null,6980,9.1784139483326605E-15,2.0946456811122294E-7,9.4733020267769589E-5,null,6980,4.6689581685794183E-18,1.5196333742184065E-10,6.924664671773817E-8]
[6990,9.7420744175418528E-15,2.1374666335864877E-7,9.5152882554672911E-5,null,6990,9.5482850665756074E-15,2.1212479394214111E-7,9.4455314677586874E-5,null,6990,4.8619952794197058E-18,1.5389670480180673E-10,6.904365328549103E-8]
[7000,1.0133147908963407E-14,2.1645304489766504E-7,9.4873946154376822E-5,null,7000,9.9319399730725716E-15,2.1481080360799194E-7,9.4178423166930593E-5,null,7000,5.06242104813317E-18,1.5584884991008736E-10,6.8841254917138723E-8]
[7010,1.0538737111130378E-14,2.1918556448391391E-7,9.4595827444006133E-5,null,7010,1.0329849128731418E-14,2.1752275642356184E-7,9.3902343351136568E-5,null,7010,5.2704948443678167E-18,1.5781988911268693E-10,6.8639449871484271E-8]
[7020,1.0959335396846492E-14,2.2194438280837818E-7,9.431852402607839E-5,null,7020,1.0742497514230169E-14,2.2026081189780661E-7,9.3627072850122029E-5,null,7020,5.4864842855610327E-18,1.5980993891973526E-10,6.8438236408095567E-8]
[7030,1.1395451298479359E-14,2.2472966075244606E-7,9.404203351085058E-5,null,7030,1.1170385028064716E-14,2.2302512972879656E-7,9.3352609293412216E-5,null,7030,5.7106654704942308E-18,1.6181911598179362E-10,6.8237612793449353E-8]
[7040,1.1847608921532567E-14,2.2754155938280741E-7,9.3766353515649056E-5,null,7040,1.1614026894001391E-14,2.2581586979864785E-7,9.307895031484661E-5,null,7040,5.9433232185683576E-18,1.6384753708615477E-10,6.8037577297251434E-8]
[7050,1.2316348368028275E-14,2.3038023994634652E-7,9.3491481661832018E-5,null,7050,1.2073954078206524E-14,2.2863319216845446E-7,9.2806093553794627E-5,null,7050,6.1847513149714107E-18,1.6589531915313898E-10,6.7838128196476058E-8]
[7060,1.2802226169776859E-14,2.3324586386502941E-7,9.3217415583384856E-5,null,7060,1.2550713716130487E-14,2.3147725707321248E-7,9.2534036658238421E-5,null,7060,6.4352527617920718E-18,1.6796257923238758E-10,6.763926376996207E-8]
[7070,1.3305815731815442E-14,2.3613859273078548E-7,9.2944152917658621E-5,null,7070,1.3044869549421203E-14,2.3434822491673925E-7,9.2262777287378605E-5,null,7070,6.6951400352480883E-18,1.7004943449915045E-10,6.7440982308001048E-8]
[7080,1.3827707786173863E-14,2.3905858830038508E-7,9.2671691308717215E-5,null,7080,1.3557002373030631E-14,2.3724625626658923E-7,9.1992313098890221E-5,null,7080,6.9647353491388029E-18,1.7215600225057217E-10,6.724328209749993E-8]
[7090,1.4368510856163188E-14,2.4200601249031034E-7,9.240002840902235E-5,null,7090,1.4087710492698062E-14,2.4017151184896211E-7,9.1722641769082349E-5,null,7090,7.2443709246340611E-18,1.7428239990197161E-10,6.7046161436850379E-8]
[7100,1.492885173138931E-14,2.44981027371627E-7,9.2129161877300205E-5,null,7100,1.4637610193018318E-14,2.4312415254361177E-7,9.1453760961047979E-5,null,7100,7.5343892665392516E-18,1.7642874498312324E-10,6.6849618628260401E-8]
[7110,1.5509375953720169E-14,2.4798379516484355E-7,9.1859089379580264E-5,null,7110,1.520733621631569E-14,2.4610433937874457E-7,9.1185668373279941E-5,null,7110,7.8351434461685697E-18,1.7859515513452822E-10,6.6653651974393139E-8]
[7120,1.6110748314388234E-14,2.5101447823477955E-7,9.1589808584837087E-5,null,7120,1.5797542252507614E-14,2.4911223352592343E-7,9.0918361680273824E-5,null,7120,8.1469973909485328E-18,1.8078174810369226E-10,6.6458259787678753E-8]
[7130,1.6733653362431188E-14,2.540732390854184E-7,9.1321317176237032E-5,null,7130,1.6408901440149614E-14,2.5214799629496046E-7,9.0651838590838422E-5,null,7130,8.4703261808807056E-18,1.8298864174139241E-10,6.6263440385665851E-8]
[7140,1.7378795924721642E-14,2.5716024035476686E-7,9.1053612836835759E-5,null,7140,1.7042106878923434E-14,2.5521178912881301E-7,9.0386096796778111E-5,null,7140,8.805516352014856E-18,1.8521595399794863E-10,6.6069192085591094E-8]
[7150,1.8046901637746668E-14,2.6027564480970651E-7,9.0786693264895545E-5,null,7150,1.7697872153713622E-14,2.5830377359847251E-7,9.0121134016712631E-5,null,7150,9.1529662070428572E-18,1.8746380291948746E-10,6.5875513220199166E-8]
[7160,1.8738717491434304E-14,2.63419615340846E-7,9.0520556148277707E-5,null,7160,1.8376931870573002E-14,2.6142411139785588E-7,8.9856947959703968E-5,null,7160,9.5130861331958248E-18,1.8973230664420986E-10,6.5682402110108401E-8]
[7170,1.945501238513683E-14,2.665923149573685E-7,9.0255199206147626E-5,null,7170,1.9080042204688732E-14,2.6457296433868988E-7,8.9593536352690242E-5,null,7170,9.886298927517377E-18,1.9202158339865178E-10,6.5489857100935156E-8]
[7180,2.0196577696138803E-14,2.6979390678188697E-7,8.9990620143817385E-5,null,7180,1.9807981460702733E-14,2.6775049434540372E-7,8.9330896927178769E-5,null,7180,1.0273040129743161E-17,1.9433175149395188E-10,6.5297876526279894E-8]
[7190,2.0964227860757656E-14,2.7302455404528386E-7,8.9726816684644839E-5,null,7190,2.0561550645461137E-14,2.7095686345000842E-7,8.9069027416221403E-5,null,7190,1.06737583628331E-17,1.9666292932210847E-10,6.510645873374169E-8]
[7200,2.1758800968419779E-14,2.7628442008156485E-7,8.9463786552361512E-5,null,7200,2.1341574053573773E-14,2.7419223378698524E-7,8.8807925563257851E-5,null,7200,1.1088915681398222E-17,1.9901523535224421E-10,6.4915602075908217E-8]
[7210,2.2581159368828019E-14,2.79573668322701E-7,8.9201527481094436E-5,null,7210,2.214889986588503E-14,2.7745676758816911E-7,8.8547589120458069E-5,null,7210,1.1518987928095982E-17,2.0138878812686509E-10,6.4725304904920459E-8]
[7220,2.3432190292532088E-14,2.8289246229347738E-7,8.8940037211035562E-5,null,7220,2.2984400761182121E-14,2.8075062717763268E-7,8.8288015840719787E-5,null,7220,1.1964465098190246E-17,2.0378370625812109E-10,6.4535565581128209E-8]
[7230,2.4312806485112045E-14,2.8624096560634065E-7,8.8679313488306897E-5,null,7230,2.3848974541332846E-14,2.8407397496657189E-7,8.8029203488143267E-5,null,7230,1.2425851712414568E-17,2.0620010842406924E-10,6.4346382470263278E-8]
[7240,2.5223946855211606E-14,2.8961934195624923E-7,8.8419354063697654E-5,null,7240,2.4743544770095416E-14,2.8742697344819484E-7,8.7771149834767258E-5,null,7240,1.2903667198285319E-17,2.0863811336493488E-10,6.4157753941889588E-8]
[7250,2.6166577136688531E-14,2.9302775511551802E-7,8.8160156700485781E-5,null,7250,2.5669061425863358E-14,2.9080978519260408E-7,8.7513852652265349E-5,null,7250,1.3398446280037231E-17,2.11097839879371E-10,6.3969678367676825E-8]
[7260,2.7141690565124917E-14,2.9646636892867222E-7,8.7901719159674775E-5,null,7260,2.6626501568581719E-14,2.9422257284168717E-7,8.7257309721581127E-5,null,7260,1.3910739377335441E-17,2.1357940682072489E-10,6.3782154127515567E-8]
[7270,2.8150308568942391E-14,2.9993534730729893E-7,8.7644039219016492E-5,null,7270,2.7616870021081817E-14,2.9766549910400693E-7,8.7001518838392432E-5,null,7270,1.4441113012923681E-17,2.1608293309329886E-10,6.3595179609054351E-8]
[7280,2.9193481475375884E-14,3.034348542249009E-7,8.7387114653226443E-5,null,7280,2.8641200065083742E-14,3.0113872674969218E-7,8.6746477791656377E-5,null,7280,1.4990150229364512E-17,2.18608537648618E-10,6.340875319509559E-8]
[7290,3.0272289231592066E-14,3.0696505371175501E-7,8.713094325443913E-5,null,7290,2.9700554152146281E-14,3.0464241860533505E-7,8.6492184393403417E-5,null,7290,1.5558451015062686E-17,2.2115633948169684E-10,6.3222873284933902E-8]
[7300,3.1387842141194102E-14,3.1052610984976789E-7,8.6875522806334368E-5,null,7300,3.0796024629806814E-14,3.0817673754888261E-7,8.6238636435073828E-5,null,7300,1.6146632739719579E-17,2.2372645762730617E-10,6.3037538271158556E-8]
[7310,3.2541281616354963E-14,3.1411818676734106E-7,8.6620851115377307E-5,null,7310,3.1928734483150051E-14,3.1174184650454125E-7,8.5985831749113144E-5,null,7310,1.6755330599380031E-17,2.2631901115624483E-10,6.2852746559127301E-8]
[7320,3.3733780945918151E-14,3.17741448634239E-7,8.6366925981310407E-5,null,7320,3.3099838092140175E-14,3.1533790843768072E-7,8.5733768144129535E-5,null,7320,1.7385198071281228E-17,2.2893411917161559E-10,6.2668496556310621E-8]
[7330,3.4966546079659362E-14,3.2139605965645276E-7,8.6113745217465123E-5,null,7330,3.4310522004905877E-14,3.1896508634973685E-7,8.5482443455384439E-5,null,7330,1.8036907378639924E-17,2.3157190080509612E-10,6.2484786674239997E-8]
[7340,3.6240816429049554E-14,3.2508218407107716E-7,8.5861306641848344E-5,null,7340,3.5562005727321122E-14,3.2262354327312461E-7,8.523185551199764E-5,null,7340,1.8711149965583212E-17,2.3423247521322042E-10,6.2301615329803055E-8]
[7350,3.7557865684740933E-14,3.2879998614118703E-7,8.5609608078990372E-5,null,7350,3.6855542529089345E-14,3.2631344226615364E-7,8.4982002155732997E-5,null,7350,1.9408636982374193E-17,2.3691596157365863E-10,6.2118980943721264E-8]
[7360,3.8919002651128129E-14,3.3254963015071996E-7,8.5358647358534283E-5,null,7360,3.8192420266693165E-14,3.3003494640794673E-7,8.4732881236328743E-5,null,7360,2.0130099781158895E-17,2.3962247908150163E-10,6.1936881940912996E-8]
[7370,4.0325572098194647E-14,3.363312803993595E-7,8.5108422319086385E-5,null,7370,3.9573962223407133E-14,3.3378821879336189E-7,8.4484490600907934E-5,null,7370,2.0876290422364895E-17,2.4235214694554735E-10,6.1755316753446296E-8]
[7380,4.1778955630997499E-14,3.4014510119743348E-7,8.4858930801679744E-5,null,7380,4.1001527966726521E-14,3.3757342252792609E-7,8.4236828111546334E-5,null,7380,2.1647982191985797E-17,2.4510508438459584E-10,6.1574283817991589E-8]
[7390,4.3280572577040952E-14,3.4399125686080655E-7,8.4610170656569583E-5,null,7390,4.2476514223459507E-14,3.4139072072276763E-7,8.3989891634112353E-5,null,7390,2.2445970129905187E-17,2.4788141062374076E-10,6.1393781568352675E-8]
[7400,4.4831880891863848E-14,3.4786991170578221E-7,8.4362139745574802E-5,null,7400,4.4000355772802917E-14,3.4524027648955347E-7,8.3743679043260817E-5,null,7400,2.327107156948126E-17,2.5068124489066866E-10,6.1213808458171185E-8]
[7410,4.6434378083117886E-14,3.5178123004401745E-7,8.4114835919573227E-5,null,7410,4.5574526357683394E-14,3.4912225293544176E-7,8.3498188204047391E-5,null,7410,2.4124126688557517E-17,2.5350470641196455E-10,6.1034362927357788E-8]
[7420,4.8089602153454167E-14,3.5572537617743432E-7,8.3868257058332008E-5,null,7420,4.7200539614656304E-14,3.530368131580298E-7,8.3253417018858976E-5,null,7420,2.5005999072118899E-17,2.563519144094191E-10,6.085544343578837E-8]
[7430,4.9799132562552146E-14,3.5970251439314027E-7,8.3622401028858145E-5,null,7430,4.8879950022725882E-14,3.5698412024031296E-7,8.3009363365078062E-5,null,7430,2.5917576286796968E-17,2.5922298809633852E-10,6.0677048435318948E-8]
[7440,5.156459120849666E-14,3.6371280895836012E-7,8.337726571616573E-5,null,7440,5.0614353871261229E-14,3.6096433724565288E-7,8.2766025144437124E-5,null,7440,2.6859770467366916E-17,2.6211804667386433E-10,6.0499176392488963E-8]
[7450,5.3387643428991429E-14,3.6775642411537081E-7,8.3132849006568949E-5,null,7450,5.2405390247497155E-14,3.6497762721274889E-7,8.2523400260960358E-5,null,7450,2.7833518915547085E-17,2.6503720932729524E-10,6.0321825774623571E-8]
[7460,5.5269999022537921E-14,3.7183352407644757E-7,8.2889148791378414E-5,null,7460,5.425474204376796E-14,3.690241531506215E-7,8.2281486616711167E-5,null,7460,2.8839784711191612E-17,2.6798059522241569E-10,6.0144995049817457E-8]
[7470,5.7213413290057403E-14,3.7594427301880578E-7,8.2646162976442747E-5,null,7470,5.616413698491574E-14,3.7310407803359099E-7,8.2040282136111071E-5,null,7470,2.9879557336176422E-17,2.7094832350182414E-10,5.9968682700282845E-8]
[7480,5.9219688097155256E-14,3.8008883507957797E-7,8.2403889462622198E-5,null,7480,5.813534867609258E-14,3.7721756479629063E-7,8.1799784734154496E-5,null,7480,3.0953853311114905E-17,2.7394051328128304E-10,5.9792887200639684E-8]
[7490,6.1290672957473716E-14,3.8426737435075718E-7,8.2162326161587732E-5,null,7490,6.0170197671389274E-14,3.813647763286484E-7,8.1559992339808331E-5,null,7490,3.2063716845196102E-17,2.7695728364604647E-10,5.9617607037308164E-8]
[7500,6.3428266137350703E-14,3.884800548741932E-7,8.1921470993145747E-5,null,7500,6.2270552563507564E-14,3.8554587547091863E-7,8.1320902887378172E-5,null,7500,3.3210220499277985E-17,2.7999875364722671E-10,5.9442840699822148E-8]
[7510,6.563441578221024E-14,3.9272704063656814E-7,8.1681321881966698E-5,null,7510,6.4438331094894532E-14,3.8976102500869366E-7,8.1082514313452931E-5,null,7510,3.4394465862520663E-17,2.8306504229814216E-10,5.9268586682681742E-8]
[7520,6.7911121064988865E-14,3.9700849556439311E-7,8.1441876755642529E-5,null,7520,6.6675501290643755E-14,3.9401038766793841E-7,8.0844824563570581E-5,null,7520,3.5617584242757229E-17,2.8615626857068593E-10,5.9094843483802231E-8]
[7530,7.0260433356908151E-14,4.0132458351900594E-7,8.1203133552696315E-5,null,7530,6.8984082613469784E-14,3.9829412611002348E-7,8.0607831592030137E-5,null,7530,3.6880737370798929E-17,2.8927255139168983E-10,5.8921609603558456E-8]
[7540,7.2684457421007352E-14,4.0567546829159193E-7,8.0965090213399056E-5,null,7540,7.1366147141162591E-14,4.0261240292678349E-7,8.0371533353023334E-5,null,7540,3.8185118118950893E-17,2.9241400963930805E-10,5.874888355235062E-8]
[7550,7.5185352628736704E-14,4.100613135981994E-7,8.0727744688244502E-5,null,7550,7.3823820766824412E-14,4.069653806355668E-7,8.0135927813753009E-5,null,7550,3.9531951233934581E-17,2.9558076213939466E-10,5.8576663838531838E-8]
[7560,7.776533419997032E-14,4.1448228307477688E-7,8.0491094929639655E-5,null,7560,7.6359284422223706E-14,4.1135322167431083E-7,7.990101294098992E-5,null,7560,4.0922494084446038E-17,2.9877292766190097E-10,5.8404948979057421E-8]
[7570,8.0426674466806709E-14,4.1893854027221391E-7,8.0255138901200339E-5,null,7570,7.8974775324682813E-14,4.1577608839661866E-7,7.9666786710742916E-5,null,7570,4.2358037423603045E-17,3.0199062491727E-10,5.8233737495166881E-8]
[7580,8.3171704161562168E-14,4.2343024865139399E-7,8.0019874565795781E-5,null,7580,8.1672588247824397E-14,4.2023414306684783E-7,7.9433247102597292E-5,null,7580,4.383990616652309E-17,3.0523397255284268E-10,5.8063027908962154E-8]
[7590,8.6002813729185841E-14,4.2795757157826019E-7,7.9785299897264529E-5,null,7590,8.4455076816470157E-14,4.2472754785521106E-7,7.920039210770606E-5,null,7590,4.5369460183213158E-17,3.0850308914927316E-10,5.7892818750078521E-8]
[7600,8.8922454664647929E-14,4.3252067231888971E-7,7.9551412873110576E-5,null,7600,8.7324654826201954E-14,4.2925646483288808E-7,7.8968219713851015E-5,null,7600,4.6948095107111511E-17,3.1179809321694947E-10,5.7723108552246604E-8]
[7610,9.1933140875496786E-14,4.3711971403458463E-7,7.9318211479352857E-5,null,7610,9.0283797587784652E-14,4.3382105596715129E-7,7.8736727924670397E-5,null,7610,4.8577243159410885E-17,3.1511910319242687E-10,5.7553895851818508E-8]
[7620,9.5037450070125175E-14,4.4175485977696002E-7,7.9085693705586321E-5,null,7620,9.3335043296999327E-14,4.3842148311648991E-7,7.8505914744042118E-5,null,7620,5.0258373989530951E-17,3.1846623743485785E-10,5.7385179192450672E-8]
[7630,9.8238025171985222E-14,4.4642627248307219E-7,7.8853857548547335E-5,null,7630,9.648099443009529E-14,4.430579080257735E-7,7.8275778182632569E-5,null,7630,5.1992995531882309E-17,3.2183961422245218E-10,5.7216957118494389E-8]
[7640,1.0153757576021375E-13,4.5113411497051901E-7,7.8622701003515727E-5,null,7640,9.9724319165352202E-14,4.4773049232138784E-7,7.8046316251791686E-5,null,7640,5.3782654879237541E-17,3.2523935174891738E-10,5.7049228176340186E-8]
[7650,1.0493887953705157E-13,4.5587854993259091E-7,7.839222208788502E-5,null,7650,1.0306775283110984E-13,4.5243939750642292E-7,7.7817526980859195E-5,null,7650,5.5628939172955969E-17,3.2866556811993265E-10,5.6881990927148688E-8]
[7660,1.0844478382238898E-13,4.6065973993340998E-7,7.8162418809346213E-5,null,7660,1.0651409938059163E-13,4.5718478495584488E-7,7.7589408396162583E-5,null,7660,5.7533476510281646E-17,3.3211838134961854E-10,5.6715243924855797E-8]
[7670,1.1205820707594236E-13,4.6547784740309709E-7,7.7933289190533215E-5,null,7670,1.1006623289404262E-13,4.6196681591169787E-7,7.7361958530878456E-5,null,7670,5.9497936869048298E-17,3.3559790935702186E-10,5.654898573475078E-8]
[7680,1.1578214044730681E-13,4.7033303463293182E-7,7.7704831251568826E-5,null,7680,1.1372709910839735E-13,4.6678565147830422E-7,7.7135175423669053E-5,null,7680,6.1524033049952889E-17,3.391042699626015E-10,5.6383214921997816E-8]
[7690,1.1961964935448577E-13,4.7522546377055594E-7,7.7477043029227497E-5,null,7690,1.1749971697510261E-13,4.7164145261749722E-7,7.6909057122340188E-5,null,7690,6.3613521636792338E-17,3.4263758088473857E-10,5.621793005978897E-8]
[7700,1.2357387509103146E-13,4.8015529681515721E-7,7.7249922558107116E-5,null,7700,1.2138718024619314E-13,4.7653438014384123E-7,7.6683601674010267E-5,null,7700,6.5768203974758635E-17,3.4619795973623786E-10,5.6053129723956496E-8]
[7710,1.276480364625798E-13,4.8512269561268622E-7,7.7023467875823098E-5,null,7710,1.2539265908942246E-13,4.8146459471988627E-7,7.6458807138340368E-5,null,7710,6.798992716730045E-17,3.497855240208506E-10,5.5888812488071916E-8]
[7720,1.3184543145275654E-13,4.9012782185109584E-7,7.6797677040381634E-5,null,7720,1.2951940173242712E-13,4.8643225685143913E-7,7.6234671578406603E-5,null,7720,7.0280585091545199E-17,3.5340039112981469E-10,5.572497694490913E-8]
[7730,1.3616943891923364E-13,4.9517083705556094E-7,7.6572548100541866E-5,null,7730,1.337707361366645E-13,4.9143752688281759E-7,7.6011193064431983E-5,null,7730,7.2642119432788076E-17,3.5704267833837798E-10,5.5561621680579961E-8]
[7740,1.4062352032020178E-13,5.0025190258375056E-7,7.6348079112880345E-5,null,7740,1.3815007170142305E-13,4.9648056499215991E-7,7.5788369665418204E-5,null,7740,7.5076520738235438E-17,3.6071250280236354E-10,5.5398745280204713E-8]
[7750,1.4521122147166778E-13,5.0537117962109116E-7,7.6124268148823504E-5,null,7750,1.4266090099829054E-13,5.0156153118671983E-7,7.5566199460372211E-5,null,7750,7.7585829490268214E-17,3.6440998155472437E-10,5.5236346346689298E-8]
[7760,1.4993617433603648E-13,5.1052882917605124E-7,7.5901113277455237E-5,null,7760,1.4730680153654075E-13,5.0668058529818528E-7,7.5344680544734853E-5,null,7760,8.0172137199519555E-17,3.6813523150211717E-10,5.5074423479626993E-8]
[7770,1.5480209884242511E-13,5.1572501207544108E-7,7.5678612570147076E-5,null,7770,1.5209143755988076E-13,5.1183788697801475E-7,7.5123810994516123E-5,null,7770,8.2837587518091671E-17,3.7188836942148345E-10,5.4912975278030232E-8]
[7780,1.5981280473913604E-13,5.2095988895972713E-7,7.5456764116345288E-5,null,7780,1.5701856187497692E-13,5.1703359569278389E-7,7.4903588917707092E-5,null,7780,8.5584377373159243E-17,3.7566951195664466E-10,5.4752000358243724E-8]
[7790,1.6497219347873384E-13,5.2623362027836247E-7,7.523556599879233E-5,null,7790,1.6209201771220907E-13,5.2226787071955013E-7,7.4684012409711136E-5,null,7790,8.8414758121286176E-17,3.7947877561490507E-10,5.4591497326028929E-8]
[7800,1.7028426013612223E-13,5.3154636628512873E-7,7.5015016317199991E-5,null,7800,1.6731574061903414E-13,5.2754087114122883E-7,7.4465079581656152E-5,null,7800,9.1331036723710846E-17,3.8331627676366712E-10,5.4431464805484851E-8]
[7810,1.7575309536014511E-13,5.3689828703350347E-7,7.4795113165871251E-5,null,7810,1.7269376038649507E-13,5.3285275584199368E-7,7.4246788544036037E-5,null,7810,9.4335576942928458E-17,3.8718213162706145E-10,5.4271901410250762E-8]
[7820,1.8138288735909531E-13,5.4228954237203037E-7,7.4575854652902672E-5,null,7820,1.78230203009229E-13,5.3820368350267986E-7,7.4029137420731443E-5,null,7820,9.7430800560865501E-17,3.9107645628258028E-10,5.4112805769536689E-8]
[7830,1.8717792392064921E-13,5.4772029193971866E-7,7.4357238881549585E-5,null,7830,1.8392929267951797E-13,5.435938125962199E-7,7.3812124325905979E-5,null,7830,1.0061918861894721E-16,3.9499936665773446E-10,5.3954176507453274E-8]
[7840,1.9314259446661811E-13,5.5319069516144181E-7,7.413926397354516E-5,null,7840,1.8979535381573105E-13,5.4902330138307212E-7,7.3595747396857649E-5,null,7840,1.0390328268036008E-16,3.9895097852670352E-10,5.3796012260668074E-8]
[7850,1.9928139214304387E-13,5.5870091124337434E-7,7.3921928049149044E-5,null,7850,1.95832813125736E-13,5.544923079066936E-7,7.3380004768722722E-5,null,7850,1.0728568611483318E-16,4.0293140750702192E-10,5.3638311666365892E-8]
[7860,2.0559891594605552E-13,5.642510991684288E-7,7.3705229241613227E-5,null,7860,2.0204620170562369E-13,5.6000098998900798E-7,7.3164894584475378E-5,null,7860,1.1076906540622723E-16,4.069407690562561E-10,5.348107336761549E-8]
[7870,2.1209987288400169E-13,5.6984141769171297E-7,7.3489165670935548E-5,null,7870,2.0844015717431671E-13,5.6554950522589631E-7,7.2950414980020261E-5,null,7870,1.1435615148327443E-16,4.1097917846870477E-10,5.3324296002699656E-8]
[7880,2.1878908017624595E-13,5.7547202533601394E-7,7.3273735477513352E-5,null,7880,2.150194258444089E-13,5.7113801098271402E-7,7.2736564109291779E-5,null,7880,1.1804974107374176E-16,4.1504675087211035E-10,5.3167978219369056E-8]
[7890,2.2567146748927196E-13,5.8114308038727821E-7,7.3058936816008696E-5,null,7890,2.2178886492988612E-13,5.7676666438980543E-7,7.2523340142735548E-5,null,7890,1.2185269808240948E-16,4.1914360122437679E-10,5.3012118682051148E-8]
[7900,2.3275207921037939E-13,5.8685474089013272E-7,7.2844767825126514E-5,null,7900,2.2875344479101829E-13,5.8243562233805336E-7,7.2310741229146303E-5,null,7900,1.2576795499311546E-16,4.2326984431030824E-10,5.2856716038211208E-8]
[7910,2.4003607675960285E-13,5.9260716464340993E-7,7.2631226657558028E-5,null,7910,2.3591825121701585E-13,5.8814504147444046E-7,7.2098765535398283E-5,null,7910,1.2979851429522918E-16,4.2742559473835348E-10,5.2701768946620593E-8]
[7920,2.4752874094023188E-13,5.9840050919568992E-7,7.2418311479450817E-5,null,7920,2.4328848774687444E-13,5.9389507819762229E-7,7.188741124385761E-5,null,7920,1.339474499348554E-16,4.3161096693736782E-10,5.2547276078218545E-8]
[7930,2.5523547432860868E-13,6.0423493184087189E-7,7.220602044968717E-5,null,7930,2.5086947802903354E-13,5.9968588865352986E-7,7.1676676524776679E-5,null,7930,1.382179087911842E-16,4.3582607515338681E-10,5.2393236096383456E-8]
[7940,2.6316180370342562E-13,6.1011058961374501E-7,7.1994351741648221E-5,null,7940,2.5866666822008297E-13,6.0551762873097393E-7,7.1466559563523606E-5,null,7940,1.4261311217816743E-16,4.4007103344640759E-10,5.22396476783144E-8]
[7950,2.7131338251526874E-13,6.1602763928560151E-7,7.1783303531595258E-5,null,7950,2.6668562942327012E-13,6.1139045405729074E-7,7.1257058552350372E-5,null,7950,1.4713635737200641E-16,4.4434595568719761E-10,5.2086509496732374E-8]
[7960,2.7969599339678703E-13,6.2198623735983345E-7,7.1572874003894714E-5,null,7960,2.7493206016717149E-13,6.1730451999396742E-7,7.1048171689863974E-5,null,7960,1.5179101916471299E-16,4.4865095555408834E-10,5.1933820234826957E-8]
[7970,2.8831555071405683E-13,6.2798654006759413E-7,7.1363061336970118E-5,null,7970,2.8341178892508596E-13,6.2325998163233659E-7,7.0839897164131361E-5,null,7970,1.5658055144411852E-16,4.529861465298237E-10,5.178157857075687E-8]
[7980,2.9717810315954804E-13,6.3402870336343772E-7,7.115386372634758E-5,null,7980,2.9213077667556412E-13,6.2925699378925112E-7,7.0632233186158639E-5,null,7980,1.6150848880061754E-16,4.57351641898384E-10,5.1629783197813785E-8]
[7990,3.0628983638732182E-13,6.4011288292099232E-7,7.0945279370640682E-5,null,7990,3.0109511950469715E-13,6.3529571100278228E-7,7.0425177967445906E-5,null,7990,1.6657844816106583E-16,4.6174755474184003E-10,5.1478432808390316E-8]
[8000,3.1565707569103551E-13,6.4623923412866523E-7,7.0737306471018563E-5,null,8000,3.1031105125073371E-13,6.413762875279592E-7,7.0218729721651592E-5,null,8000,1.7179413045021394E-16,4.6617399793722547E-10,5.1327526094930902E-8]
[8010,3.2528628872497875E-13,6.5240791208533592E-7,7.0529943230128648E-5,null,8010,3.1978494619122249E-13,6.4749887733249378E-7,7.0012886662166045E-5,null,8010,1.7715932227983994E-16,4.706310841534089E-10,5.1177061755056854E-8]
[8020,3.3518408826902794E-13,6.5861907159610544E-7,7.0323187870122898E-5,null,8020,3.2952332177362771E-13,6.5366363409256047E-7,6.9807647030002091E-5,null,8020,1.8267789766616638E-16,4.7511892584799483E-10,5.1027038498507248E-8]
[8030,3.4535723503786386E-13,6.6487286716803781E-7,7.0117038600307283E-5,null,8030,3.3953284138966041E-13,6.5987071118856688E-7,6.9603009044563957E-5,null,8030,1.8835381977582178E-16,4.7963763526422881E-10,5.0877455023059667E-8]
[8040,3.5581264053491464E-13,6.7116945300592623E-7,6.9911493650969117E-5,null,8040,3.4982031719386531E-13,6.6612026170095235E-7,6.9398970951222434E-5,null,8040,1.9419114270061048E-16,4.8418732442791489E-10,5.0728310048495438E-8]
[8050,3.6655736995181139E-13,6.7750898300809144E-7,6.9706551247624085E-5,null,8050,3.6039271296721164E-13,6.7241243840601638E-7,6.9195530985784398E-5,null,8050,2.0019401326168445E-16,4.8876810514435955E-10,5.0579602286509509E-8]
[8060,3.7759864511364495E-13,6.8389161076218765E-7,6.9502209621863568E-5,null,8060,3.7125714702597469E-13,6.7874739377175314E-7,6.8992687392985366E-5,null,8060,2.0636667284326301E-16,4.9338008899531831E-10,5.043133045285742E-8]
[8070,3.8894384747066118E-13,6.903174895410225E-7,6.929846701562562E-5,null,8070,3.8242089517652776E-13,6.8512527995370544E-7,6.8790438427094336E-5,null,8070,2.1271345925635653E-16,4.98023387335954E-10,5.0283493272212112E-8]
[8080,4.0060052113700639E-13,6.9678677229842572E-7,6.9095321671564224E-5,null,8080,3.9389139371668301E-13,6.9154624879085943E-7,6.8588782345928466E-5,null,8080,2.1923880863291545E-16,5.0269811129183184E-10,5.0136089470232999E-8]
[8090,4.1257637597702791E-13,7.0329961166510051E-7,6.8892771837263133E-5,null,8090,4.0567624248403319E-13,6.9801045180152826E-7,6.8387717409861532E-5,null,8090,2.2594725735070892E-16,5.0740437175589791E-10,4.9989117775820849E-8]
[8100,4.2487929073959561E-13,7.0985615994452122E-7,6.8690815769960841E-5,null,8100,4.1778320795182677E-13,7.0451804017927801E-7,6.8187241886738845E-5,null,8100,2.3284344398931424E-16,5.1214227938549453E-10,4.9842576920666609E-8]
[8110,4.3751731624115853E-13,7.1645656910883817E-7,6.8489451728899635E-5,null,8110,4.3022022637298697E-13,7.1106916478886371E-7,6.7987354049998288E-5,null,8110,2.3993211131763294E-16,5.1691194459938093E-10,4.9696465644839866E-8]
[8120,4.5049867859801508E-13,7.2310099079481972E-7,6.8288677976666569E-5,null,8120,4.4299540697286064E-13,7.176639761621994E-7,6.7788052174941649E-5,null,8120,2.4721810831330696E-16,5.2171347757477597E-10,4.9550782688285912E-8]
[8130,4.6383178250829446E-13,7.2978957629979415E-7,6.8088492782039366E-5,null,8130,4.5611703519107273E-13,7.2430262449432926E-7,6.7589334541936165E-5,null,8130,2.5470639221436413E-16,5.2654698824440814E-10,4.9405526792967112E-8]
[8140,4.7752521458450287E-13,7.3652247657761725E-7,6.7888894422934342E-5,null,8140,4.6959357597344008E-13,7.3098525963942609E-7,6.7391199442947569E-5,null,8140,2.6240203060365201E-16,5.314125862935783E-10,4.9260696708412739E-8]
[8150,4.9158774673672244E-13,7.4329984223467726E-7,6.7689881177584224E-5,null,8150,4.8343367711396112E-13,7.377120311068232E-7,6.7193645168039021E-5,null,8150,2.703102035261454E-16,5.3631038115725341E-10,4.9116291188024325E-8]
[8160,5.0602833960752813E-13,7.5012182352590104E-7,6.7491451327550184E-5,null,8160,4.9764617264795375E-13,7.4448308805705094E-7,6.6996670010997266E-5,null,8160,2.7843620563985833E-16,5.4124048201715711E-10,4.8972308984266541E-8]
[8170,5.208561460589669E-13,7.5698857035079176E-7,6.7293603169380701E-5,null,8170,5.1224008629670141E-13,7.5129857929790068E-7,6.6800272281838119E-5,null,8170,2.8678544840054991E-16,5.4620299779888631E-10,4.8828748859336107E-8]
[8180,5.3608051471207924E-13,7.6390023224948487E-7,6.7096334992096599E-5,null,8180,5.2722463496405781E-13,7.581586532805111E-7,6.6604450283498857E-5,null,8180,2.9536346228062493E-16,5.5119803716903988E-10,4.8685609574275872E-8]
[8190,5.5171099353986891E-13,7.7085695839882158E-7,6.6899645098417146E-5,null,8190,5.4260923228593104E-13,7.6506345809547035E-7,6.6409202325924373E-5,null,8190,3.0417589902277143E-16,5.5622570853235864E-10,4.8542889895116031E-8]
[8200,5.6775733351396665E-13,7.7785889760845741E-7,6.6703531791872435E-5,null,8200,5.5840349223286172E-13,7.7201314146895238E-7,6.6214526730976354E-5,null,8200,3.1322853392857033E-16,5.6128612002889654E-10,4.840058859309051E-8]
[8210,5.8422949230581579E-13,7.8490619831696685E-7,6.6507993383538831E-5,null,8210,5.746172327665421E-13,7.7900785075884948E-7,6.6020421820734424E-5,null,8210,3.2252726818259566E-16,5.6637937953117863E-10,4.8258704440146861E-8]
[8220,6.011376380429275E-13,7.9199900858801091E-7,6.6313028186997753E-5,null,8220,5.91260479550811E-13,7.8604773295096792E-7,6.5826885918730373E-5,null,8220,3.3207813121240087E-16,5.7150559464141508E-10,4.8117236213369276E-8]
[8230,6.18492153120683E-13,7.991374761064732E-7,6.6118634521880425E-5,null,8230,6.0834346971759886E-13,7.9313293465518667E-7,6.5633917355398743E-5,null,8230,3.4188728308472319E-16,5.7666487268868444E-10,4.7976182697408717E-8]
[8240,6.3630363807046453E-13,8.0632174817465885E-7,6.5924810712236968E-5,null,8240,6.258766556885825E-13,8.0026360210169455E-7,6.5441514471950297E-5,null,8240,3.519610169384233E-16,5.8185732072617023E-10,4.7835542670944431E-8]
[8250,6.5458291548459436E-13,8.1355197170850725E-7,6.5731555090796785E-5,null,8250,6.4387070905302688E-13,8.0743988113722169E-7,6.5249675614456197E-5,null,8250,3.6230576145451519E-16,5.8708304552839876E-10,4.7695314927014892E-8]
[8260,6.7334103399877825E-13,8.2082829323380944E-7,6.5538865987473335E-5,null,8260,6.623365245025688E-13,8.1466191722128644E-7,6.5058399117354915E-5,null,8260,3.7292808336374725E-16,5.9234215358848673E-10,4.755549825101532E-8]
[8270,6.9258927233254353E-13,8.2815085888247133E-7,6.5346741744107847E-5,null,8270,6.8128522382328871E-13,8.2192985542248691E-7,6.4867683342420925E-5,null,8270,3.8383468999205007E-16,5.9763475111542028E-10,4.741609144323925E-8]
[8280,7.123391433884745E-13,8.3551981438878491E-7,6.5155180703975894E-5,null,8280,7.0072815994602961E-13,8.2924384041479652E-7,6.4677526640281234E-5,null,8280,3.9503243184447092E-16,6.0296094403133803E-10,4.7277093300138297E-8]
[8290,7.3260239841069423E-13,8.4293530508570964E-7,6.4964181216904584E-5,null,8290,7.2067692105526306E-13,8.3660401647387472E-7,6.4487927372974103E-5,null,8290,4.0652830522782656E-16,6.0832083796882403E-10,4.713850262201878E-8]
[8300,7.5339103120331031E-13,8.5039747590121795E-7,6.4773741637099374E-5,null,8300,7.411433347573483E-13,8.4401052747343705E-7,6.4298883908389516E-5,null,8300,4.1832945491260746E-16,6.1371453826824424E-10,4.7000318218546616E-8]
[8310,7.747172824093735E-13,8.5790647135461272E-7,6.4583860319884128E-5,null,8310,7.6213947230857999E-13,8.5146351688160197E-7,6.4110394617463605E-5,null,8310,4.3044317683451706E-16,6.1914214997507121E-10,4.6862538895242548E-8]
[8320,7.9659364385110316E-13,8.6546243555290193E-7,6.4394535632492401E-5,null,8320,7.8367765290391428E-13,8.5896312775728443E-7,6.3922457874897613E-5,null,8320,4.4287692083614742E-16,6.246037778372309E-10,4.6725163465994546E-8]
[8330,8.1903286293188111E-13,8.7306551218718813E-7,6.4205765943078967E-5,null,8330,8.0577044802679474E-13,8.6650950274662295E-7,6.3735072058937172E-5,null,8330,4.5563829344914468E-16,6.3009952630248602E-10,4.6588190748635963E-8]
[8340,8.4204794710078947E-13,8.807158445290684E-7,6.4017549621742318E-5,null,8340,8.2843068586083572E-13,8.7410278407939448E-7,6.3548235556779115E-5,null,8340,4.6873506071740273E-16,6.3562949951580575E-10,4.6451619558152776E-8]
[8350,8.6565216837993764E-13,8.8841357542706654E-7,6.3829885048187571E-5,null,8350,8.5167145576364019E-13,8.8174311356547885E-7,6.3361946756368458E-5,null,8350,4.8217515106145767E-16,6.4119380131676866E-10,4.6315448720327041E-8]
[8360,8.8985906795611439E-13,8.961588473030957E-7,6.3642770606283454E-5,null,8360,8.7550611280428276E-13,8.8943063259134415E-7,6.3176204054185556E-5,null,8360,4.9596665818511392E-16,6.4679253523698592E-10,4.6179677061419623E-8]
[8370,9.1468246083618729E-13,9.039518021489334E-7,6.3456204680410625E-5,null,8370,8.99948282363837E-13,8.9716548211654644E-7,6.2991005846683157E-5,null,8370,5.1011784402396793E-16,6.5242580449753525E-10,4.6044303409523158E-8]
[8380,9.4013644056797334E-13,9.1179258152270772E-7,6.3270185666405612E-5,null,8380,9.2501186480071561E-13,9.0494780267024572E-7,6.2806350542954874E-5,null,8380,5.2463714173693633E-16,6.5809371200639651E-10,4.5909326602432969E-8]
[8390,9.6623538402657278E-13,9.1968132654544102E-7,6.3084711954254998E-5,null,8390,9.5071104018076583E-13,9.1277773434776842E-7,6.2622236541951985E-5,null,8390,5.3953315874086414E-16,6.6379636035593969E-10,4.5774745471322053E-8]
[8400,9.9299395626710872E-13,9.2761817789758376E-7,6.2899781957098121E-5,null,8400,9.7706027307307088E-13,9.2065541680717241E-7,6.2438662270239341E-5,null,8400,5.5481467978881926E-16,6.6953385182039411E-10,4.5640558861781097E-8]
[8410,1.0204271154444086E-12,9.3560327581559617E-7,6.2715394068507736E-5,null,8410,1.0040743174119942E-12,9.2858098926584654E-7,6.2255626133334897E-5,null,8410,5.7049067009245588E-16,6.753062883533594E-10,4.5506765612347566E-8]
[8420,1.0485501178005603E-12,9.4363676008852023E-7,6.2531546705948797E-5,null,8420,1.0317682214264214E-12,9.3655459049711144E-7,6.2073126560108056E-5,null,8420,5.865702784890763E-16,6.8111377158531117E-10,4.5373364570415514E-8]
[8430,1.0773785227201755E-12,9.5171877005461334E-7,6.2348238283315883E-5,null,8430,1.0601573326359353E-12,9.4457635882687994E-7,6.1891161975663142E-5,null,8430,6.0306284065333417E-16,6.8695640282114049E-10,4.5240354589844754E-8]
[8440,1.1069281978554751E-12,9.5984944459798525E-7,6.2165467222407626E-5,null,8440,1.0892573029161558E-12,9.5264643213030996E-7,6.1709730815700668E-5,null,8440,6.1997788235497537E-16,6.9283428303771245E-10,4.5107734522168929E-8]
[8450,1.1372153243203221E-12,9.6802892214525363E-7,6.1983231942083574E-5,null,8450,1.1190840936322557E-12,9.6076494782849201E-7,6.1528831504386312E-5,null,8450,6.3732512276204286E-16,6.987475128814219E-10,4.497550321912192E-8]
[8460,1.1682564019548621E-12,9.7625734066223971E-7,6.1801530881139396E-5,null,8460,1.1496539808423915E-12,9.6893204288516693E-7,6.1348462497363455E-5,null,8460,6.5511447779073162E-16,7.0469619266578923E-10,4.484365955207144E-8]
[8470,1.2000682546611987E-12,9.8453483765066351E-7,6.1620362468219972E-5,null,8470,1.1809835605714061E-12,9.7714785380343911E-7,6.1168622234696244E-5,null,8470,6.7335606350208456E-16,7.1068042236904815E-10,4.4712202376723398E-8]
[8480,1.2326680358103872E-12,9.9286155014489613E-7,6.1439725141343204E-5,null,8480,1.2130897541551042E-12,9.8541251662256287E-7,6.0989309162805493E-5,null,8480,6.9206019954591008E-16,7.1670030163178437E-10,4.4581130564055031E-8]
[8490,1.2660732337222031E-12,1.0012376147087016E-6,6.1259617345533747E-5,null,8490,1.2459898136565814E-12,9.9372616691469601E-7,6.0810521742215887E-5,null,8490,7.1123741265272354E-16,7.2275592975455479E-10,4.4450442980381979E-8]
[8500,1.3003016772177201E-12,1.0096631674320306E-6,6.108003752595163E-5,null,8500,1.279701327354587E-12,1.0020889397817243E-6,6.0632258425929302E-5,null,8500,7.3089844017388278E-16,7.2884740569555626E-10,4.4320138500733427E-8]
[8510,1.3353715412454325E-12,1.018138343927804E-6,6.0900984135420404E-5,null,8510,1.3142422253047039E-12,1.0105009698520642E-6,6.0454517681569915E-5,null,8510,7.5105423367042491E-16,7.349748280682754E-10,4.4190216002979832E-8]
[8520,1.3713013525819825E-12,1.0266632793287597E-6,6.0722455633991093E-5,null,8520,1.3496307849742648E-12,1.0189623912775371E-6,6.0277297974893578E-5,null,8520,7.7171596255122555E-16,7.411382951391951E-10,4.4060674369198503E-8]
[8530,1.4081099956078827E-12,1.035238108284302E-6,6.0544450481770215E-5,null,8530,1.3858856369516949E-12,1.027473337730235E-6,6.0100597783433902E-5,null,8530,7.9289501776091509E-16,7.4733790482549364E-10,4.3931512478771287E-8]
[8540,1.445816718159029E-12,1.0438629649573687E-6,6.0366967140292417E-5,null,8540,1.423025770730625E-12,1.0360339423994156E-6,5.9924415575223177E-5,null,8540,8.1460301551798521E-16,7.5357375469276547E-10,4.3802729221588909E-8]
[8550,1.484441137454485E-12,1.0525379830213303E-6,6.0190004089172046E-5,null,8550,1.461070540569673E-12,1.0446443379884194E-6,5.97487498441393E-5,null,8550,8.3685180110348679E-16,7.598459419527559E-10,4.3674323489654856E-8]
[8560,1.5240032461016192E-12,1.0612632956569254E-6,6.0013559792788556E-5,null,8560,1.5000396714287319E-12,1.05330465671163E-6,5.9573599065541464E-5,null,8560,8.5965345270103523E-16,7.6615456346113082E-10,4.3546294169167944E-8]
[8570,1.5645234181790227E-12,1.0700390355491985E-6,5.9837632736329914E-5,null,8570,1.5399532649822258E-12,1.0620150302914344E-6,5.9398961732353588E-5,null,8570,8.830202852884712E-16,7.7249971571523913E-10,4.3418640162673588E-8]
[8580,1.6060224153979278E-12,1.0788653348844656E-6,5.9662221399737315E-5,null,8580,1.5808318057100444E-12,1.0707755899552055E-6,5.9224836341676348E-5,null,8580,9.0696485458163389E-16,7.7888149485190804E-10,4.3291360366288799E-8]
[8590,1.6485213933428397E-12,1.0877423253473192E-6,5.9487324277334729E-5,null,8590,1.6226961670670249E-12,1.0795864664323345E-6,5.9051221393689718E-5,null,8590,9.3149996103077482E-16,7.8529999664525039E-10,4.3164453688529099E-8]
[8600,1.692041907792183E-12,1.0966701381176471E-6,5.9312939854718571E-5,null,8600,1.6655676177314167E-12,1.0884477899512689E-6,5.8878115385550298E-5,null,8600,9.5663865387016792E-16,7.9175531650449707E-10,4.303791902847674E-8]
[8610,1.7366059211195619E-12,1.1056489038676721E-6,5.9139066635830884E-5,null,8610,1.7094678279333359E-12,1.0973596902365705E-6,5.8705516837560448E-5,null,8610,9.8239423522134984E-16,7.9824754947183562E-10,4.2911755301510144E-8]
[8620,1.7822358087762422E-12,1.1146787527590047E-6,5.8965703115231729E-5,null,8620,1.7544188758635049E-12,1.1063222965059943E-6,5.8533424244553465E-5,null,8620,1.0087802642503723E-15,8.0477679022026192E-10,4.2785961415839418E-8]
[8630,1.8289543658560679E-12,1.1237598144397726E-6,5.8792847802791575E-5,null,8630,1.8004432541636659E-12,1.1153357374676362E-6,5.8361836139977378E-5,null,8630,1.0358105613799848E-15,8.1134313305148572E-10,4.2660536290661234E-8]
[8640,1.8767848137425836E-12,1.1328922180416915E-6,5.8620499207917765E-5,null,8640,1.8475638764982976E-12,1.1244001413170222E-6,5.8190751035892843E-5,null,8640,1.0634992125565309E-15,8.1794667189379569E-10,4.2535478842347813E-8]
[8650,1.9257508068402517E-12,1.1420760921772295E-6,5.8448655847129901E-5,null,8650,1.8958040842096343E-12,1.1335156357342959E-6,5.8020167463424811E-5,null,8650,1.0918605735729511E-15,8.2458750029999015E-10,4.2410787996296673E-8]
[8660,1.9758764393893377E-12,1.1513115649367663E-6,5.8277316234211904E-5,null,8660,1.9451876530555268E-12,1.1426823478814014E-6,5.7850083943999887E-5,null,8660,1.120909274447487E-15,8.3126571144530475E-10,4.2286462673181884E-8]
[8670,2.0271862523661257E-12,1.1605987638857906E-6,5.8106478896630511E-5,null,8670,1.9957388000316815E-12,1.151900404399291E-6,5.7680499020061537E-5,null,8670,1.1506602238593854E-15,8.379813981253684E-10,4.2162501805572843E-8]
[8680,2.0797052404683896E-12,1.1699378160620729E-6,5.7936142363298229E-5,null,8680,2.047482190278413E-12,1.1611699314051285E-6,5.7511411227707288E-5,null,8680,1.1811286136414819E-15,8.4473465275414414E-10,4.203890432589758E-8]
[8690,2.1334588591875644E-12,1.1793288479729681E-6,5.7766305159369225E-5,null,8690,2.1004429440731669E-12,1.1704910544896069E-6,5.7342819105197082E-5,null,8690,1.2123299233306271E-15,8.5152556736195473E-10,4.1915669161543152E-8]
[8700,2.1884730319679041E-12,1.1887719855925955E-6,5.7596965830084518E-5,null,8700,2.1546466439091699E-12,1.1798638987141475E-6,5.717472120464868E-5,null,8700,1.2442799247763238E-15,8.5835423359343239E-10,4.1792795260121912E-8]
[8710,2.2447741574530515E-12,1.198267354359201E-6,5.7428122910347142E-5,null,8710,2.2101193416606271E-12,1.1892885886082784E-6,5.7007116077660543E-5,null,8710,1.2769946868077186E-15,8.6522074270558766E-10,4.1670281558281304E-8]
[8720,2.302389116821812E-12,1.2078150791724022E-6,5.7259774943090758E-5,null,8720,2.2668875658362448E-12,1.198765248166911E-6,5.6840002271007782E-5,null,8720,1.3104905799602402E-15,8.7212518556580717E-10,4.1548126994481157E-8]
[8730,2.3613452812126768E-12,1.2174152843905675E-6,5.7091920484424041E-5,null,8730,2.3249783289205569E-12,1.2082940008477214E-6,5.6673378358352642E-5,null,8730,1.3447842812616739E-15,8.7906765264993319E-10,4.1426330527682318E-8]
[8740,2.4216705192383429E-12,1.2270680938281406E-6,5.6924558081660487E-5,null,8740,2.3844191348044756E-12,1.2178749695685067E-6,5.6507242891705927E-5,null,8740,1.3798927790784234E-15,8.8604823404031462E-10,4.1304891097337592E-8]
[8750,2.4833932045912032E-12,1.236773630753039E-6,5.6757686293118898E-5,null,8750,2.4452379863057716E-12,1.2275082767045981E-6,5.634159444502987E-5,null,8750,1.4158333780226976E-15,8.9306701942391488E-10,4.1183807662798869E-8]
[8760,2.5465422237402357E-12,1.2465320178840596E-6,5.6591303681312689E-5,null,8760,2.5074633927801631E-12,1.2371940440862807E-6,5.6176431590349483E-5,null,8760,1.4526237039209967E-15,9.0012409809040553E-10,4.1063079176592033E-8]
[8770,2.611146983719586E-12,1.2563433773882937E-6,5.6425408814137012E-5,null,8770,2.5711243778231179E-12,1.2469323929962353E-6,5.6011752899837259E-5,null,8770,1.4902817088439769E-15,9.0721955893029169E-10,4.0942704602446721E-8]
[8780,2.6772374200108663E-12,1.2662078308786034E-6,5.6260000260012213E-5,null,8780,2.6362504870644907E-12,1.2567234441670269E-6,5.5847556960014393E-5,null,8780,1.5288256761991903E-15,9.1435349043306275E-10,4.0822682902306194E-8]
[8790,2.7448440045182396E-12,1.276125499411077E-6,5.6095076593907965E-5,null,8790,2.702871796055E-12,1.2665673177785779E-6,5.5683842352856638E-5,null,8790,1.5682742258861566E-15,9.215259806853423E-10,4.0703013038453951E-8]
[8800,2.8139977536386163E-12,1.2860965034825472E-6,5.5930636394257294E-5,null,8800,2.7710189182468916E-12,1.2764641334557084E-6,5.5520607667726153E-5,null,8800,1.6086463195151541E-15,9.2873711736906472E-10,4.0583693982909922E-8]
[8810,2.8847302364265652E-12,1.2961209630281121E-6,5.5766678241320692E-5,null,8810,2.8407230130684251E-12,1.2864140102656713E-6,5.5357851495504015E-5,null,8810,1.6499612656897079E-15,9.3598698775968163E-10,4.0464724703637757E-8]
[8820,2.9570735828547553E-12,1.3061989974186832E-6,5.5603200725527626E-5,null,8820,2.9120157940929025E-12,1.2964170667157173E-6,5.5195572436154809E-5,null,8820,1.6922387253532692E-15,9.4327567872435707E-10,4.0346104179043246E-8]
[8830,3.0310604921720139E-12,1.3163307254585703E-6,5.5440202441553278E-5,null,8830,2.9849295373043391E-12,1.3064734207507006E-6,5.5033769098406468E-5,null,8830,1.7354987172014583E-15,9.5060327672021123E-10,4.0227831386399798E-8]
[8840,3.1067242413574452E-12,1.3265162653830706E-6,5.5277681974388134E-5,null,8840,3.0594970894583767E-12,1.3165831897506839E-6,5.4872440071246241E-5,null,8840,1.7797616231589502E-15,9.5796986779256306E-10,4.010990530435742E-8]
[8850,3.1840986936736724E-12,1.3367557348560903E-6,5.5115637930068074E-5,null,8850,3.1357518765411535E-12,1.3267464905285725E-6,5.471158397387668E-5,null,8850,1.8250481939230485E-15,9.6537553757318734E-10,3.999232491626622E-8]
[8860,3.2632183073182096E-12,1.3470492509678051E-6,5.4954068911030429E-5,null,8860,3.2137279123256203E-12,1.3369634393278002E-6,5.4551199421085534E-5,null,8860,1.871379554573355E-15,9.7282037127860921E-10,3.9875089210448787E-8]
[8870,3.3441181441747254E-12,1.3573969302323286E-6,5.4792973522859874E-5,null,8870,3.2934598070264517E-12,1.3472341518200017E-6,5.4391285028672114E-5,null,8870,1.9187772102485974E-15,9.8030445370840205E-10,3.9758197174548593E-8]
[8880,3.4268338786644805E-12,1.3677988885853837E-6,5.4632350380001883E-5,null,8880,3.3749827760544556E-12,1.3575587431027162E-6,5.4231839416115111E-5,null,8880,1.9672630518911538E-15,9.8782786924348906E-10,3.9641647803908338E-8]
[8890,3.5114018066988111E-12,1.3782552413820749E-6,5.4472198095389596E-5,null,8890,3.4583326488708401E-12,1.3679373276971645E-6,5.4072861211151025E-5,null,8890,2.0168593620594207E-15,9.9539070184451023E-10,3.9525440092170002E-8]
[8900,3.5978588547335373E-12,1.3887661033945777E-6,5.4312515292292835E-5,null,8900,3.5435458779425834E-12,1.3783700195459527E-6,5.3914349047180529E-5,null,8900,2.0675888208092135E-15,1.002993035050139E-9,3.9409573038886726E-8]
[8910,3.6862425889255199E-12,1.3993315888099413E-6,5.4153300590344284E-5,null,8910,3.6306595477987415E-12,1.3888569320109047E-6,5.3756301551761932E-5,null,8910,2.1194745116438793E-15,1.0106349519754781E-9,3.9294045643852645E-8]
[8920,3.7765912243929008E-12,1.409951811227867E-6,5.3994552621375952E-5,null,8920,3.7197113841897473E-12,1.3993981778708405E-6,5.3598717367952853E-5,null,8920,2.1725399275344819E-15,1.0183165353104343E-9,3.9178856911657852E-8]
[8930,3.8689436345795467E-12,1.4206268836585347E-6,5.3836270010903119E-5,null,8930,3.8107397633496391E-12,1.4099938693194269E-6,5.3441595130133907E-5,null,8930,2.2268089770103514E-15,1.0260378673181313E-9,3.9064005849101736E-8]
[8940,3.9633393607231878E-12,1.4313569185204236E-6,5.3678451403758933E-5,null,8940,3.9037837213610514E-12,1.4206441179630136E-6,5.3284933494703188E-5,null,8940,2.2823059903196833E-15,1.0337990298333183E-9,3.8949491471667744E-8]
[8950,4.0598186214306724E-12,1.4421420276382137E-6,5.3521095429485926E-5,null,8950,3.9988829636264505E-12,1.4313490348185446E-6,5.3128731101650693E-5,null,8950,2.3390557256625952E-15,1.0416001042608371E-9,3.8835312783063229E-8]
[8960,4.158422322357946E-12,1.4529823222406363E-6,5.3364200741975857E-5,null,8960,4.096077874442843E-12,1.4421087303114286E-6,5.2972986611650952E-5,null,8960,2.3970833754948715E-15,1.0494411715740477E-9,3.8721468807870634E-8]
[8970,4.2591920659980597E-12,1.4638779129584013E-6,5.3207765979864424E-5,null,8970,4.1954095266837152E-12,1.4529233142734794E-6,5.2817698676213651E-5,null,8970,2.4564145729050201E-15,1.05732231231332E-9,3.8607958558133094E-8]
[8980,4.3621701615768247E-12,1.474828909822152E-6,5.3051789800292696E-5,null,8980,4.2969196915873668E-12,1.4637928959408849E-6,5.2662865960041669E-5,null,8980,2.5170753980639309E-15,1.0652436065845352E-9,3.849478105844094E-8]
[8990,4.4673996350561299E-12,1.4858354222604004E-6,5.2896270857599556E-5,null,8990,4.4006508486520825E-12,1.474717583952159E-6,5.2508487130371908E-5,null,8990,2.5790923847476874E-15,1.0732051340575768E-9,3.8381935333871941E-8]
[9000,4.57492423924801E-12,1.49689755909751E-6,5.2741207814495479E-5,null,9000,4.5066461956408763E-12,1.485697486346136E-6,5.2354560859151535E-5,null,9000,2.6424925269352099E-15,1.0812069739648566E-9,3.826942041449219E-8]
[9010,4.6847884640369474E-12,1.5080154285517342E-6,5.2586599329295943E-5,null,9010,4.6149496586934486E-12,1.4967327105600229E-6,5.2201085812922954E-5,null,9010,2.7073032854794088E-15,1.0892492050998833E-9,3.8157235325783471E-8]
[9020,4.7970375467148794E-12,1.5191891382332286E-6,5.2432444074418902E-5,null,9020,4.7256059025498224E-12,1.5078233634274286E-6,5.2048060672317553E-5,null,9020,2.7735525948546908E-15,1.097331905815807E-9,3.8045379103402314E-8]
[9030,4.9117174824257354E-12,1.5304187951421011E-6,5.227874071409625E-5,null,9030,4.8386603408824503E-12,1.5189695511764265E-6,5.1895484114496866E-5,null,9030,2.8412688699787338E-15,1.10545515402399E-9,3.7933850779168812E-8]
[9040,5.0288750347235221E-12,1.5417045056664988E-6,5.2125487932152771E-5,null,9040,4.9541591467407919E-12,1.5301713794276513E-6,5.1743354832942267E-5,null,9040,2.9104810131114521E-15,1.1136190271926186E-9,3.7822649397545263E-8]
[9050,5.1485577462435046E-12,1.5530463755807249E-6,5.1972684404030563E-5,null,9050,5.0721492631079102E-12,1.5414289531924388E-6,5.1591671509388162E-5,null,9050,2.9812184208306767E-15,1.1218236023453152E-9,3.7711773998932766E-8]
[9060,5.2708139494862187E-12,1.5644445100433508E-6,5.1820328810273817E-5,null,9060,5.1926784135688215E-12,1.552742376870937E-6,5.1440432838552925E-5,null,9060,3.0535109910843272E-15,1.1300689560597654E-9,3.7601223624330385E-8]
[9070,5.395692777716266E-12,1.5758990135953673E-6,5.1668419840476242E-5,null,9070,5.3157951130926568E-12,1.5641117542502866E-6,5.1289637516646952E-5,null,9070,3.1273891303210371E-15,1.1383551644663606E-9,3.7490997321850395E-8]
[9080,5.52324417597739E-12,1.5874099901583675E-6,5.1516956185879701E-5,null,9080,5.4415486789297525E-12,1.5755371885028034E-6,5.1139284245971642E-5,null,9080,3.2028837606992505E-15,1.1466823032468708E-9,3.7381094148124304E-8]
[9090,5.6535189122217189E-12,1.5989775430327453E-6,5.1365936541922858E-5,null,9090,5.5699892416222002E-12,1.5870187821841926E-6,5.0989371730654412E-5,null,9090,3.2800263273745416E-15,1.1550504476331304E-9,3.727151314796467E-8]
[9100,5.7865685885575492E-12,1.6106017748959207E-6,5.1215359602549808E-5,null,9100,5.7011677561314108E-12,1.5985566372317971E-6,5.0839898672372113E-5,null,9100,3.3588488058671257E-15,1.1634596724057363E-9,3.7162253378522464E-8]
[9110,5.9224456526130946E-12,1.6222827878005578E-6,5.1065224070169693E-5,null,9110,5.8351360130810086E-12,1.6101508549628106E-6,5.0690863787189438E-5,null,9110,3.4393837095086635E-15,1.1719100518927399E-9,3.7053313897989845E-8]
[9120,6.0612034090200059E-12,1.6340206831728821E-6,5.0915528659264737E-5,null,9120,5.9719466501179297E-12,1.6218015360726222E-6,5.054226579888795E-5,null,9120,3.5216640969704887E-15,1.1804016599684291E-9,3.6944693773411883E-8]
[9130,6.2028960310143291E-12,1.6458155618109337E-6,5.0766272072014266E-5,null,9130,6.1116531633902115E-12,1.6335087806330728E-6,5.0394103413931172E-5,null,9130,3.6057235798718983E-15,1.1889345700520353E-9,3.6836392059462982E-8]
[9140,6.3475785721580399E-12,1.6576675238829049E-6,5.0617453020272439E-5,null,9140,6.254309919144013E-12,1.6452726880908093E-6,5.0246375358409339E-5,null,9140,3.6915963304705265E-15,1.1975088551065244E-9,3.672840782718644E-8]
[9150,6.4953069781811084E-12,1.6695766689254686E-6,5.0469070227477026E-5,null,9150,6.399972165440135E-12,1.657093357265617E-6,5.0099080362733757E-5,null,9150,3.7793170894351919E-15,1.206124587637379E-9,3.6620740148867818E-8]
[9160,6.6461380989445041E-12,1.6815430958421431E-6,5.032112241335292E-5,null,9160,6.548696043990433E-12,1.6689708863488138E-6,4.9952217157861143E-5,null,9160,3.8689211737009405E-15,1.214781839691384E-9,3.6513388092076295E-8]
[9170,6.8001297005251028E-12,1.6935669029016928E-6,5.0173608298260981E-5,null,9170,6.7005386021147729E-12,1.6809053729016334E-6,4.9805784470723605E-5,null,9170,3.9604444844075174E-15,1.2234806828554745E-9,3.6406350731100396E-8]
[9180,6.9573404774232004E-12,1.7056481877365072E-6,5.0026526617042656E-5,null,9180,6.8555578048197293E-12,1.6928969138536462E-6,4.9659781049431708E-5,null,9180,4.0539235149215119E-15,1.2322211882555413E-9,3.629962714762084E-8]
[9190,7.1178300648942745E-12,1.7177870473410809E-6,4.9879876096683489E-5,null,9190,7.0138125470001445E-12,1.7049456055012287E-6,4.9514205625755315E-5,null,9190,4.1493953589433027E-15,1.2410034265553136E-9,3.6193216417397972E-8]
[9200,7.2816590514035148E-12,1.7299835780704209E-6,4.9733655476713177E-5,null,9200,7.1753626657624498E-12,1.7170515435059911E-6,4.9369056953189683E-5,null,9200,4.2468977186980806E-15,1.2498274679551993E-9,3.6087117626661628E-8]
[9210,7.448888991206381E-12,1.7422378756385391E-6,4.9587863499591679E-5,null,9210,7.3402689528729752E-12,1.7292148228932823E-6,4.9224333780366656E-5,null,9210,4.3464689132128656E-15,1.2586933821911804E-9,3.5981329862191024E-8]
[9220,7.6195824170544753E-12,1.754550035116992E-6,4.9442498899972514E-5,null,9220,7.5085931673300145E-12,1.7414355380507287E-6,4.9080034852680974E-5,null,9220,4.4481478866793514E-15,1.267601238533739E-9,3.5875852207138521E-8]
[9230,7.7938028530277325E-12,1.7669201509333482E-6,4.9297560433435112E-5,null,9230,7.6803980480614909E-12,1.7537137827267266E-6,4.8936158931084642E-5,null,9230,4.5519742169032095E-15,1.2765511057867383E-9,3.5770683756304579E-8]
[9240,7.971614827493562E-12,1.779348316869777E-6,4.9153046846666745E-5,null,9240,7.8557473267481937E-12,1.7660496500290297E-6,4.8792704777267968E-5,null,9240,4.6579881238402097E-15,1.2855430522863874E-9,3.5665823600802967E-8]
[9250,8.1530838861942946E-12,1.7918346260616115E-6,4.9008956894751447E-5,null,9250,8.0347057407741115E-12,1.77844323242333E-6,4.8649671152843941E-5,null,9250,4.7662304782203835E-15,1.2945771459001885E-9,3.5561270838612331E-8]
[9260,8.338276605462506E-12,1.80437917099593E-6,4.8865289332115491E-5,null,9260,8.2173390463036001E-12,1.7908946217318438E-6,4.850705682205165E-5,null,9260,4.8767428102596432E-15,1.3036534540258982E-9,3.5457024566763058E-8]
[9270,8.527260605566653E-12,1.8169820435101837E-6,4.872204293046595E-5,null,9270,8.403714031487562E-12,1.8034039091319525E-6,4.8364860561817939E-5,null,9270,4.9895673184608283E-15,1.3127720435905185E-9,3.5353083890864516E-8]
[9280,8.7201045641856925E-12,1.8296433347908369E-6,4.8579216446604811E-5,null,9280,8.5938985297974847E-12,1.8159711851548476E-6,4.8223081142292317E-5,null,9280,5.1047468785031946E-15,1.3219329810493062E-9,3.5249447910944224E-8]
[9290,8.9168782300148245E-12,1.8423631353720198E-6,4.8436808652870064E-5,null,9290,8.7879614334894367E-12,1.8285965396841968E-6,4.808171734182822E-5,null,9290,5.2223250522219055E-15,1.3311363323847768E-9,3.5146115734703954E-8]
[9300,9.1176524365031753E-12,1.8551415351342257E-6,4.829481831916032E-5,null,9300,8.9859727071986454E-12,1.8412800619548558E-6,4.7940767942121249E-5,null,9300,5.3423460966779786E-15,1.3403821631057538E-9,3.504308647320467E-8]
[9310,9.3224991157231862E-12,1.8679786233030104E-6,4.8153244228230438E-5,null,9310,9.1880034016648678E-12,1.8540218405515588E-6,4.7800231733964181E-5,null,9310,5.4648549733188186E-15,1.349670538246421E-9,3.4940359238377391E-8]
[9320,9.5314913123730174E-12,1.8808744884477266E-6,4.801208515196967E-5,null,9320,9.3941256675892586E-12,1.8668219634076861E-6,4.7660107498547181E-5,null,9320,5.5898973572300002E-15,1.3590015223653799E-9,3.4837933141860071E-8]
[9330,9.7447031979123764E-12,1.8938292184802733E-6,4.7871339878636895E-5,null,9330,9.6044127696237362E-12,1.8796805178040008E-6,4.7520394031943317E-5,null,9330,5.7175196464788388E-15,1.3683751795447465E-9,3.4735807304464308E-8]
[9340,9.9622100848335965E-12,1.9068429006538718E-6,4.7731007190638141E-5,null,9340,9.8189391004940252E-12,1.8925975903674442E-6,4.7381090125183418E-5,null,9340,5.8477689715508778E-15,1.3777915733892413E-9,3.4633980840103891E-8]
[9350,1.0184088441066471E-11,1.9199156215618635E-6,4.7591085882372352E-5,null,9350,1.0037780195255744E-11,1.9055732670699411E-6,4.7242194584382352E-5,null,9350,5.9806932048784704E-15,1.3872507670253159E-9,3.4532452879447217E-8]
[9360,1.041041590452036E-11,1.9330474671365238E-6,4.7451574750834582E-5,null,9360,1.0261012745686067E-11,1.9186076332272223E-6,4.7103706213128828E-5,null,9360,6.1163409704637722E-15,1.396752823100279E-9,3.4431222544003374E-8]
[9370,1.0641271297760574E-11,1.9462385226479276E-6,4.7312472588762154E-5,null,9370,1.0488714614808554E-11,1.9317007734976897E-6,4.6965623810441218E-5,null,9370,6.2547616535941059E-15,1.4062978037814629E-9,3.4330288959630932E-8]
[9380,1.0876734642825607E-11,1.9594888727027645E-6,4.7173778194361216E-5,null,9380,1.0720964851557871E-11,1.9448527718812536E-6,4.6827946188231204E-5,null,9380,6.3960054106544536E-15,1.4158857707553515E-9,3.4229651254693927E-8]
[9390,1.1116887176177713E-11,1.9727986012432906E-6,4.7035490380386349E-5,null,9390,1.0957843705576281E-11,1.9580637117182828E-6,4.6690672164501456E-5,null,9390,6.5401231790318015E-15,1.4255167852268188E-9,3.4129308568648177E-8]
[9400,1.1361811363796475E-11,1.9861677915461718E-6,4.6897607952608674E-5,null,9400,1.1199432642152004E-11,1.9713336756884539E-6,4.6553800554830143E-5,null,9400,6.6871666871179385E-15,1.4351909079182703E-9,3.4029260032727636E-8]
[9410,1.161159091640826E-11,1.9995965262214667E-6,4.6760129714764198E-5,null,9410,1.1445814357292246E-11,1.9846627458097479E-6,4.6417330173429517E-5,null,9410,6.8371884644060126E-15,1.4449081990688969E-9,3.392950477985235E-8]
[9420,1.1866310804858075E-11,2.0130848872115289E-6,4.6623054492420603E-5,null,9420,1.1697072792937358E-11,1.9980510034373559E-6,4.6281259853984975E-5,null,9420,6.9902418516854686E-15,1.4546687184338714E-9,3.3830041961311856E-8]
[9430,1.21260572756208E-11,2.0266329557900399E-6,4.6486381098548513E-5,null,9430,1.1953293152313127E-11,2.011498529262724E-6,4.6145588415049378E-5,null,9430,7.146381011332957E-15,1.4644725252836396E-9,3.3730870708976104E-8]
[9440,1.2390917866453968E-11,2.0402408125609469E-6,4.6350108356619516E-5,null,9440,1.2214561915423324E-11,2.0250054033124886E-6,4.6010314690025979E-5,null,9440,7.3056609377010285E-15,1.4743196784031321E-9,3.3631990172241036E-8]
[9450,1.2660981422193543E-11,2.0539085374575264E-6,4.6214235090836143E-5,null,9450,1.2480966854683968E-11,2.0385717049475555E-6,4.5875437516592207E-5,null,9450,7.4681374676057452E-15,1.4842102360910809E-9,3.3533399500966637E-8]
[9460,1.2936338110691576E-11,2.0676362097413684E-6,4.6078760132736677E-5,null,9460,1.2752597050698358E-11,2.0521975128620876E-6,4.5740955726169943E-5,null,9460,7.633867290912036E-15,1.4941442561592727E-9,3.3435097843583448E-8]
[9470,1.3217079438897389E-11,2.0814239080015204E-6,4.5943682316568741E-5,null,9470,1.3029542908174068E-11,2.0658829050826536E-6,4.5606868170589093E-5,null,9470,7.8029079612187009E-15,1.5041217959319095E-9,3.3337084356151079E-8]
[9480,1.3503298269083709E-11,2.0952717101534859E-6,4.5809000471523551E-5,null,9480,1.3311896171983979E-11,2.0796279589672366E-6,4.5473173680666261E-5,null,9480,7.9753179066431444E-15,1.5141429122448905E-9,3.3239358187398746E-8]
[9490,1.379508883521678E-11,2.109179693438365E-6,4.5674713439975287E-5,null,9490,1.359974994336958E-11,2.0934327512043726E-6,4.5339871109207507E-5,null,9490,8.1511564407061587E-15,1.5242076614451581E-9,3.3141918499387452E-8]
[9500,1.4092546759472651E-11,2.1231479344219902E-6,4.5540820067144929E-5,null,9500,1.3893198696289655E-11,2.1072973578123124E-6,4.5206959311395241E-5,null,9500,8.3304837733176087E-15,1.5343160993900762E-9,3.3044764452498189E-8]
[9510,1.4395769068898446E-11,2.1371765089940456E-6,4.5407319195100541E-5,null,9510,1.4192338293912202E-11,2.1212218541381176E-6,4.5074437137380211E-5,null,9510,8.5133610218626542E-15,1.5444682814467769E-9,3.29478952072174E-8]
[9520,1.4704854212222568E-11,2.1512654923672585E-6,4.5274209674418467E-5,null,9520,1.4497266005254369E-11,2.1352063148568769E-6,4.494230344705722E-5,null,9520,8.6998502223910014E-15,1.5546642624915586E-9,3.2851309929275793E-8]
[9530,1.501990207681084E-11,2.1654149590765737E-6,4.5141490359621384E-5,null,9530,1.4808080521966707E-11,2.1492508139708862E-6,4.4810557098989938E-5,null,9530,8.8900143409074467E-15,1.5649040969092881E-9,3.2755007787507704E-8]
[9540,1.5341014005771216E-11,2.1796249829783633E-6,4.500916010342319E-5,null,9540,1.5124881975264879E-11,2.1633554248088584E-6,4.4679196959000416E-5,null,9540,9.0839172847652381E-15,1.5751878385928122E-9,3.265898794969039E-8]
[9550,1.5668292815207437E-11,2.1938956372496765E-6,4.487721776989381E-5,null,9550,1.5447771953009128E-11,2.177520220025178E-6,4.4548221897139106E-5,null,9550,9.2816239141629299E-15,1.5855155409424018E-9,3.2563249593061945E-8]
[9560,1.6001842811622211E-11,2.2082269943874453E-6,4.4745662218993887E-5,null,9560,1.5776853516931604E-11,2.1917452715991095E-6,4.4417630784593346E-5,null,9560,9.4832000537448639E-15,1.5958872568651689E-9,3.2467791886054319E-8]
[9570,1.6341769809470878E-11,2.2226191262078342E-6,4.4614492316141837E-5,null,9570,1.6112231220013162E-11,2.2060306508341654E-6,4.428742249109251E-5,null,9570,9.6887125043059743E-15,1.6063030387745865E-9,3.2372614009847252E-8]
[9580,1.6688181148865019E-11,2.2370721038454412E-6,4.4483706929346158E-5,null,9580,1.6454011124008753E-11,2.2203764283572946E-6,4.4157595894076986E-5,null,9580,9.8982290546010747E-15,1.6167629385899019E-9,3.2277715141598185E-8]
[9590,1.7041185713429099E-11,2.2515859977526871E-6,4.435330493866621E-5,null,9590,1.680230081712449E-11,2.2347826741182854E-6,4.4028149882360815E-5,null,9590,1.0111818493260032E-14,1.6272670077356721E-9,3.2183094468335853E-8]
[9600,1.7400893948307E-11,2.2661608776991053E-6,4.4223285214740077E-5,null,9600,1.7157209431843042E-11,2.2492494573890568E-6,4.3899083337980601E-5,null,9600,1.0329550620807472E-14,1.637815297141258E-9,3.2088751170249388E-8]
[9610,1.7767417878323922E-11,2.2807968127707239E-6,4.4093646636979205E-5,null,9610,1.7518847662903585E-11,2.2637768467630559E-6,4.377039514197911E-5,null,9610,1.0551496261790265E-14,1.6484078572403467E-9,3.1994684433370936E-8]
[9620,1.8140871126299688E-11,2.2954938713694328E-6,4.396438808932063E-5,null,9620,1.7887327785431331E-11,2.278364910154609E-6,4.3642084190695993E-5,null,9620,1.0777727277010264E-14,1.6590447379705019E-9,3.1900893452860022E-8]
[9630,1.8521368931516524E-11,2.3102521212123524E-6,4.3835508457075485E-5,null,9630,1.8262763673220664E-11,2.293013714798309E-6,4.3514149380384077E-5,null,9630,1.1008316575864886E-14,1.6697259887726825E-9,3.1807377414632401E-8]
[9640,1.8909028168342541E-11,2.3250716293313143E-6,4.3707006628553155E-5,null,9640,1.8645270817172029E-11,2.3077233272484974E-6,4.3386589600616926E-5,null,9640,1.1243338128795534E-14,1.6804516585908677E-9,3.1714135511614864E-8]
[9650,1.9303967365008942E-11,2.3399524620722305E-6,4.3578881498082951E-5,null,9650,1.9034966343881853E-11,2.3224938133786344E-6,4.3259403757939606E-5,null,9650,1.1482866979843716E-14,1.6912217958715772E-9,3.1621166946997806E-8]
[9660,1.9706306722544452E-11,2.354894685094585E-6,4.3451131960848208E-5,null,9660,1.9431969034387947E-11,2.3373252383807963E-6,4.3132590755953419E-5,null,9660,1.1726979259315916E-14,1.7020364485635107E-9,3.1528470913190304E-8]
[9670,2.0116168133866059E-11,2.3698983633709086E-6,4.332375691462911E-5,null,9670,1.9836399343070046E-11,2.3522176667651575E-6,4.3006149498669928E-5,null,9670,1.1975752196558169E-14,1.7128956641171385E-9,3.1436046612560628E-8]
[9680,2.0533675203025883E-11,2.3849635611862709E-6,4.319675526489341E-5,null,9680,2.0248379416705028E-11,2.3671711623594666E-6,4.2880078900982227E-5,null,9680,1.2229264132838883E-14,1.7237994894843408E-9,3.1343893252026138E-8]
[9690,2.0958953264616875E-11,2.4000903421378004E-6,4.3070125915147049E-5,null,9690,2.066803311367947E-11,2.3821857883086024E-6,4.2754377874096289E-5,null,9690,1.2487594534342851E-14,1.7347479711180404E-9,3.1252010036484453E-8]
[9700,2.1392129403336266E-11,2.4152787691342208E-6,4.294386777016818E-5,null,9700,2.1095486023359237E-11,2.3972616070740892E-6,4.2629045330980073E-5,null,9700,1.2750824005275022E-14,1.7457411549718582E-9,3.1160396168573132E-8]
[9710,2.1833332473709672E-11,2.4305289043954002E-6,4.2817979746573781E-5,null,9710,2.153086548561743E-11,2.4123986804336434E-6,4.2504080193692295E-5,null,9710,1.301903430107662E-14,1.7567790864997853E-9,3.1069050863617741E-8]
[9720,2.2282693119971365E-11,2.4458408094519392E-6,4.2692460761325257E-5,null,9720,2.1974300610517867E-11,2.4275970694807951E-6,4.2379481393364518E-5,null,9720,1.3292308341750322E-14,1.7678618106558654E-9,3.0977973335814698E-8]
[9730,2.2740343796108395E-11,2.4612145451447727E-6,4.2567309723943847E-5,null,9730,2.242592229816084E-11,2.4428568346244541E-6,4.2255247840931786E-5,null,9730,1.3570730225299644E-14,1.7789893718939001E-9,3.0887162795088588E-8]
[9740,2.3206418786062851E-11,2.4766501716247411E-6,4.2442525562656456E-5,null,9740,2.2885863258685273E-11,2.4581780355885211E-6,4.2131378473719433E-5,null,9740,1.385438524127905E-14,1.790161814167133E-9,3.0796618460226033E-8]
[9750,2.368105422409667E-11,2.4921477483523079E-6,4.2318107201823946E-5,null,9750,2.3354258032433081E-11,2.4735607314115723E-6,4.2007872224698866E-5,null,9750,1.4143359884457924E-14,1.8013791809280316E-9,3.0706339555005603E-8]
[9760,2.4164388115318303E-11,2.5077073340971211E-6,4.219405356858093E-5,null,9760,2.3831243010272336E-11,2.4890049804464445E-6,4.1884728033909045E-5,null,9760,1.4437741868597046E-14,1.8126415151279645E-9,3.0616325297148715E-8]
[9770,2.4656560356371386E-11,2.5233289869377569E-6,4.2070363591375163E-5,null,9770,2.4316956454083046E-11,2.504510840359988E-6,4.1761944829046553E-5,null,9770,1.4737620140339253E-14,1.8239488592170024E-9,3.0526574911937041E-8]
[9780,2.5157712756286682E-11,2.5390127642613655E-6,4.1947036207832864E-5,null,9780,2.4811538517403214E-11,2.5200783681326832E-6,4.1639521562152644E-5,null,9780,1.5043084893213794E-14,1.8353012551436531E-9,3.0437087627972335E-8]
[9790,2.5667989057498222E-11,2.5547587227634398E-6,4.182407034954349E-5,null,9790,2.5315131266238446E-11,2.5357076200584409E-6,4.1517457169763454E-5,null,9790,1.5354227581755943E-14,1.8466987443546892E-9,3.0347862666408601E-8]
[9800,2.6187534957022882E-11,2.5705669184474668E-6,4.1701464962571862E-5,null,9800,2.5827878700033675E-11,2.5513986517442439E-6,4.1395750605677947E-5,null,9800,1.5671140935740928E-14,1.8581413677948838E-9,3.0258899268681601E-8]
[9810,2.6716498127804623E-11,2.586437406624765E-6,4.1579218989125657E-5,null,9810,2.6349926772807802E-11,2.567151518109985E-6,4.1274400820179332E-5,null,9810,1.5993918974533397E-14,1.869629165906883E-9,3.0170196662016157E-8]
[9820,2.7255028240225312E-11,2.6023702419141753E-6,4.1457331370885775E-5,null,9820,2.6881423414453717E-11,2.582966273388158E-6,4.1153406762980324E-5,null,9820,1.6322657021553628E-14,1.8811621786309755E-9,3.0081754083101991E-8]
[9830,2.7803276983778638E-11,2.6183654782418933E-6,4.133580106301934E-5,null,9830,2.7422518552200244E-11,2.5988429711236996E-6,4.1032767396338921E-5,null,9830,1.6657451718858095E-14,1.892740445404962E-9,2.9993570769160681E-8]
[9840,2.8361398088914664E-11,2.6344231688413001E-6,4.1214627013790751E-5,null,9840,2.7973364132242794E-11,2.6147816641738107E-6,4.0912481676628539E-5,null,9840,1.6998401041839732E-14,1.9043640051640189E-9,2.9905645959242379E-8]
[9850,2.892954734904679E-11,2.6505433662526994E-6,4.1093808181069696E-5,null,9850,2.8534114141535534E-11,2.6307824047076956E-6,4.0792548569289981E-5,null,9850,1.734560431404225E-14,1.9160328963405118E-9,2.9817978898260311E-8]
[9860,2.9507882642729697E-11,2.6667261223232467E-6,4.0973343524700767E-5,null,9860,2.9104924629752977E-11,2.6468452442065079E-6,4.067296704094347E-5,null,9860,1.769916222209462E-14,1.9277471568639232E-9,2.9730568829651002E-8]
[9870,3.0096563956002443E-11,2.6829714882067814E-6,4.0853232006375595E-5,null,9870,2.9685953731415114E-11,2.6629702334631598E-6,4.0553736062883329E-5,null,9870,1.8059176830761158E-14,1.9395068241607271E-9,2.9643415002626877E-8]
[9880,3.0695753404902989E-11,2.6992795143637026E-6,4.0733472587088364E-5,null,9880,3.0277361688182823E-11,2.6791574225822073E-6,4.0434854601452314E-5,null,9880,1.8425751598112576E-14,1.9513119351542928E-9,2.9556516659654684E-8]
[9890,3.1305615258148718E-11,2.715650250560861E-6,4.0614064238594866E-5,null,9890,3.0879310871318094E-11,2.6954068609797545E-6,4.0316321640190893E-5,null,9890,1.8798991390813445E-14,1.9631625262647948E-9,2.9469873055632162E-8]
[9900,3.1926315959988956E-11,2.7320837458715078E-6,4.0495005930160345E-5,null,9900,3.1491965804314093E-11,2.7117185973833851E-6,4.0198136150143287E-5,null,9900,1.9179002499530716E-14,1.975058633409169E-9,2.9383483442802753E-8]
[9910,3.2558024153226095E-11,2.7485800486751838E-6,4.0376296634905476E-5,null,9910,3.2115493185693159E-11,2.7280926798320714E-6,4.0080297115921895E-5,null,9910,1.9565892654460758E-14,1.987000292001029E-9,2.9297347078765027E-8]
[9920,3.3200910702408082E-11,2.7651392066577136E-6,4.0257935330670823E-5,null,9920,3.2750061911974406E-11,2.7445291556761311E-6,3.9962803520344975E-5,null,9920,1.9959771040977128E-14,1.9989875369506373E-9,2.9211463218757404E-8]
[9930,3.3855148717190274E-11,2.7817612668111595E-6,4.0139920998797561E-5,null,9930,3.33958431008094E-11,2.7610280715772328E-6,3.9845654354610341E-5,null,9930,2.0360748315397494E-14,2.0110204026648898E-9,2.912583112403274E-8]
[9940,3.4520913575872587E-11,2.7984462754338024E-6,4.0022252618024661E-5,null,9940,3.4053010114291552E-11,2.7775894735083368E-6,3.9728848600997221E-5,null,9940,2.0768936620874132E-14,2.0230989230472717E-9,2.9040450054096939E-8]
[9950,3.5198382949103592E-11,2.8151942781301601E-6,3.9904929177191768E-5,null,9950,3.4721738582431336E-11,2.794213406753731E-6,3.9612385262861482E-5,null,9950,2.1184449603402027E-14,2.035223131497876E-9,2.8955319276707578E-8]
[9960,3.5887736823760663E-11,2.8320053198110197E-6,3.9787949665786917E-5,null,9960,3.540220642680585E-11,2.810899915909053E-6,3.9496263331472861E-5,null,9960,2.1607402427951014E-14,2.0473930609134058E-9,2.8870438056737457E-8]
[9970,3.6589157527002427E-11,2.8488794446934548E-6,3.9671313073739764E-5,null,9970,3.6094593884379386E-11,2.8276490448813165E-6,3.9380481803503417E-5,null,9970,2.2037911794719426E-14,2.0596087436871963E-9,2.8785805658991714E-8]
[9980,3.7302829750493093E-11,2.8658166963009027E-6,3.9555018398431917E-5,null,9980,3.6799083531494484E-11,2.8444608368889834E-6,3.9265039687256842E-5,null,9980,2.2476095955509165E-14,2.0718702117092497E-9,2.870142136104096E-8]
[9990,3.8028940574804013E-11,2.8828171174632409E-6,3.9439064635257066E-5,null,9990,3.7515860308038614E-11,2.8613353344620312E-6,3.9149935983913477E-5,null,9990,2.2922074730225749E-14,2.0841774963662871E-9,2.8617284429798883E-8]
[10000,3.8767679493984323E-11,2.8998807503168736E-6,3.9323450784139999E-5,null,10000,3.8245111541778957E-11,2.8782725794420536E-6,3.9035169700440022E-5,null,10000,2.3375969523497554E-14,2.0965306285418056E-9,2.8533394143825494E-8]
[]
[]
["Saved  27/02/2023: 15:35:21  Level Number: 5"]
[]
["BREAKTHROUGH RESULTS"]
[]
["Advanced"]
["Pollutant Linkage: Inert Restorati, Attenuation Layer, Beenham Grange Formation",null,null,null,null,"Pollutant Linkage: Inert Restorati, Attenuation Layer, Beenham Grange Formation, Groundwater",null,null,null,null,"Pollutant Linkage: Inert Restorati, Attenuation Layer, Beenham Grange Formation, River Enborne"]
["Concentrations in mg/L in Beenham Grange Formation",null,null,null,null,"Concentrations in mg/L in Groundwater",null,null,null,null,"Concentrations in mg/L in River Enborne"]
[]
["Compared with EAL (GW) target concentration in mg/L",null,null,null,null,"Compared with EAL (GW) target concentration in mg/L",null,null,null,null,"Compared with EAL (River Enborne) target concentration in mg/L"]
[null,0.26600000000000001,2.0000000000000001E-4,5.9999999999999995E-4,null,null,0.26600000000000001,2.0000000000000001E-4,5.9999999999999995E-4,null,null,0.26600000000000001,1.1999999999999999E-3,1E-3]
[]
["Time(years)","Species1","Species2","Species3",null,"Time(years)","Species1","Species2","Species3",null,"Time(years)","Species1","Species2","Species3"]
[null,"Ammoniacial Nitrogen","Lead","Antimony",null,null,"Ammoniacial Nitrogen","Lead","Antimony",null,null,"Ammoniacial Nitrogen","Lead","Antimony"]
[10,0,0,4.6769188393062662E-4,null,10,0,0,4.6419848587778931E-4,null,10,0,0,3.3793540877325017E-7]
[20,0,0,6.8150175894104276E-4,null,20,0,0,6.7649300795767956E-4,null,20,0,0,4.9422434820995658E-7]
[30,0,0,7.2208948836924931E-4,null,30,0,0,7.1679319410533052E-4,null,30,0,0,5.2389548037967933E-7]
[40,0,0,7.2917503387660073E-4,null,40,0,0,7.2382883525113901E-4,null,40,0,0,5.290817192689623E-7]
[50,0,0,7.2918271389181381E-4,null,50,0,0,7.2383691434870564E-4,null,50,0,0,5.2909731618362928E-7]
[60,0,0,7.275725712023066E-4,null,60,0,0,7.222386841018014E-4,null,60,0,0,5.2793137140693669E-7]
[70,0,0,7.2557446906556958E-4,null,70,0,0,7.2025525714230522E-4,null,70,0,0,5.2648212856995537E-7]
[80,0,0,7.2348290827160832E-4,null,80,0,0,7.1817903660632983E-4,null,80,0,0,5.2496462977020946E-7]
[90,0,0,7.213715756678393E-4,null,90,0,0,7.160831840770797E-4,null,90,0,0,5.2343267149016978E-7]
[100,0,0,7.192595140458406E-4,null,100,0,0,7.1398660652453297E-4,null,100,0,0,5.2190015455146097E-7]
[110,0,0,7.1715176089641778E-4,null,110,0,0,7.1189430549716958E-4,null,110,0,0,5.2037075590299084E-7]
[120,0,0,7.1504966613935759E-4,null,120,0,0,7.0980762128111381E-4,null,120,0,0,5.1884546084537823E-7]
[130,0,0,7.1295358791911877E-4,null,130,0,0,7.077269094666682E-4,null,130,0,0,5.1732453082885885E-7]
[140,0,0,7.1086361304679166E-4,null,140,0,0,7.0565225624971359E-4,null,140,0,0,5.1580802927811692E-7]
[150,0,0,7.0877975307206444E-4,null,150,0,0,7.0358367309922515E-4,null,150,0,0,5.1429596469443463E-7]
[160,0,0,7.0670199844849739E-4,null,160,0,0,7.0152115054006097E-4,null,160,0,0,5.1278833018709794E-7]
[170,0,0,7.0463033368758292E-4,null,170,0,0,6.9946467319919757E-4,null,170,0,0,5.1128511452488501E-7]
[180,0,0,7.0256474163042941E-4,null,180,0,0,6.9741422404489021E-4,null,180,0,0,5.09786305261484E-7]
[190,0,0,7.0050520467836727E-4,null,190,0,0,6.9536978560065185E-4,null,190,0,0,5.0829188962928341E-7]
[200,0,0,6.9845170514090129E-4,null,200,0,0,6.9333134031500094E-4,null,200,0,0,5.0680185478977735E-7]
[210,0,0,6.964042253358978E-4,null,210,0,0,6.9129887062936376E-4,null,210,0,0,5.0531618791303938E-7]
[220,0,0,6.9436274762553507E-4,null,220,0,0,6.8927235903829356E-4,null,220,0,0,5.0383487620251333E-7]
[230,0,0,6.9232725441211742E-4,null,230,0,0,6.8725178807087586E-4,null,230,0,0,5.0235790688967495E-7]
[240,0,0,6.9029772815831206E-4,null,240,0,0,6.8523714031834028E-4,null,240,0,0,5.0088526724601973E-7]
[250,0,0,6.8827415137096275E-4,null,250,0,0,6.8322839841569206E-4,null,250,0,0,4.9941694458038739E-7]
[260,0,0,6.8625650660611014E-4,null,260,0,0,6.8122554505007618E-4,null,260,0,0,4.9795292623692439E-7]
[270,0,0,6.8424477648004083E-4,null,270,0,0,6.7922856296202903E-4,null,270,0,0,4.9649319959689176E-7]
[280,0,0,6.8223894365285881E-4,null,280,0,0,6.7723743493808177E-4,null,280,0,0,4.9503775208522122E-7]
[290,0,0,6.802389908325872E-4,null,290,0,0,6.7525214381445741E-4,null,290,0,0,4.9358657114878495E-7]
[300,0,0,6.7824490078947626E-4,null,300,0,1.0171481118534195E-40,6.7327267249131333E-4,null,300,0,0,4.9213964428815081E-7]
[310,0,0,6.7625665633001949E-4,null,310,0,0,6.7129900389397757E-4,null,310,0,0,4.9069695902845491E-7]
[320,0,3.9053188220893292E-40,6.742742403224748E-4,null,320,0,3.193505124684305E-40,6.6933112102396505E-4,null,320,0,0,4.8925850293742475E-7]
[330,0,2.3002575474202131E-38,6.72297635680812E-4,null,330,0,2.2619233032985663E-38,6.6736900691387812E-4,null,330,0,0,4.8782426361788231E-7]
[340,0,1.0871549281961128E-37,6.7032682536645612E-4,null,340,0,1.071738912461662E-37,6.6541264465292869E-4,null,340,0,0,4.8639422870491526E-7]
[350,0,4.4255910260648106E-37,6.683617923974297E-4,null,350,0,4.3469997798962143E-37,6.6346201738390418E-4,null,350,0,2.3995020084052743E-40,4.8496838587877487E-7]
[360,0,2.1487690722697538E-36,6.6640251983479735E-4,null,360,0,2.1097526347433075E-36,6.6151710829347578E-4,null,360,0,1.1185290975582899E-39,4.8354672284707676E-7]
[370,0,9.8789689345926377E-36,6.6444899079435215E-4,null,370,0,9.7198972370697978E-36,6.5957790061681014E-4,null,370,0,5.4607579688836755E-39,4.8212922735773933E-7]
[380,0,3.79200494305051E-35,6.6250118843723762E-4,null,380,0,3.7377234282758693E-35,6.5764437763921242E-4,null,380,0,2.2203308045016172E-38,4.8071588719371097E-7]
[390,0,1.2337884476620421E-34,6.605590959752666E-4,null,390,0,1.2176181035673158E-34,6.5571652270094718E-4,null,390,0,7.5026566800328799E-38,4.7930669017245583E-7]
[400,0,3.5223251125190387E-34,6.5862269667456709E-4,null,400,0,3.4796351498640122E-34,6.5379431918751504E-4,null,400,0,2.2040942013116873E-37,4.7790162415375117E-7]
[410,0,8.937229893687103E-34,6.5669197383977709E-4,null,410,0,8.8388901073201093E-34,6.5187775052405646E-4,null,410,0,5.7699351470358161E-37,4.7650067702075218E-7]
[420,0,1.9856356629565307E-33,6.5476691083491334E-4,null,420,0,1.9667412702972892E-33,6.4996680019857394E-4,null,420,0,1.3365739832223836E-36,4.751038367029797E-7]
[430,0,3.6905782736074964E-33,6.528474910636108E-4,null,430,0,3.6636430890103894E-33,6.4806145173367403E-4,null,430,0,2.6414020233256175E-36,4.737110911586757E-7]
[440,0,5.0724729701513546E-33,6.509336979925853E-4,null,440,0,5.0582909786968975E-33,6.461616887242813E-4,null,440,0,4.0785436301773574E-36,4.7232242839099814E-7]
[450,0,2.3344162191423836E-33,6.4902551511446379E-4,null,450,0,2.4066011900422015E-33,6.4426749477585756E-4,null,450,0,3.4303674783606586E-36,4.7093783642101777E-7]
[460,0,0,6.4712292599409995E-4,null,460,0,0,6.4237885357833061E-4,null,460,0,0,4.6955730332474458E-7]
[470,0,0,6.4522591422591516E-4,null,470,0,0,6.4049574884536781E-4,null,470,0,0,4.6818081719745466E-7]
[480,0,0,6.4333446346703479E-4,null,480,0,0,6.3861816435267608E-4,null,480,0,0,4.6680836617936726E-7]
[490,0,0,6.4144855740656283E-4,null,490,0,0,6.3674608391093733E-4,null,490,0,0,4.6543993843930316E-7]
[500,0,0,6.395681798040721E-4,null,500,0,0,6.3487949139883902E-4,null,500,0,0,4.6407552218904967E-7]
[510,0,0,6.3769331443702909E-4,null,510,0,0,6.3301837071146245E-4,null,510,0,0,4.6271510565804818E-7]
[520,0,0,6.3582394515883508E-4,null,520,0,0,6.3116270581994123E-4,null,520,0,0,4.6135867713118144E-7]
[530,0,0,6.3396005585227889E-4,null,530,0,0,6.2931248072687468E-4,null,530,0,0,4.6000622491308443E-7]
[540,0,1.6631159286651832E-30,6.3210163045495944E-4,null,540,0,1.6183125430004232E-30,6.2746767948622395E-4,null,540,0,5.1576689685355505E-34,4.5865773734886556E-7]
[550,0,7.341243859818024E-30,6.3024865294736851E-4,null,550,0,7.2349292573824391E-30,6.256282861983732E-4,null,550,0,4.1764313667609328E-33,4.5731320281415788E-7]
[560,0,1.7991026245715066E-29,6.2840110736391475E-4,null,560,0,1.7790233704200667E-29,6.2379428501366534E-4,null,560,0,1.1481760604562801E-32,4.5597260972624463E-7]
[570,0,3.4720245098839315E-29,6.2655897777307782E-4,null,570,0,3.4399921088157856E-29,6.2196566011326194E-4,null,570,0,2.3570507181836011E-32,4.5463594652261849E-7]
[580,0,5.6649518266567063E-29,6.2472224830499004E-4,null,580,0,5.6217544686234499E-29,6.2014239575014399E-4,null,580,0,4.0380059954515519E-32,4.5330320168987491E-7]
[590,0,7.8831009483212761E-29,6.2289090312846E-4,null,590,0,7.8366954076415565E-29,6.1832447620595299E-4,null,590,0,5.9118604961341345E-32,4.5197436373882548E-7]
[600,0,8.9792077868436361E-29,6.2106492645810116E-4,null,600,0,8.9496386444798307E-29,6.165118858095747E-4,null,600,0,7.2335489043270062E-32,4.5064942121805952E-7]
[610,0,6.9434448755442525E-29,6.1924430255826557E-4,null,610,0,6.9677150207539701E-29,6.14704608941794E-4,null,610,0,6.6063592335634276E-32,4.4932836270702491E-7]
[620,0,0,6.174290157318136E-4,null,620,0,0,6.1290263002332888E-4,null,620,0,1.8901690646373391E-32,4.4801117681802363E-7]
[630,0,0,6.1561905034015064E-4,null,630,0,0,6.1110593352886003E-4,null,630,0,0,4.4669785220302844E-7]
[640,0,0,6.1381439077908136E-4,null,640,0,0,6.093145039664349E-4,null,640,0,0,4.4538837753763244E-7]
[650,0,0,6.1201502150129395E-4,null,650,0,0,6.0752832590705165E-4,null,650,0,0,4.4408274154193394E-7]
[660,0,0,6.102209269906988E-4,null,660,0,0,6.0574738394263085E-4,null,660,0,0,4.4278093295629474E-7]
[670,0,0,6.0843209178896521E-4,null,670,0,0,6.0397166273017436E-4,null,670,0,0,4.414829405668556E-7]
[680,0,0,6.0664850047639361E-4,null,680,0,0,6.0220114696469022E-4,null,680,0,0,4.4018875317914228E-7]
[690,0,0,6.0487013768229035E-4,null,690,0,0,6.0043582138927742E-4,null,690,0,0,4.3889835964836976E-7]
[700,0,0,6.0309698808102294E-4,null,700,0,0,5.9867567078554843E-4,null,700,0,0,4.3761174884977321E-7]
[710,0,0,6.0132903638843854E-4,null,710,0,0,5.969206799849308E-4,null,710,0,0,4.3632890969128466E-7]
[720,0,2.8896069074381013E-27,5.995662673648199E-4,null,720,0,2.8309415183491899E-27,5.9517083385962535E-4,null,720,0,1.2581108869131991E-30,4.3504983111853521E-7]
[730,0,8.4057762764711969E-27,5.9780866582164263E-4,null,730,0,8.3015587030831069E-27,5.9342611733128215E-4,null,730,0,5.1215860173632271E-30,4.3377450210827614E-7]
[740,0,1.6156339948056717E-26,5.9605621660738088E-4,null,740,0,1.5997207698284516E-26,5.9168651536297605E-4,null,740,0,1.0752219135442124E-29,4.3250291166469715E-7]
[750,0,2.5907397393644387E-26,5.9430890461876216E-4,null,750,0,2.5689965972809808E-26,5.8995201295496168E-4,null,750,0,1.8077044116047417E-29,4.3123504883395743E-7]
[760,0,3.6840175480481817E-26,5.9256671479793427E-4,null,760,0,3.657138428514935E-26,5.8822259516876768E-4,null,760,0,2.6602884787071803E-29,4.2997090268533247E-7]
[770,0,4.7389436932843394E-26,5.908296321295982E-4,null,770,0,4.7091216235849631E-26,5.8649824708988726E-4,null,770,0,3.5280297406485493E-29,4.287104623276943E-7]
[780,0,5.5145308441687723E-26,5.8909764163925921E-4,null,780,0,5.4858861833270306E-26,5.84778953860505E-4,null,780,0,4.2407700306393495E-29,4.27453716891244E-7]
[790,0,5.6863772315606823E-26,5.8737072840458798E-4,null,790,0,5.6652547001196913E-26,5.8306470066405466E-4,null,790,0,4.5610802251478678E-29,4.262006555498934E-7]
[800,0,4.8628992354683126E-26,5.8564887753440552E-4,null,800,0,4.8579264070726694E-26,5.8135547272137862E-4,null,800,0,4.1932363304213364E-29,4.2495126749885931E-7]
[810,0,2.6200659864902679E-26,5.8393207419573463E-4,null,810,0,2.6418635943348102E-26,5.7965125530546203E-4,null,810,0,2.8061271690562994E-29,4.2370554197518215E-7]
[820,0,0,5.8222030358768943E-4,null,820,0,0,5.7795203372521453E-4,null,820,0,7.1729038158558405E-31,4.2246346823919794E-7]
[830,0,0,5.8051355095870688E-4,null,830,0,0,5.7625779333754859E-4,null,830,0,0,4.2122503558473211E-7]
[840,0,0,5.7881180159823032E-4,null,840,0,0,5.7456851953890963E-4,null,840,0,0,4.1999023334241549E-7]
[850,0,0,5.7711504083982046E-4,null,850,0,0,5.7288419777055868E-4,null,850,0,0,4.1875905086549633E-7]
[860,0,0,5.7542325405775187E-4,null,860,0,0,5.7120481351361104E-4,null,860,0,0,4.1753147754678451E-7]
[870,0,0,5.7373642667676145E-4,null,870,0,0,5.6953035230275235E-4,null,870,0,0,4.1630750280283254E-7]
[880,0,0,5.7205454415452158E-4,null,880,0,0,5.6786079969844516E-4,null,880,0,0,4.1508711608766237E-7]
[890,2.5815365096520559E-40,0,5.7037759199058584E-4,null,890,2.4132541036782925E-40,0,5.6619614130836696E-4,null,890,0,0,4.1387030687938631E-7]
[900,5.4575942805573034E-40,0,5.6870555573913112E-4,null,900,5.3513177269441318E-40,0,5.6453636278955234E-4,null,900,0,0,4.1265706469364828E-7]
[910,8.5677873912141228E-40,0,5.6703842098634405E-4,null,910,8.6848136537453702E-40,0,5.6288144984007805E-4,null,910,0,0,4.1144737907044113E-7]
[920,1.0111289988311044E-39,0,5.6537617336563394E-4,null,920,1.0656867374971453E-39,0,5.6123138819236436E-4,null,920,0,0,4.1024123959230933E-7]
[930,7.1654964544209278E-40,0,5.6371879854960573E-4,null,930,8.2954774541393713E-40,0,5.595861636293613E-4,null,930,0,0,4.090386358550942E-7]
[940,0,1.2689338131386841E-25,5.6206628225157732E-4,null,940,0,1.2092061199757218E-25,5.5794576196439123E-4,null,940,0,0,4.0783955749509336E-7]
[950,0,7.1695340082309569E-25,5.6041861023093862E-4,null,950,0,7.0648026441626559E-25,5.5631016906034652E-4,null,950,0,4.0028823934946319E-28,4.0664399417945984E-7]
[960,0,1.4691260609512109E-24,5.5877576828875528E-4,null,960,0,1.4534524060229956E-24,5.5467937083082295E-4,null,960,0,9.5096934195375284E-28,4.0545193560553909E-7]
[970,0,2.3667054180635673E-24,5.5713774226468925E-4,null,970,0,2.3453840697428271E-24,5.5305335321188115E-4,null,970,0,1.6208296861641758E-27,4.0426337149851213E-7]
[980,0,3.3741805155783333E-24,5.555045180342706E-4,null,980,0,3.3471339562697986E-24,5.5143210218275502E-4,null,980,0,2.3867147697585539E-27,4.0307829161086415E-7]
[990,0,4.4353230618356246E-24,5.5387608153442507E-4,null,990,0,4.402958954306243E-24,5.4981560378750366E-4,null,990,0,3.2096658540399969E-27,4.0189668573417582E-7]
[1000,1.6537672206524914E-38,5.4726060405857825E-24,5.5225241872130983E-4,null,1000,1.3272788631633799E-38,5.435921869183418E-24,5.4820384408241197E-4,null,1000,0,4.0341498149133545E-27,4.0071854368033105E-7]
[]
[]
["Saved  28/02/2023: 16:45:20  Level Number: 5"]
[]
["BREAKTHROUGH RESULTS"]
[]
["Advanced"]
["Pollutant Linkage: Inert Restorati, Attenuation Layer, Beenham Grange Formation",null,null,null,null,"Pollutant Linkage: Inert Restorati, Attenuation Layer, Beenham Grange Formation, Groundwater",null,null,null,null,"Pollutant Linkage: Inert Restorati, Attenuation Layer, Beenham Grange Formation, River Enborne"]
["Concentrations in mg/L in Beenham Grange Formation",null,null,null,null,"Concentrations in mg/L in Groundwater",null,null,null,null,"Concentrations in mg/L in River Enborne"]
[]
["Compared with EAL (GW) target concentration in mg/L",null,null,null,null,"Compared with EAL (GW) target concentration in mg/L",null,null,null,null,"Compared with EAL (River Enborne) target concentration in mg/L"]
[null,0.39,2.0000000000000001E-4,5.9999999999999995E-4,null,null,0.39,2.0000000000000001E-4,5.9999999999999995E-4,null,null,0.39,1.1999999999999999E-3,1E-3]
[]
["Time(years)","Species1","Species2","Species3",null,"Time(years)","Species1","Species2","Species3",null,"Time(years)","Species1","Species2","Species3"]
[null,"Ammoniacial Nitrogen","Lead","Antimony",null,null,"Ammoniacial Nitrogen","Lead","Antimony",null,null,"Ammoniacial Nitrogen","Lead","Antimony"]
[10,"","","",null,10,"","","",null,10,"","",""]
[20,"","","",null,20,"","","",null,20,"","",""]
[30,"","","",null,30,"","","",null,30,"","",""]
[40,"","","",null,40,"","","",null,40,"","",""]
[50,"","","",null,50,"","","",null,50,"","",""]
[60,"","","",null,60,"","","",null,60,"","",""]
[70,"","","",null,70,"","","",null,70,"","",""]
[80,"","","",null,80,"","","",null,80,"","",""]
[90,"","","",null,90,"","","",null,90,"","",""]
[100,"","","",null,100,"","","",null,100,"","",""]
[110,"","","",null,110,"","","",null,110,"","",""]
[120,"","","",null,120,"","","",null,120,"","",""]
[130,"","","",null,130,"","","",null,130,"","",""]
[140,"","","",null,140,"","","",null,140,"","",""]
[150,"","","",null,150,"","","",null,150,"","",""]
[160,"","","",null,160,"","","",null,160,"","",""]
[170,"","","",null,170,"","","",null,170,"","",""]
[180,"","","",null,180,"","","",null,180,"","",""]
[190,"","","",null,190,"","","",null,190,"","",""]
[200,"","","",null,200,"","","",null,200,"","",""]
[210,"","","",null,210,"","","",null,210,"","",""]
[220,"","","",null,220,"","","",null,220,"","",""]
[230,"","","",null,230,"","","",null,230,"","",""]
[240,"","","",null,240,"","","",null,240,"","",""]
[250,"","","",null,250,"","","",null,250,"","",""]
[260,"","","",null,260,"","","",null,260,"","",""]
[270,"","","",null,270,"","","",null,270,"","",""]
[280,"","","",null,280,"","","",null,280,"","",""]
[290,"","","",null,290,"","","",null,290,"","",""]
[300,"","","",null,300,"","","",null,300,"","",""]
[310,"","","",null,310,"","","",null,310,"","",""]
[320,"","","",null,320,"","","",null,320,"","",""]
[330,"","","",null,330,"","","",null,330,"","",""]
[340,"","","",null,340,"","","",null,340,"","",""]
[350,"","","",null,350,"","","",null,350,"","",""]
[360,"","","",null,360,"","","",null,360,"","",""]
[370,"","","",null,370,"","","",null,370,"","",""]
[380,"","","",null,380,"","","",null,380,"","",""]
[390,"","","",null,390,"","","",null,390,"","",""]
[400,"","","",null,400,"","","",null,400,"","",""]
[410,"","","",null,410,"","","",null,410,"","",""]
[420,"","","",null,420,"","","",null,420,"","",""]
[430,"","","",null,430,"","","",null,430,"","",""]
[440,"","","",null,440,"","","",null,440,"","",""]
[450,"","","",null,450,"","","",null,450,"","",""]
[460,"","","",null,460,"","","",null,460,"","",""]
[470,"","","",null,470,"","","",null,470,"","",""]
[480,"","","",null,480,"","","",null,480,"","",""]
[490,"","","",null,490,"","","",null,490,"","",""]
[500,"","","",null,500,"","","",null,500,"","",""]
[510,"","","",null,510,"","","",null,510,"","",""]
[520,"","","",null,520,"","","",null,520,"","",""]
[530,"","","",null,530,"","","",null,530,"","",""]
[540,"","","",null,540,"","","",null,540,"","",""]
[550,"","","",null,550,"","","",null,550,"","",""]
[560,"","","",null,560,"","","",null,560,"","",""]
[570,"","","",null,570,"","","",null,570,"","",""]
[580,"","","",null,580,"","","",null,580,"","",""]
[590,"","","",null,590,"","","",null,590,"","",""]
[600,"","","",null,600,"","","",null,600,"","",""]
[610,"","","",null,610,"","","",null,610,"","",""]
[620,"","","",null,620,"","","",null,620,"","",""]
[630,"","","",null,630,"","","",null,630,"","",""]
[640,"","","",null,640,"","","",null,640,"","",""]
[650,"","","",null,650,"","","",null,650,"","",""]
[660,"","","",null,660,"","","",null,660,"","",""]
[670,"","","",null,670,"","","",null,670,"","",""]
[680,"","","",null,680,"","","",null,680,"","",""]
[690,"","","",null,690,"","","",null,690,"","",""]
[700,"","","",null,700,"","","",null,700,"","",""]
[710,"","","",null,710,"","","",null,710,"","",""]
[720,"","","",null,720,"","","",null,720,"","",""]
[730,"","","",null,730,"","","",null,730,"","",""]
[740,"","","",null,740,"","","",null,740,"","",""]
[750,"","","",null,750,"","","",null,750,"","",""]
[760,"","","",null,760,"","","",null,760,"","",""]
[770,"","","",null,770,"","","",null,770,"","",""]
[780,"","","",null,780,"","","",null,780,"","",""]
[790,"","","",null,790,"","","",null,790,"","",""]
[800,"","","",null,800,"","","",null,800,"","",""]
[810,"","","",null,810,"","","",null,810,"","",""]
[820,"","","",null,820,"","","",null,820,"","",""]
[830,"","","",null,830,"","","",null,830,"","",""]
[840,"","","",null,840,"","","",null,840,"","",""]
[850,"","","",null,850,"","","",null,850,"","",""]
[860,"","","",null,860,"","","",null,860,"","",""]
[870,"","","",null,870,"","","",null,870,"","",""]
[880,"","","",null,880,"","","",null,880,"","",""]
[890,"","","",null,890,"","","",null,890,"","",""]
[900,"","","",null,900,"","","",null,900,"","",""]
[910,"","","",null,910,"","","",null,910,"","",""]
[920,"","","",null,920,"","","",null,920,"","",""]
[930,"","","",null,930,"","","",null,930,"","",""]
[940,"","","",null,940,"","","",null,940,"","",""]
[950,"","","",null,950,"","","",null,950,"","",""]
[960,"","","",null,960,"","","",null,960,"","",""]
[970,"","","",null,970,"","","",null,970,"","",""]
[980,"","","",null,980,"","","",null,980,"","",""]
[990,"","","",null,990,"","","",null,990,"","",""]
[1000,"","","",null,1000,"","","",null,1000,"","",""]
[]
[]
["Saved  20/03/2023: 16:08:17  Level Number: 5"]
[]
["BREAKTHROUGH RESULTS"]
[]
["Advanced"]
["Pollutant Linkage: Inert Restorati, Attenuation Layer, Beenham Grange Formation",null,null,null,null,"Pollutant Linkage: Inert Restorati, Attenuation Layer, Beenham Grange Formation, Groundwater",null,null,null,null,"Pollutant Linkage: Inert Restorati, Attenuation Layer, Beenham Grange Formation, River Enborne"]
["Concentrations in mg/L in Beenham Grange Formation",null,null,null,null,"Concentrations in mg/L in Groundwater",null,null,null,null,"Concentrations in mg/L in River Enborne"]
[]
["Compared with EAL (GW) target concentration in mg/L",null,null,null,null,"Compared with EAL (GW) target concentration in mg/L",null,null,null,null,"Compared with EAL (River Enborne) target concentration in mg/L"]
[null,0.39,2.0000000000000001E-4,5.9999999999999995E-4,null,null,0.39,2.0000000000000001E-4,5.9999999999999995E-4,null,null,0.39,1.1999999999999999E-3,1E-3]
[]
["Time(years)","Species1","Species2","Species3",null,"Time(years)","Species1","Species2","Species3",null,"Time(years)","Species1","Species2","Species3"]
[null,"Ammoniacial Nitrogen","Lead","Antimony",null,null,"Ammoniacial Nitrogen","Lead","Antimony",null,null,"Ammoniacial Nitrogen","Lead","Antimony"]
[10,0,0,6.4720729652301969E-4,null,10,0,0,6.4238614757104913E-4,null,10,0,0,4.6524421493596118E-7]
[20,0,0,7.354419709406485E-4,null,20,0,0,7.3000830908546142E-4,null,20,0,0,5.2965343839828131E-7]
[30,0,0,7.3849276223392245E-4,null,30,0,0,7.330387210232296E-4,null,30,0,0,5.3189795388932502E-7]
[40,0,0,7.3667301545505192E-4,null,40,0,0,7.3123255006494602E-4,null,40,0,0,5.3059027325921402E-7]
[50,0,0,7.3453858293292748E-4,null,50,0,0,7.2911389035077291E-4,null,50,0,0,5.2905315488917172E-7]
[60,0,0,7.3238725483240868E-4,null,60,0,0,7.2697845090400855E-4,null,60,0,0,5.2750367172194482E-7]
[70,0,0,7.3024045084902874E-4,null,70,0,0,7.2484750148936602E-4,null,70,0,0,5.259574322928936E-7]
[80,0,0,7.2809979679344314E-4,null,80,0,0,7.2272265653267032E-4,null,80,0,0,5.2441562119358983E-7]
[90,0,0,7.2596540605096203E-4,null,90,0,0,7.2060402862753363E-4,null,90,0,0,5.2287832116364648E-7]
[100,0,0,7.2383727114568323E-4,null,100,0,0,7.1849161035902735E-4,null,100,0,0,5.213455269058008E-7]
[110,0,0,7.2171537467112176E-4,null,110,0,0,7.1638538444873515E-4,null,110,0,0,5.1981722589405492E-7]
[120,0,0,7.1959969842024093E-4,null,120,0,0,7.1428533282493541E-4,null,120,0,0,5.1829340501101967E-7]
[130,0,0,7.1749022417522948E-4,null,130,0,0,7.1219143740323368E-4,null,130,0,0,5.1677405113789524E-7]
[140,0,0,7.1538693375958141E-4,null,140,0,0,7.1010368014477016E-4,null,140,0,0,5.1525915118253943E-7]
[150,0,0,7.1328980904215064E-4,null,150,0,0,7.0802204304824573E-4,null,150,0,0,5.137486920855089E-7]
[160,0,0,7.1119883195265045E-4,null,160,0,0,7.0594650817714885E-4,null,160,0,0,5.1224266083283795E-7]
[170,0,0,7.0911398447392083E-4,null,170,0,0,7.038770576500656E-4,null,170,0,0,5.1074104444594808E-7]
[180,0,0,7.0703524863622897E-4,null,180,0,0,7.0181367363114449E-4,null,180,0,0,5.0924382998285541E-7]
[190,0,0,7.0496260652263729E-4,null,190,0,0,6.9975633832692003E-4,null,190,0,0,5.0775100454068206E-7]
[200,0,0,7.0289604027151209E-4,null,200,0,0,6.9770503401910434E-4,null,200,0,0,5.0626255525128168E-7]
[210,0,0,7.0083553207100978E-4,null,210,0,0,6.9565974302066361E-4,null,210,0,0,5.0477846928795166E-7]
[220,0,0,6.987810641633478E-4,null,220,0,0,6.9362044770764813E-4,null,220,0,0,5.0329873385988611E-7]
[230,0,1.681763681900398E-40,6.9673261883868205E-4,null,230,0,1.6687421848034363E-40,6.9158713049885024E-4,null,230,0,0,5.0182333621316045E-7]
[240,0,0,6.9469017844607951E-4,null,240,0,0,6.8955977387369035E-4,null,240,0,0,5.003522636315149E-7]
[250,0,0,6.9265372537951025E-4,null,250,0,0,6.8753836035630612E-4,null,250,0,0,4.988855034352314E-7]
[260,0,3.1801700012398479E-38,6.9062324208485413E-4,null,260,0,3.1139949936086491E-38,6.8552287252611943E-4,null,260,0,0,4.9742304298404533E-7]
[270,0,2.3214266732457786E-37,6.885987110665958E-4,null,270,0,2.2831781761904633E-37,6.835132930121064E-4,null,270,0,1.3333503604517863E-40,4.9596486967035123E-7]
[280,0,1.4636146190336242E-36,6.8658011487615536E-4,null,280,0,1.432157229731593E-36,6.8150960449442821E-4,null,280,0,6.9960971128055534E-40,4.9451097093385634E-7]
[290,0,1.0730070765575226E-35,6.845674361079067E-4,null,290,0,1.0522289186686744E-35,6.7951178969799704E-4,null,290,0,5.3129212939858361E-39,4.9306133423261157E-7]
[300,0,6.1577695472575099E-35,6.8256065742397216E-4,null,300,0,6.0572652221632562E-35,6.7751983141621811E-4,null,300,0,3.365495097921896E-38,4.9161594708196147E-7]
[310,0,2.7048555858378426E-34,6.8055976152383831E-4,null,310,0,2.6658514627338223E-34,6.7553371246956314E-4,null,310,0,1.5697110035933973E-37,4.9017479702080624E-7]
[320,0,9.6917865127922054E-34,6.7856473116117337E-4,null,320,0,9.5675720726556292E-34,6.735534157460536E-4,null,320,0,5.8836493124420852E-37,4.887378716280469E-7]
[330,0,2.8529247730161662E-33,6.7657554914662033E-4,null,330,0,2.8223703480956162E-33,6.7157892417677779E-4,null,330,0,1.8349537056110058E-36,4.8730515852048412E-7]
[340,0,6.4517411942001376E-33,6.7459219832782086E-4,null,340,0,6.4043723543018614E-33,6.6961022073956634E-4,null,340,0,4.5468320602378235E-36,4.8587664534635628E-7]
[350,0,8.7471371749907898E-33,6.7261466161946482E-4,null,350,0,8.7600754356494706E-33,6.6764728847350848E-4,null,350,0,7.6242108002191346E-36,4.8445231979912214E-7]
[360,0,0,6.7064292197145593E-4,null,360,0,0,6.65690110459038E-4,null,360,0,1.7742856825680484E-36,4.8303216959894556E-7]
[370,0,0,6.6867696239228879E-4,null,370,0,0,6.6373866982415337E-4,null,370,0,0,4.8161618250577916E-7]
[380,0,0,6.6671676593619156E-4,null,380,0,0,6.6179294974833686E-4,null,380,0,0,4.8020434631724662E-7]
[390,0,0,6.6476231570785065E-4,null,390,0,0,6.5985293346735566E-4,null,390,0,0,4.7879664886188015E-7]
[400,0,0,6.6281359486803813E-4,null,400,0,0,6.5791860426056721E-4,null,400,0,0,4.7739307801357705E-7]
[410,0,0,6.6087058661392728E-4,null,410,0,0,6.5598994545200916E-4,null,410,0,0,4.7599362166865736E-7]
[420,0,0,6.5893327420389169E-4,null,420,0,0,6.5406694042251961E-4,null,420,0,0,4.7459826776868721E-7]
[430,0,5.925988495045534E-30,6.5700164093563231E-4,null,430,0,5.7935324071222345E-30,6.521495725904851E-4,null,430,0,2.3919676023071389E-33,4.7320700428400408E-7]
[440,0,2.3863287508203719E-29,6.55075670173594E-4,null,440,0,2.3544651739383521E-29,6.5023782545075269E-4,null,440,0,1.3998250853479345E-32,4.7181981923290799E-7]
[450,0,5.7920421350799285E-29,6.5315534530124776E-4,null,450,0,5.7343771753338891E-29,6.4833168250230297E-4,null,450,0,3.8018424978910493E-32,4.7043670064719216E-7]
[460,0,1.0649134762628829E-28,6.5124064977838245E-4,null,460,0,1.0570511653204655E-28,6.4643112732990112E-4,null,460,0,7.5607282945448186E-32,4.6905763661452134E-7]
[470,0,1.5038635677157054E-28,6.4933156710221464E-4,null,470,0,1.4973816517823395E-28,6.4453614355278101E-4,null,470,0,1.1650620270950236E-31,4.6768261524819296E-7]
[480,0,1.3943103704134451E-28,6.4742808081520568E-4,null,480,0,1.3978651789413477E-28,6.4264671483331849E-4,null,480,0,1.2826810037636596E-31,4.6631162469288641E-7]
[490,0,0,6.4553017451062737E-4,null,490,0,0,6.4076282488760767E-4,null,490,0,4.6991275151777912E-32,4.6494465313524122E-7]
[500,0,0,6.4363783184146785E-4,null,500,0,0,6.3888445749027086E-4,null,500,0,0,4.6358168879978133E-7]
[510,0,0,6.4175103648326116E-4,null,510,0,0,6.3701159643482757E-4,null,510,0,0,4.6222271992644571E-7]
[520,0,0,6.3986977218592669E-4,null,520,0,0,6.3514422559338417E-4,null,520,0,0,4.6086773481401E-7]
[530,0,0,6.3799402272813558E-4,null,530,0,0,6.3328232886232928E-4,null,530,0,0,4.5951672177732329E-7]
[540,0,0,6.3612377194702968E-4,null,540,0,0,6.3142589019915226E-4,null,540,0,0,4.5816966917594573E-7]
[550,0,0,6.3425900372346704E-4,null,550,0,0,6.2957489360585971E-4,null,550,0,0,4.5682656539926754E-7]
[560,0,0,6.3239970198740827E-4,null,560,0,0,6.2772932312869605E-4,null,560,0,0,4.5548739887434457E-7]
[570,0,5.8992676847191287E-27,6.3054585070436691E-4,null,570,0,5.771173107935664E-27,6.2588916284993191E-4,null,570,0,2.3580458166830945E-30,4.5415215805047937E-7]
[580,0,1.9270312861309284E-26,6.2869743390649559E-4,null,580,0,1.9033096073317669E-26,6.2405439692326105E-4,null,580,0,1.1660749401704084E-29,4.5282083142845404E-7]
[590,0,3.8736214593058707E-26,6.2685443566117558E-4,null,590,0,3.8375221087295064E-26,6.2222500953281379E-4,null,590,0,2.5982033343820929E-29,4.5149340753070219E-7]
[600,0,6.2452513675220567E-26,6.2501684008251597E-4,null,600,0,6.1986113607124351E-26,6.2040098490701685E-4,null,600,0,4.4441937633862503E-29,4.5016987491764382E-7]
[610,0,8.549108672738535E-26,6.2318463133384744E-4,null,610,0,8.4990689590249161E-26,6.1858230732878667E-4,null,610,0,6.390098421425827E-29,4.4885022218101376E-7]
[620,0,9.9211247783958328E-26,6.2135779361877032E-4,null,620,0,9.8818462706251946E-26,6.1676896111989056E-4,null,620,0,7.8341474129957769E-29,4.4753443794548024E-7]
[630,0,9.1378202182117319E-26,6.1953631119972979E-4,null,630,0,9.1312393938064721E-26,6.1496093065724399E-4,null,630,0,7.8752762026786598E-29,4.4622251087477532E-7]
[640,0,4.7406456083341033E-26,6.1772016837426352E-4,null,640,0,4.7955121676403604E-26,6.131582003542391E-4,null,640,0,5.3834734960860277E-29,4.4491442965833842E-7]
[650,0,0,6.1590934949049643E-4,null,650,0,0,6.1136075467659067E-4,null,650,0,0,4.4361018302275714E-7]
[660,0,0,6.1410383894111575E-4,null,660,0,0,6.0956857812864706E-4,null,660,0,0,4.4230975972741138E-7]
[670,0,0,6.1230362116625268E-4,null,670,0,0,6.0778165526570232E-4,null,670,0,0,4.4101314856750666E-7]
[680,0,0,6.1050868064477324E-4,null,680,0,0,6.0599997068379373E-4,null,680,0,0,4.3972033835813403E-7]
[690,0,0,6.0871900191175848E-4,null,690,0,0,6.0422350903324121E-4,null,690,0,0,4.3843131796814659E-7]
[700,2.6932826588953015E-40,0,6.0693456954734825E-4,null,700,2.3326953661063229E-40,0,6.0245225500218567E-4,null,700,0,0,4.3714607628798186E-7]
[710,8.4418686244848501E-40,0,6.0515536816332417E-4,null,710,8.1558495098022215E-40,0,6.0068619332123967E-4,null,710,0,0,4.3586460223217645E-7]
[720,1.5392714898361776E-39,0,6.0338138242764484E-4,null,720,1.5705737393781252E-39,0,5.989253087704615E-4,null,720,0,0,4.3458688476079091E-7]
[730,1.7429505622646067E-39,0,6.016125970511189E-4,null,730,1.9060760527728185E-39,0,5.9716958617218191E-4,null,730,0,0,4.3331291286035194E-7]
[740,3.7323793136599075E-40,0,5.9984899679101057E-4,null,740,7.0269062596371187E-40,0,5.9541901039975021E-4,null,740,0,0,4.320426755506141E-7]
[750,0,1.128010489114298E-24,5.9809056644410995E-4,null,750,0,1.108143068274512E-24,5.9367356635669653E-4,null,750,0,5.4663505208539618E-28,4.3077616188586347E-7]
[760,0,2.7977372498693332E-24,5.9633729085813831E-4,null,760,0,2.7664612577997949E-24,5.9193323901109249E-4,null,760,0,1.762326180979129E-27,4.2951336094827652E-7]
[770,0,4.8591589755510159E-24,5.9458915492006676E-4,null,770,0,4.8158364664551203E-24,5.9019801335145211E-4,null,770,0,3.3097848193208378E-27,4.2825426185660006E-7]
[780,0,7.1651231965771698E-24,5.9284614356270963E-4,null,780,0,7.1106481794826259E-24,5.8846787442825448E-4,null,780,0,5.0939776703637321E-27,4.2699885375472708E-7]
[790,2.459970707716811E-38,9.4743301626898525E-24,5.9110824176887263E-4,null,790,1.7710322034049071E-38,9.4115810438966326E-24,5.8674280733280327E-4,null,790,0,6.946916300825233E-27,4.2574712582793776E-7]
[800,1.0836924199955616E-37,1.1453215898492653E-23,5.8937543455462888E-4,null,800,9.6727395096949423E-38,1.1387390436865608E-23,5.8502279719343706E-4,null,800,0,8.626593298940338E-27,4.2449906728518771E-7]
[810,2.7033397526114445E-37,1.2690635780152291E-23,5.876477069833517E-4,null,810,2.5249846958901405E-37,1.2629394686075148E-23,5.8330782918367217E-4,null,810,0,9.8255532872570476E-27,4.2325466736746859E-7]
[820,5.443922178367966E-37,1.2726473731202515E-23,5.8592504417302857E-4,null,820,5.1703404819289255E-37,1.2679825967019813E-23,5.8159788852947167E-4,null,820,0,1.0190261803973404E-26,4.220139153556448E-7]
[830,9.8440362643986958E-37,1.1093784823553492E-23,5.8420743126840304E-4,null,830,9.3791859566404628E-37,1.1073663666043198E-23,5.7989296048712585E-4,null,830,0,9.3513006083823262E-27,4.207768005493289E-7]
[840,1.7069207634893746E-36,7.3723901439860047E-24,5.8249485346745429E-4,null,840,1.616693171110018E-36,7.3918934967133515E-24,5.7819303036184093E-4,null,840,3.5205415782275468E-40,6.9631152277048098E-27,4.1954331229029731E-7]
[850,2.9854015027823953E-36,1.2501672847331598E-24,5.8078729601284958E-4,null,850,2.7970104407140773E-36,1.322466912616425E-24,5.7649808350809448E-4,null,850,8.2725245494963305E-40,2.7507099962019869E-27,4.1831343994528398E-7]
[860,5.423116014518635E-36,0,5.7908474418358498E-4,null,860,5.0298576524878866E-36,0,5.7480810531261996E-4,null,860,1.4918830469461112E-39,0,4.1708717291799249E-7]
[870,1.0234067379749129E-35,0,5.773871833143155E-4,null,870,9.445153664493757E-36,0,5.7312308121765026E-4,null,870,2.3152987824473581E-39,0,4.1586450063615349E-7]
[880,1.9662061565746712E-35,0,5.7569459876964408E-4,null,880,1.8159281982272394E-35,0,5.7144299669664288E-4,null,880,3.3259792151256053E-39,0,4.1464541256646695E-7]
[890,3.7571274873837881E-35,0,5.7400697595111903E-4,null,890,3.4850225780436503E-35,0,5.6976783726019661E-4,null,890,4.8166315050042224E-39,0,4.134298981945781E-7]
[900,7.0252966471234844E-35,0,5.7232430032886619E-4,null,900,6.5541819267615018E-35,0,5.6809758848033645E-4,null,900,7.7093601490114542E-39,0,4.1221794705056388E-7]
[910,1.2751794811216847E-34,0,5.7064655739205001E-4,null,910,1.1966243144002381E-34,0,5.6643223595960685E-4,null,910,1.4104113238264828E-38,0,4.1100954868256168E-7]
[920,2.24184605491168E-34,0,5.6897373268830669E-4,null,920,2.1148381303634589E-34,0,5.6477176534866285E-4,null,920,2.8009642692721198E-38,0,4.0980469268940917E-7]
[930,3.8211999127478984E-34,0,5.6730581179177707E-4,null,930,3.6209666566779581E-34,0,5.6311616233212897E-4,null,930,5.623899549257539E-38,0,4.0860336867198452E-7]
[940,6.3302464224864305E-34,0,5.6564278033059581E-4,null,940,6.0212014274258546E-34,0,5.6146541263957966E-4,null,940,1.0945964061043594E-37,0,4.074055662812488E-7]
[950,1.0221303015408253E-33,0,5.6398462396938008E-4,null,950,9.7533411525167717E-34,0,5.5981950204097393E-4,null,950,2.0344030596653273E-37,0,4.0621127519312028E-7]
[960,1.6128461641093382E-33,0,5.6233132842223072E-4,null,960,1.5433084107133944E-33,0,5.5817841636366641E-4,null,960,3.606418973975865E-37,0,4.0502048511851269E-7]
[970,2.4920743085664319E-33,0,5.606828794370713E-4,null,970,2.3908120201140424E-33,0,5.5654214145333975E-4,null,970,6.1244733499353474E-37,0,4.0383318579148807E-7]
[980,3.77534872223159E-33,0,5.5903926279799192E-4,null,980,3.631245050505501E-33,0,5.5491066320033616E-4,null,980,1.0024721350274306E-36,0,4.026493669755153E-7]
[990,5.6100797445313722E-33,3.8410932354930614E-23,5.574004643585695E-4,null,990,5.410488154901684E-33,3.766509357742608E-23,5.5328396756465579E-4,null,990,1.5914640170013503E-36,1.7024307751263166E-26,4.0146901847553154E-7]
[1000,8.1739838547389509E-33,9.7100728546027226E-23,5.5576646997859539E-4,null,1000,7.9063806760804754E-33,9.5970087702585549E-23,5.5166204051021841E-4,null,1000,2.4641717413594477E-36,6.0262563730729503E-26,4.0029213011112251E-7]
[]
[]
["Saved  20/03/2023: 16:12:49  Level Number: 5"]
[]
["BREAKTHROUGH RESULTS"]
[]
["Advanced"]
["Pollutant Linkage: Inert Restorati, Attenuation Layer, Beenham Grange Formation",null,null,null,null,"Pollutant Linkage: Inert Restorati, Attenuation Layer, Beenham Grange Formation, Groundwater",null,null,null,null,"Pollutant Linkage: Inert Restorati, Attenuation Layer, Beenham Grange Formation, River Enborne"]
["Concentrations in mg/L in Beenham Grange Formation",null,null,null,null,"Concentrations in mg/L in Groundwater",null,null,null,null,"Concentrations in mg/L in River Enborne"]
[]
["Compared with EAL (GW) target concentration in mg/L",null,null,null,null,"Compared with EAL (GW) target concentration in mg/L",null,null,null,null,"Compared with EAL (River Enborne) target concentration in mg/L"]
[null,0.39,2.0000000000000001E-4,5.9999999999999995E-4,null,null,0.39,2.0000000000000001E-4,5.9999999999999995E-4,null,null,0.39,1.1999999999999999E-3,1E-3]
[]
["Time(years)","Species1","Species2","Species3",null,"Time(years)","Species1","Species2","Species3",null,"Time(years)","Species1","Species2","Species3"]
[null,"Ammoniacial Nitrogen","Lead","Antimony",null,null,"Ammoniacial Nitrogen","Lead","Antimony",null,null,"Ammoniacial Nitrogen","Lead","Antimony"]
[10,0,0,6.4720729652301969E-4,null,10,0,0,6.4238614757104913E-4,null,10,0,0,4.6524421493596118E-7]
[20,0,0,7.354419709406485E-4,null,20,0,0,7.3000830908546142E-4,null,20,0,0,5.2965343839828131E-7]
[30,0,0,7.3849276223392245E-4,null,30,0,0,7.330387210232296E-4,null,30,0,0,5.3189795388932502E-7]
[40,0,0,7.3667301545505192E-4,null,40,0,0,7.3123255006494602E-4,null,40,0,0,5.3059027325921402E-7]
[50,0,0,7.3453858293292748E-4,null,50,0,0,7.2911389035077291E-4,null,50,0,0,5.2905315488917172E-7]
[60,0,0,7.3238725483240868E-4,null,60,0,0,7.2697845090400855E-4,null,60,0,0,5.2750367172194482E-7]
[70,0,0,7.3024045084902874E-4,null,70,0,0,7.2484750148936602E-4,null,70,0,0,5.259574322928936E-7]
[80,0,0,7.2809979679344314E-4,null,80,0,0,7.2272265653267032E-4,null,80,0,0,5.2441562119358983E-7]
[90,0,0,7.2596540605096203E-4,null,90,0,0,7.2060402862753363E-4,null,90,0,0,5.2287832116364648E-7]
[100,0,0,7.2383727114568323E-4,null,100,0,0,7.1849161035902735E-4,null,100,0,0,5.213455269058008E-7]
[110,0,0,7.2171537467112176E-4,null,110,0,0,7.1638538444873515E-4,null,110,0,0,5.1981722589405492E-7]
[120,0,0,7.1959969842024093E-4,null,120,0,0,7.1428533282493541E-4,null,120,0,0,5.1829340501101967E-7]
[130,0,0,7.1749022417522948E-4,null,130,0,0,7.1219143740323368E-4,null,130,0,0,5.1677405113789524E-7]
[140,0,0,7.1538693375958141E-4,null,140,0,0,7.1010368014477016E-4,null,140,0,0,5.1525915118253943E-7]
[150,0,0,7.1328980904215064E-4,null,150,0,0,7.0802204304824573E-4,null,150,0,0,5.137486920855089E-7]
[160,0,0,7.1119883195265045E-4,null,160,0,0,7.0594650817714885E-4,null,160,0,0,5.1224266083283795E-7]
[170,0,0,7.0911398447392083E-4,null,170,0,0,7.038770576500656E-4,null,170,0,0,5.1074104444594808E-7]
[180,0,0,7.0703524863622897E-4,null,180,0,0,7.0181367363114449E-4,null,180,0,0,5.0924382998285541E-7]
[190,0,0,7.0496260652263729E-4,null,190,0,0,6.9975633832692003E-4,null,190,0,0,5.0775100454068206E-7]
[200,0,0,7.0289604027151209E-4,null,200,0,0,6.9770503401910434E-4,null,200,0,0,5.0626255525128168E-7]
[210,0,0,7.0083553207100978E-4,null,210,0,0,6.9565974302066361E-4,null,210,0,0,5.0477846928795166E-7]
[220,0,0,6.987810641633478E-4,null,220,0,0,6.9362044770764813E-4,null,220,0,0,5.0329873385988611E-7]
[230,0,1.681763681900398E-40,6.9673261883868205E-4,null,230,0,1.6687421848034363E-40,6.9158713049885024E-4,null,230,0,0,5.0182333621316045E-7]
[240,0,0,6.9469017844607951E-4,null,240,0,0,6.8955977387369035E-4,null,240,0,0,5.003522636315149E-7]
[250,0,0,6.9265372537951025E-4,null,250,0,0,6.8753836035630612E-4,null,250,0,0,4.988855034352314E-7]
[260,0,3.1801700012398479E-38,6.9062324208485413E-4,null,260,0,3.1139949936086491E-38,6.8552287252611943E-4,null,260,0,0,4.9742304298404533E-7]
[270,0,2.3214266732457786E-37,6.885987110665958E-4,null,270,0,2.2831781761904633E-37,6.835132930121064E-4,null,270,0,1.3333503604517863E-40,4.9596486967035123E-7]
[280,0,1.4636146190336242E-36,6.8658011487615536E-4,null,280,0,1.432157229731593E-36,6.8150960449442821E-4,null,280,0,6.9960971128055534E-40,4.9451097093385634E-7]
[290,0,1.0730070765575226E-35,6.845674361079067E-4,null,290,0,1.0522289186686744E-35,6.7951178969799704E-4,null,290,0,5.3129212939858361E-39,4.9306133423261157E-7]
[300,0,6.1577695472575099E-35,6.8256065742397216E-4,null,300,0,6.0572652221632562E-35,6.7751983141621811E-4,null,300,0,3.365495097921896E-38,4.9161594708196147E-7]
[310,0,2.7048555858378426E-34,6.8055976152383831E-4,null,310,0,2.6658514627338223E-34,6.7553371246956314E-4,null,310,0,1.5697110035933973E-37,4.9017479702080624E-7]
[320,0,9.6917865127922054E-34,6.7856473116117337E-4,null,320,0,9.5675720726556292E-34,6.735534157460536E-4,null,320,0,5.8836493124420852E-37,4.887378716280469E-7]
[330,0,2.8529247730161662E-33,6.7657554914662033E-4,null,330,0,2.8223703480956162E-33,6.7157892417677779E-4,null,330,0,1.8349537056110058E-36,4.8730515852048412E-7]
[340,0,6.4517411942001376E-33,6.7459219832782086E-4,null,340,0,6.4043723543018614E-33,6.6961022073956634E-4,null,340,0,4.5468320602378235E-36,4.8587664534635628E-7]
[350,0,8.7471371749907898E-33,6.7261466161946482E-4,null,350,0,8.7600754356494706E-33,6.6764728847350848E-4,null,350,0,7.6242108002191346E-36,4.8445231979912214E-7]
[360,0,0,6.7064292197145593E-4,null,360,0,0,6.65690110459038E-4,null,360,0,1.7742856825680484E-36,4.8303216959894556E-7]
[370,0,0,6.6867696239228879E-4,null,370,0,0,6.6373866982415337E-4,null,370,0,0,4.8161618250577916E-7]
[380,0,0,6.6671676593619156E-4,null,380,0,0,6.6179294974833686E-4,null,380,0,0,4.8020434631724662E-7]
[390,0,0,6.6476231570785065E-4,null,390,0,0,6.5985293346735566E-4,null,390,0,0,4.7879664886188015E-7]
[400,0,0,6.6281359486803813E-4,null,400,0,0,6.5791860426056721E-4,null,400,0,0,4.7739307801357705E-7]
[410,0,0,6.6087058661392728E-4,null,410,0,0,6.5598994545200916E-4,null,410,0,0,4.7599362166865736E-7]
[420,0,0,6.5893327420389169E-4,null,420,0,0,6.5406694042251961E-4,null,420,0,0,4.7459826776868721E-7]
[430,0,5.925988495045534E-30,6.5700164093563231E-4,null,430,0,5.7935324071222345E-30,6.521495725904851E-4,null,430,0,2.3919676023071389E-33,4.7320700428400408E-7]
[440,0,2.3863287508203719E-29,6.55075670173594E-4,null,440,0,2.3544651739383521E-29,6.5023782545075269E-4,null,440,0,1.3998250853479345E-32,4.7181981923290799E-7]
[450,0,5.7920421350799285E-29,6.5315534530124776E-4,null,450,0,5.7343771753338891E-29,6.4833168250230297E-4,null,450,0,3.8018424978910493E-32,4.7043670064719216E-7]
[460,0,1.0649134762628829E-28,6.5124064977838245E-4,null,460,0,1.0570511653204655E-28,6.4643112732990112E-4,null,460,0,7.5607282945448186E-32,4.6905763661452134E-7]
[470,0,1.5038635677157054E-28,6.4933156710221464E-4,null,470,0,1.4973816517823395E-28,6.4453614355278101E-4,null,470,0,1.1650620270950236E-31,4.6768261524819296E-7]
[480,0,1.3943103704134451E-28,6.4742808081520568E-4,null,480,0,1.3978651789413477E-28,6.4264671483331849E-4,null,480,0,1.2826810037636596E-31,4.6631162469288641E-7]
[490,0,0,6.4553017451062737E-4,null,490,0,0,6.4076282488760767E-4,null,490,0,4.6991275151777912E-32,4.6494465313524122E-7]
[500,0,0,6.4363783184146785E-4,null,500,0,0,6.3888445749027086E-4,null,500,0,0,4.6358168879978133E-7]
[510,0,0,6.4175103648326116E-4,null,510,0,0,6.3701159643482757E-4,null,510,0,0,4.6222271992644571E-7]
[520,0,0,6.3986977218592669E-4,null,520,0,0,6.3514422559338417E-4,null,520,0,0,4.6086773481401E-7]
[530,0,0,6.3799402272813558E-4,null,530,0,0,6.3328232886232928E-4,null,530,0,0,4.5951672177732329E-7]
[540,0,0,6.3612377194702968E-4,null,540,0,0,6.3142589019915226E-4,null,540,0,0,4.5816966917594573E-7]
[550,0,0,6.3425900372346704E-4,null,550,0,0,6.2957489360585971E-4,null,550,0,0,4.5682656539926754E-7]
[560,0,0,6.3239970198740827E-4,null,560,0,0,6.2772932312869605E-4,null,560,0,0,4.5548739887434457E-7]
[570,0,5.8992676847191287E-27,6.3054585070436691E-4,null,570,0,5.771173107935664E-27,6.2588916284993191E-4,null,570,0,2.3580458166830945E-30,4.5415215805047937E-7]
[580,0,1.9270312861309284E-26,6.2869743390649559E-4,null,580,0,1.9033096073317669E-26,6.2405439692326105E-4,null,580,0,1.1660749401704084E-29,4.5282083142845404E-7]
[590,0,3.8736214593058707E-26,6.2685443566117558E-4,null,590,0,3.8375221087295064E-26,6.2222500953281379E-4,null,590,0,2.5982033343820929E-29,4.5149340753070219E-7]
[600,0,6.2452513675220567E-26,6.2501684008251597E-4,null,600,0,6.1986113607124351E-26,6.2040098490701685E-4,null,600,0,4.4441937633862503E-29,4.5016987491764382E-7]
[610,0,8.549108672738535E-26,6.2318463133384744E-4,null,610,0,8.4990689590249161E-26,6.1858230732878667E-4,null,610,0,6.390098421425827E-29,4.4885022218101376E-7]
[620,0,9.9211247783958328E-26,6.2135779361877032E-4,null,620,0,9.8818462706251946E-26,6.1676896111989056E-4,null,620,0,7.8341474129957769E-29,4.4753443794548024E-7]
[630,0,9.1378202182117319E-26,6.1953631119972979E-4,null,630,0,9.1312393938064721E-26,6.1496093065724399E-4,null,630,0,7.8752762026786598E-29,4.4622251087477532E-7]
[640,0,4.7406456083341033E-26,6.1772016837426352E-4,null,640,0,4.7955121676403604E-26,6.131582003542391E-4,null,640,0,5.3834734960860277E-29,4.4491442965833842E-7]
[650,0,0,6.1590934949049643E-4,null,650,0,0,6.1136075467659067E-4,null,650,0,0,4.4361018302275714E-7]
[660,0,0,6.1410383894111575E-4,null,660,0,0,6.0956857812864706E-4,null,660,0,0,4.4230975972741138E-7]
[670,0,0,6.1230362116625268E-4,null,670,0,0,6.0778165526570232E-4,null,670,0,0,4.4101314856750666E-7]
[680,0,0,6.1050868064477324E-4,null,680,0,0,6.0599997068379373E-4,null,680,0,0,4.3972033835813403E-7]
[690,0,0,6.0871900191175848E-4,null,690,0,0,6.0422350903324121E-4,null,690,0,0,4.3843131796814659E-7]
[700,2.6932826588953015E-40,0,6.0693456954734825E-4,null,700,2.3326953661063229E-40,0,6.0245225500218567E-4,null,700,0,0,4.3714607628798186E-7]
[710,8.4418686244848501E-40,0,6.0515536816332417E-4,null,710,8.1558495098022215E-40,0,6.0068619332123967E-4,null,710,0,0,4.3586460223217645E-7]
[720,1.5392714898361776E-39,0,6.0338138242764484E-4,null,720,1.5705737393781252E-39,0,5.989253087704615E-4,null,720,0,0,4.3458688476079091E-7]
[730,1.7429505622646067E-39,0,6.016125970511189E-4,null,730,1.9060760527728185E-39,0,5.9716958617218191E-4,null,730,0,0,4.3331291286035194E-7]
[740,3.7323793136599075E-40,0,5.9984899679101057E-4,null,740,7.0269062596371187E-40,0,5.9541901039975021E-4,null,740,0,0,4.320426755506141E-7]
[750,0,1.128010489114298E-24,5.9809056644410995E-4,null,750,0,1.108143068274512E-24,5.9367356635669653E-4,null,750,0,5.4663505208539618E-28,4.3077616188586347E-7]
[760,0,2.7977372498693332E-24,5.9633729085813831E-4,null,760,0,2.7664612577997949E-24,5.9193323901109249E-4,null,760,0,1.762326180979129E-27,4.2951336094827652E-7]
[770,0,4.8591589755510159E-24,5.9458915492006676E-4,null,770,0,4.8158364664551203E-24,5.9019801335145211E-4,null,770,0,3.3097848193208378E-27,4.2825426185660006E-7]
[780,0,7.1651231965771698E-24,5.9284614356270963E-4,null,780,0,7.1106481794826259E-24,5.8846787442825448E-4,null,780,0,5.0939776703637321E-27,4.2699885375472708E-7]
[790,2.459970707716811E-38,9.4743301626898525E-24,5.9110824176887263E-4,null,790,1.7710322034049071E-38,9.4115810438966326E-24,5.8674280733280327E-4,null,790,0,6.946916300825233E-27,4.2574712582793776E-7]
[800,1.0836924199955616E-37,1.1453215898492653E-23,5.8937543455462888E-4,null,800,9.6727395096949423E-38,1.1387390436865608E-23,5.8502279719343706E-4,null,800,0,8.626593298940338E-27,4.2449906728518771E-7]
[810,2.7033397526114445E-37,1.2690635780152291E-23,5.876477069833517E-4,null,810,2.5249846958901405E-37,1.2629394686075148E-23,5.8330782918367217E-4,null,810,0,9.8255532872570476E-27,4.2325466736746859E-7]
[820,5.443922178367966E-37,1.2726473731202515E-23,5.8592504417302857E-4,null,820,5.1703404819289255E-37,1.2679825967019813E-23,5.8159788852947167E-4,null,820,0,1.0190261803973404E-26,4.220139153556448E-7]
[830,9.8440362643986958E-37,1.1093784823553492E-23,5.8420743126840304E-4,null,830,9.3791859566404628E-37,1.1073663666043198E-23,5.7989296048712585E-4,null,830,0,9.3513006083823262E-27,4.207768005493289E-7]
[840,1.7069207634893746E-36,7.3723901439860047E-24,5.8249485346745429E-4,null,840,1.616693171110018E-36,7.3918934967133515E-24,5.7819303036184093E-4,null,840,3.5205415782275468E-40,6.9631152277048098E-27,4.1954331229029731E-7]
[850,2.9854015027823953E-36,1.2501672847331598E-24,5.8078729601284958E-4,null,850,2.7970104407140773E-36,1.322466912616425E-24,5.7649808350809448E-4,null,850,8.2725245494963305E-40,2.7507099962019869E-27,4.1831343994528398E-7]
[860,5.423116014518635E-36,0,5.7908474418358498E-4,null,860,5.0298576524878866E-36,0,5.7480810531261996E-4,null,860,1.4918830469461112E-39,0,4.1708717291799249E-7]
[870,1.0234067379749129E-35,0,5.773871833143155E-4,null,870,9.445153664493757E-36,0,5.7312308121765026E-4,null,870,2.3152987824473581E-39,0,4.1586450063615349E-7]
[880,1.9662061565746712E-35,0,5.7569459876964408E-4,null,880,1.8159281982272394E-35,0,5.7144299669664288E-4,null,880,3.3259792151256053E-39,0,4.1464541256646695E-7]
[890,3.7571274873837881E-35,0,5.7400697595111903E-4,null,890,3.4850225780436503E-35,0,5.6976783726019661E-4,null,890,4.8166315050042224E-39,0,4.134298981945781E-7]
[900,7.0252966471234844E-35,0,5.7232430032886619E-4,null,900,6.5541819267615018E-35,0,5.6809758848033645E-4,null,900,7.7093601490114542E-39,0,4.1221794705056388E-7]
[910,1.2751794811216847E-34,0,5.7064655739205001E-4,null,910,1.1966243144002381E-34,0,5.6643223595960685E-4,null,910,1.4104113238264828E-38,0,4.1100954868256168E-7]
[920,2.24184605491168E-34,0,5.6897373268830669E-4,null,920,2.1148381303634589E-34,0,5.6477176534866285E-4,null,920,2.8009642692721198E-38,0,4.0980469268940917E-7]
[930,3.8211999127478984E-34,0,5.6730581179177707E-4,null,930,3.6209666566779581E-34,0,5.6311616233212897E-4,null,930,5.623899549257539E-38,0,4.0860336867198452E-7]
[940,6.3302464224864305E-34,0,5.6564278033059581E-4,null,940,6.0212014274258546E-34,0,5.6146541263957966E-4,null,940,1.0945964061043594E-37,0,4.074055662812488E-7]
[950,1.0221303015408253E-33,0,5.6398462396938008E-4,null,950,9.7533411525167717E-34,0,5.5981950204097393E-4,null,950,2.0344030596653273E-37,0,4.0621127519312028E-7]
[960,1.6128461641093382E-33,0,5.6233132842223072E-4,null,960,1.5433084107133944E-33,0,5.5817841636366641E-4,null,960,3.606418973975865E-37,0,4.0502048511851269E-7]
[970,2.4920743085664319E-33,0,5.606828794370713E-4,null,970,2.3908120201140424E-33,0,5.5654214145333975E-4,null,970,6.1244733499353474E-37,0,4.0383318579148807E-7]
[980,3.77534872223159E-33,0,5.5903926279799192E-4,null,980,3.631245050505501E-33,0,5.5491066320033616E-4,null,980,1.0024721350274306E-36,0,4.026493669755153E-7]
[990,5.6100797445313722E-33,3.8410932354930614E-23,5.574004643585695E-4,null,990,5.410488154901684E-33,3.766509357742608E-23,5.5328396756465579E-4,null,990,1.5914640170013503E-36,1.7024307751263166E-26,4.0146901847553154E-7]
[1000,8.1739838547389509E-33,9.7100728546027226E-23,5.5576646997859539E-4,null,1000,7.9063806760804754E-33,9.5970087702585549E-23,5.5166204051021841E-4,null,1000,2.4641717413594477E-36,6.0262563730729503E-26,4.0029213011112251E-7]
[]
[]
["Saved  20/03/2023: 16:20:21  Level Number: 5"]
[]
["BREAKTHROUGH RESULTS"]
[]
["Advanced"]
["Pollutant Linkage: Inert Restorati, Attenuation Layer, Beenham Grange Formation",null,null,null,null,"Pollutant Linkage: Inert Restorati, Attenuation Layer, Beenham Grange Formation, Groundwater",null,null,null,null,"Pollutant Linkage: Inert Restorati, Attenuation Layer, Beenham Grange Formation, River Enborne"]
["Concentrations in mg/L in Beenham Grange Formation",null,null,null,null,"Concentrations in mg/L in Groundwater",null,null,null,null,"Concentrations in mg/L in River Enborne"]
[]
["Compared with EAL (GW) target concentration in mg/L",null,null,null,null,"Compared with EAL (GW) target concentration in mg/L",null,null,null,null,"Compared with EAL (River Enborne) target concentration in mg/L"]
[null,0.39,2.0000000000000001E-4,5.9999999999999995E-4,null,null,0.39,2.0000000000000001E-4,5.9999999999999995E-4,null,null,0.39,1.1999999999999999E-3,1E-3]
[]
["Time(years)","Species1","Species2","Species3",null,"Time(years)","Species1","Species2","Species3",null,"Time(years)","Species1","Species2","Species3"]
[null,"Ammoniacial Nitrogen","Lead","Antimony",null,null,"Ammoniacial Nitrogen","Lead","Antimony",null,null,"Ammoniacial Nitrogen","Lead","Antimony"]
[10,1.8183524512411988E-10,0,0,null,10,1.7999169800012488E-10,0,0,null,10,1.2052505066453402E-13,0,0]
[20,2.0340177599277798E-6,0,0,null,20,2.0175810657940487E-6,0,0,null,20,1.4344955230198636E-9,0,0]
[30,4.6268906496909036E-5,0,0,null,30,4.591288050325082E-5,0,0,null,30,3.3014664701698267E-8,0,0]
[40,2.1951974074953736E-4,0,0,null,40,2.1786056274742351E-4,0,0,null,40,1.572841030451994E-7,0,0]
[50,5.533062234053264E-4,0,0,null,50,5.4915943002575331E-4,0,0,null,50,3.9720352469949924E-7,0,0]
[60,1.0144577100888817E-3,0,0,null,60,1.0068900357001465E-3,0,0,null,60,7.2901766190428172E-7,0,0]
[70,1.5495133330257213E-3,0,0,null,70,1.5379867977982772E-3,0,0,null,70,1.114231605701122E-6,0,0]
[80,2.1110651695121409E-3,0,0,null,80,2.0953901633834586E-3,0,0,null,80,1.5186617385297362E-6,0,0]
[90,2.6651538725798569E-3,0,0,null,90,2.6453895562696126E-3,0,0,null,90,1.9178046737818948E-6,0,0]
[100,3.1904310669537616E-3,0,0,null,100,3.1667926117300276E-3,0,0,null,100,2.2962482308305458E-6,0,0]
[110,3.6750966897815297E-3,0,0,null,110,3.647885236571587E-3,0,0,null,110,2.6454677655391354E-6,0,0]
[120,4.1138879581358234E-3,0,0,null,120,4.0834427381895274E-3,0,0,null,120,2.96165582936236E-6,0,0]
[130,4.5057332403111707E-3,0,0,null,130,4.4724009158572005E-3,0,0,null,130,3.2440300447428851E-6,0,0]
[140,4.8520918917205223E-3,0,0,null,140,4.81620806515126E-3,0,0,null,140,3.4936353626064536E-6,0,0]
[150,5.1558396554440607E-3,0,0,null,150,5.1177185413069917E-3,0,0,null,150,3.7125397726860902E-6,0,0]
[160,5.4205468860145751E-3,0,0,null,160,5.3804762654670055E-3,0,0,null,160,3.9033133970873737E-6,0,0]
[170,5.650025928939908E-3,0,0,null,170,5.6082654145719665E-3,0,0,null,170,4.0687017852046767E-6,0,0]
[180,5.848057601349833E-3,0,0,null,180,5.804838900736139E-3,0,0,null,180,4.2114284474982328E-6,0,0]
[190,6.0182344128335502E-3,0,0,null,190,5.9737627361955122E-3,0,0,null,190,4.3340816357026055E-6,0,0]
[200,6.1638785082694676E-3,0,0,null,200,6.1183345734370943E-3,0,0,null,200,4.439055051183038E-6,0,0]
[210,6.288006489830438E-3,0,0,null,210,6.2415487815992987E-3,0,0,null,210,4.5285223901887969E-6,0,0]
[220,6.3933228852965244E-3,0,0,null,220,6.3460899597746036E-3,0,0,null,220,4.6044325686251805E-6,0,0]
[230,6.4822304449963768E-3,0,1.1211757879335995E-40,null,230,6.4343431560496336E-3,0,1.1124947898689582E-40,null,230,4.6685170979596933E-6,0,0]
[240,6.5568496923342247E-3,0,0,null,240,6.5084132726761761E-3,0,0,null,240,4.7223041453317538E-6,0,0]
[250,6.6190429407223588E-3,0,0,null,250,6.5701489052173677E-3,0,0,null,250,4.7671358226897916E-6,0,0]
[260,6.6704398116954854E-3,0,2.1201133341598986E-38,null,260,6.6211676721270249E-3,0,2.0759966624057668E-38,null,260,4.8041865645460775E-6,0,0]
[270,6.7124624725406201E-3,0,1.5476177821638529E-37,null,270,6.6628812661172184E-3,0,1.5221187841269767E-37,null,270,4.8344813080704448E-6,0,0]
[280,6.7463495749899294E-3,0,9.7574307935574954E-37,null,280,6.6965192162886031E-3,0,9.5477148648772836E-37,null,280,4.8589127400263574E-6,0,4.66406474187037E-40]
[290,6.7731783632440376E-3,0,7.1533805103834905E-36,null,290,6.7231508331732333E-3,0,7.0148594577911633E-36,null,290,4.8782572263222749E-6,0,3.5419475293238903E-39]
[300,6.7938847251877883E-3,0,4.1051796981716747E-35,null,300,6.7437051121649726E-3,0,4.0381768147755049E-35,null,300,4.8931892605457319E-6,0,2.2436633986145991E-38]
[310,6.8092811479370302E-3,0,1.803237057225229E-34,null,310,6.7589885567639106E-3,0,1.7772343084892161E-34,null,310,4.9042944030279486E-6,0,1.0464740023955986E-37]
[320,6.8200726494452545E-3,0,6.4611910085281378E-34,null,320,6.7697009928143698E-3,0,6.3783813817704195E-34,null,320,4.91208076181584E-6,0,3.9224328749613907E-37]
[330,6.8268708187005939E-3,0,1.9019498486774444E-33,null,330,6.7764495052685366E-3,0,1.8815802320637456E-33,null,330,4.9169891108891248E-6,0,1.223302470407338E-36]
[340,6.8302061267958578E-3,0,4.3011607961334267E-33,null,340,6.7797606585788461E-3,0,4.2695815695345759E-33,null,340,4.9194017624408435E-6,0,3.0312213734918823E-36]
[350,6.8305386809823987E-3,0,5.8314247833271948E-33,null,350,6.780091171552774E-3,0,5.8400502904329818E-33,null,350,4.9196503171589497E-6,0,5.0828072001460917E-36]
[360,6.8282675918988119E-3,0,0,null,360,6.7778372155782446E-3,0,0,null,360,4.9180224151259265E-6,0,1.1828571217120301E-36]
[370,6.8237391154467881E-3,0,0,null,370,6.7733424965444365E-3,0,0,null,370,4.9147676036606267E-6,0,0]
[380,6.817253718361312E-3,0,0,null,380,6.7669052683854373E-3,0,0,null,380,4.9101024295021085E-6,0,0]
[390,6.8090722026918375E-3,0,0,null,390,6.758784412447187E-3,0,0,null,390,4.9042148527641962E-6,0,0]
[400,6.7994210101256416E-3,0,0,null,400,6.7492047027542532E-3,0,0,null,400,4.8972680698021349E-6,0,0]
[410,6.7884968134079883E-3,0,0,null,410,6.7383613636145638E-3,0,0,null,410,4.8894038223018917E-6,0,0]
[420,6.7764704893074051E-3,0,0,null,420,6.7264240133324219E-3,0,0,null,420,4.8807452606435392E-6,0,0]
[430,6.7634905557685124E-3,0,3.9506589966970248E-30,null,430,6.713540076041611E-3,0,3.8623549380814927E-30,null,430,4.871399421088243E-6,0,1.5946450682047603E-33]
[440,6.7496861453852468E-3,0,1.5908858338802482E-29,null,440,6.699837733303197E-3,0,1.5696434492922362E-29,null,440,4.8614593688034031E-6,0,9.3321672356529017E-33]
[450,6.7351695778442057E-3,0,3.8613614233866188E-29,null,450,6.6854284775688258E-3,0,3.822918116889263E-29,null,450,4.851006051842369E-6,0,2.5345616652606988E-32]
[460,6.7200385858728322E-3,0,7.0994231750858836E-29,null,460,6.6704093217718578E-3,0,7.0470077688031019E-29,null,460,4.8401099054246865E-6,0,5.040485529696545E-32]
[470,6.7043782415697282E-3,0,1.0025757118104697E-28,null,470,6.6548647114514411E-3,0,9.9825443452155814E-29,null,470,4.8288322402350062E-6,0,7.7670801806334848E-32]
[480,6.6882626241242388E-3,0,9.295402469422978E-29,null,480,6.6388681801939119E-3,0,9.3191011929423314E-29,null,480,4.8172264443940482E-6,0,8.5512066917577354E-32]
[490,6.6717562638610676E-3,0,0,null,490,6.6224837830547844E-3,0,0,null,490,4.8053390241690615E-6,0,3.1327516767851925E-32]
[500,6.6549153932748233E-3,0,0,null,500,6.6057673383631286E-3,0,0,null,500,4.7932105056143051E-6,0,0]
[510,6.6377890310340771E-3,0,0,null,510,6.5887675037546731E-3,0,0,null,510,4.7808762158116194E-6,0,0]
[520,6.620419921823429E-3,0,0,null,520,6.5715267090848241E-3,0,0,null,520,4.7683669602320112E-6,0,0]
[530,6.6028453513697367E-3,0,0,null,530,6.5540819654584925E-3,0,0,null,530,4.7557096101056385E-6,0,0]
[540,6.5850978536366993E-3,0,0,null,540,6.536465567214436E-3,0,0,null,540,4.7429276121219742E-6,0,0]
[550,6.567205824650116E-3,0,0,null,550,6.5187057012325335E-3,0,0,null,550,4.7300414307947983E-6,0,0]
[560,6.5491940555569856E-3,0,0,null,560,6.5008269760623251E-3,0,0,null,560,4.7170689326471515E-6,0,0]
[570,6.5310841957089737E-3,0,3.9328451231460667E-27,null,570,6.482850881586487E-3,0,3.8474487386237841E-27,null,570,4.7040257199446772E-6,0,1.5720305444554073E-30]
[580,6.5128951551701548E-3,0,1.2846875240872811E-26,null,580,6.4647961886003516E-3,0,1.2688730715545102E-26,null,580,4.6909254208004984E-6,0,7.7738329344693842E-30]
[590,6.4946434547242466E-3,0,2.582414306203923E-26,null,590,6.4466792961954929E-3,0,2.5583480724863384E-26,null,590,4.6777799413990189E-6,0,1.7321355562547271E-29]
[600,6.4763435302727882E-3,0,4.1635009116813922E-26,null,600,6.4285145339453972E-3,0,4.1324075738083096E-26,null,600,4.6645996853915899E-6,0,2.9627958422575129E-29]
[610,6.458007997834983E-3,0,5.6994057818256824E-26,null,610,6.4103144249425719E-3,0,5.6660459726832559E-26,null,610,4.6513937448730498E-6,0,4.2600656142839065E-29]
[620,6.4396478842101311E-3,0,6.6140831855972337E-26,null,620,6.3920899147712658E-3,0,6.5878975137501787E-26,null,620,4.6381700666124653E-6,0,5.2227649419971988E-29]
[630,6.4212728279275152E-3,0,6.0918801454745488E-26,null,630,6.3738505709672166E-3,0,6.0874929292043664E-26,null,630,4.6249355968912637E-6,0,5.2501841351191136E-29]
[640,6.4028912543292E-3,0,3.160430405556048E-26,null,640,6.3556047568126533E-3,0,3.1970081117601947E-26,null,640,4.6116964076603219E-6,0,3.5889823307239764E-29]
[650,6.3845105281927425E-3,0,0,null,650,6.3373597828447871E-3,0,0,null,650,4.5984578065601841E-6,0,0]
[660,6.3661370868227278E-3,0,0,null,660,6.3191220389417204E-3,0,0,null,660,4.5852244328106676E-6,0,0]
[670,6.3477765562048359E-3,0,0,null,670,6.3008971096569751E-3,0,0,null,670,4.5720003409474965E-6,0,0]
[680,6.3294338523469914E-3,0,0,null,680,6.2826898747862566E-3,0,0,null,680,4.5587890738259341E-6,0,0]
[690,6.3111132697590815E-3,0,0,null,690,6.2645045972173448E-3,0,0,null,690,4.5455937264280384E-6,0,0]
[700,6.2928185587669072E-3,0,0,null,700,6.2463449996413619E-3,0,0,null,700,4.5324170015462238E-6,0,0]
[710,6.2745529930170333E-3,1.2662802936727277E-40,0,null,710,6.228214331599158E-3,1.2233774264703328E-40,0,null,710,4.5192612584272755E-6,0,0]
[720,6.2563194285196596E-3,2.3089072347542659E-40,0,null,720,6.2101154280663319E-3,2.3558606090671879E-40,0,null,720,4.5061285553688908E-6,0,0]
[730,6.2381203552690839E-3,2.6144258433969098E-40,0,null,730,6.1920507606930564E-3,2.8591140791592287E-40,0,null,730,4.4930206868763834E-6,0,0]
[740,6.2199579423802102E-3,0,0,null,740,6.1740224826285382E-3,1.0540359389455673E-40,0,null,740,4.4799392162048643E-6,0,0]
[750,6.2018340775856695E-3,0,7.5200699274293378E-25,null,750,6.1560324676897243E-3,0,7.3876204551634781E-25,null,750,4.4668855038406649E-6,0,3.6442336805704274E-28]
[760,6.1837504018134645E-3,0,1.865158166579685E-24,null,760,6.1380823447365271E-3,0,1.8443075052000223E-24,null,760,4.453860732389947E-6,0,1.174884120652767E-27]
[770,6.1657083394712382E-3,0,3.2394393170339669E-24,null,770,6.1201735276656209E-3,0,3.210557644303462E-24,null,770,4.4408659284377155E-6,0,2.206523212880542E-27]
[780,6.147709124941933E-3,0,4.7767487977177762E-24,null,780,6.1023072417859823E-3,0,4.74043211965513E-24,null,780,4.4279019816038802E-6,0,3.3959851135757224E-27]
[790,6.1297538258315888E-3,3.6899560615752116E-39,6.3162201084595542E-24,null,790,6.0844845468315117E-3,2.656548305107361E-39,6.2743873625978435E-24,null,790,4.4149696613315728E-6,0,4.6312775338833605E-27]
[800,6.1118433632818825E-3,1.6255386299933437E-38,7.6354772656613355E-24,null,800,6.0667063571667136E-3,1.4509109264542423E-38,7.5915936245768887E-24,null,800,4.40206963151188E-6,0,5.7510621992938739E-27]
[810,6.0939785298801431E-3,4.0550096289171704E-38,8.4604238534342175E-24,null,810,6.0489734595450617E-3,3.7874770438352124E-38,8.4195964573825941E-24,null,810,4.3892024633909273E-6,0,6.5503688581710728E-27]
[820,6.0761600052500336E-3,8.1658832675519501E-38,8.4843158208015787E-24,null,820,6.0312865285839295E-3,7.7555107228933863E-38,8.4532173113460221E-24,null,820,4.3763686468046111E-6,0,6.7935078693160018E-27]
[830,6.0583883698187976E-3,1.4766054396598043E-37,7.3958565490336097E-24,null,830,6.0136461404343856E-3,1.4068778934960686E-37,7.3824424440278307E-24,null,830,4.3635686000955526E-6,0,6.2342004055886429E-27]
[840,6.0406641168347609E-3,2.5603811452340619E-37,4.9149267626566194E-24,null,840,5.9960527847168132E-3,2.425039756665026E-37,4.9279289978088929E-24,null,840,4.350802678799099E-6,0,4.642076818470059E-27]
[850,6.0229876629439615E-3,4.4781022541735938E-37,8.3344485648524287E-25,null,850,5.9785068750093885E-3,4.1955156610711163E-37,8.8164460841069801E-25,null,850,4.3380711832171108E-6,1.2408786824244492E-40,1.8338066641316614E-27]
[860,6.0053593574733175E-3,8.1346740217779522E-37,0,null,860,5.9610087580708251E-3,7.5447864787318306E-37,0,null,860,4.325374365173542E-6,2.2378245704191679E-40,0]
[870,5.9877794905862734E-3,1.5351101069623706E-36,0,null,870,5.943558721931857E-3,1.4167730496740646E-36,0,null,870,4.3127124338152852E-6,3.4729481736710367E-40,0]
[880,5.9702483003839088E-3,2.9493092348620056E-36,0,null,880,5.9261570029333988E-3,2.7238922973408591E-36,0,null,880,4.3000855608015573E-6,4.988968822688404E-40,0]
[890,5.9527659792688011E-3,5.6356912310756855E-36,0,null,890,5.9088037920752099E-3,5.2275338670654744E-36,0,null,890,4.2874938848552257E-6,7.2249472575063342E-40,0]
[900,5.9353326794298516E-3,1.0537944970685229E-35,0,null,900,5.8914992404136566E-3,9.8312728901422486E-36,0,null,900,4.2749375156976089E-6,1.156404022351718E-39,0]
[910,5.9179485177072808E-3,1.9127692216825272E-35,0,null,910,5.8742434639469229E-3,1.7949364716003572E-35,0,null,910,4.2624165375887745E-6,2.1156169857397235E-39,0]
[920,5.9006135798320399E-3,3.3627690823675197E-35,0,null,920,5.85703654776242E-3,3.172257195545188E-35,0,null,920,4.2499310123891413E-6,4.2014464039081793E-39,0]
[930,5.8833279242323589E-3,5.7317998691218459E-35,0,null,930,5.8398785498759431E-3,5.4314499850169387E-35,0,null,930,4.2374809822414056E-6,8.4358493238863051E-39,0]
[940,5.8660915852699683E-3,9.4953696337296463E-35,0,null,940,5.8227695043811525E-3,9.0318021411387818E-35,0,null,940,4.2250664719756842E-6,1.6418946091565389E-38,0]
[950,5.8489045762440597E-3,1.5331954523112374E-34,0,null,950,5.8057094244866967E-3,1.4630011728775155E-34,0,null,950,4.212687491230996E-6,3.0516045894979902E-38,0]
[960,5.8317668918240742E-3,2.4192692461640075E-34,0,null,960,5.7886983049188065E-3,2.3149626160700912E-34,0,null,960,4.200344036233075E-6,5.4096284609637965E-38,0]
[970,5.8146785103950788E-3,3.7381114628496482E-34,0,null,970,5.7717361242119493E-3,3.586218030171065E-34,0,null,970,4.1880360914593825E-6,9.1867100249030272E-38,0]
[980,5.7976393959617784E-3,5.6630230833473831E-34,0,null,980,5.7548228466360197E-3,5.4468675757582503E-34,0,null,980,4.1757636310290234E-6,1.5037082025411464E-37,0]
[990,5.7806495000235986E-3,8.4151196167970576E-34,2.5607288236631505E-23,null,990,5.7379584240594738E-3,8.1157322323525273E-34,2.5110062384916413E-23,null,990,4.1635266200405971E-6,2.3871960255020262E-37,1.1349538500840155E-26]
[1000,5.7637087629257887E-3,1.2260975782108428E-33,6.4733819030618131E-23,null,1000,5.7211427972636121E-3,1.1859571014120717E-33,6.3980058468449344E-23,null,1000,4.1513250155613027E-6,3.696257612039171E-37,4.0175042487191623E-26]
[]
[]
["Saved  21/03/2023: 09:36:46  Level Number: 5"]
[]
["BREAKTHROUGH RESULTS"]
[]
["Advanced"]
["Pollutant Linkage: Inert Restorati, Attenuation Layer, Beenham Grange Formation",null,null,null,null,"Pollutant Linkage: Inert Restorati, Attenuation Layer, Beenham Grange Formation, Groundwater",null,null,null,null,"Pollutant Linkage: Inert Restorati, Attenuation Layer, Beenham Grange Formation, River Enborne"]
["Concentrations in mg/L in Beenham Grange Formation",null,null,null,null,"Concentrations in mg/L in Groundwater",null,null,null,null,"Concentrations in mg/L in River Enborne"]
[]
["Compared with EAL (GW) target concentration in mg/L",null,null,null,null,"Compared with EAL (GW) target concentration in mg/L",null,null,null,null,"Compared with EAL (River Enborne) target concentration in mg/L"]
[null,0.39,2.0000000000000001E-4,5.9999999999999995E-4,null,null,0.39,2.0000000000000001E-4,5.9999999999999995E-4,null,null,0.39,1.1999999999999999E-3,1E-3]
[]
["Time(years)","Species1","Species2","Species3",null,"Time(years)","Species1","Species2","Species3",null,"Time(years)","Species1","Species2","Species3"]
[null,"Ammoniacial Nitrogen","Lead","Antimony",null,null,"Ammoniacial Nitrogen","Lead","Antimony",null,null,"Ammoniacial Nitrogen","Lead","Antimony"]
[10,1.8183524512411988E-10,0,0,null,10,1.8133093672324677E-10,0,0,null,10,1.2052569656285136E-13,0,0]
[20,2.0340177599277798E-6,0,0,null,20,2.032592995346195E-6,0,0,null,20,1.4345032105357727E-9,0,0]
[30,4.6268906496909036E-5,0,0,null,30,4.6254497967518438E-5,0,0,null,30,3.3014841628538443E-8,0,0]
[40,2.1951974074953736E-4,0,0,null,40,2.1948156696658641E-4,0,0,null,40,1.5728494593667233E-7,0,0]
[50,5.533062234053264E-4,0,0,null,50,5.5324548278279546E-4,0,0,null,50,3.9720565332825158E-7,0,0]
[60,1.0144577100888817E-3,0,0,null,60,1.014381859716019E-3,0,0,null,60,7.2902156873757884E-7,0,0]
[70,1.5495133330257213E-3,0,0,null,70,1.5494302782373601E-3,0,0,null,70,1.1142375769105522E-6,0,0]
[80,2.1110651695121409E-3,0,0,null,80,2.1109810360627609E-3,0,0,null,80,1.5186698770955852E-6,0,0]
[90,2.6651538725798569E-3,0,0,null,90,2.6650727314985884E-3,0,0,null,90,1.9178149513698686E-6,0,0]
[100,3.1904310669537616E-3,0,0,null,100,3.1903553167927931E-3,0,0,null,100,2.2962605365119043E-6,0,0]
[110,3.6750966897815297E-3,0,0,null,110,3.6750275393588766E-3,0,0,null,110,2.6454819427012237E-6,0,0]
[120,4.1138879581358234E-3,0,0,null,120,4.1138258319621873E-3,0,0,null,120,2.9616717009882683E-6,0,0]
[130,4.5057332403111707E-3,0,0,null,130,4.5056780756283924E-3,0,0,null,130,3.2440474296229171E-6,0,0]
[140,4.8520918917205223E-3,0,0,null,140,4.8520433420619798E-3,0,0,null,140,3.4936540851308309E-6,0,0]
[150,5.1558396554440607E-3,0,0,null,150,5.1557972244946773E-3,0,0,null,150,3.7125596683275185E-6,0,0]
[160,5.4205468860145751E-3,0,0,null,160,5.4205100128209196E-3,0,0,null,160,3.903334315091912E-6,0,0]
[170,5.650025928939908E-3,0,0,null,170,5.6499940403707252E-3,0,0,null,170,4.0687235895318618E-6,0,0]
[180,5.848057601349833E-3,0,0,null,180,5.8480301430196757E-3,0,0,null,180,4.2114510167029895E-6,0,0]
[190,6.0182344128335502E-3,0,0,null,190,6.0182108661256612E-3,0,0,null,190,4.3341048622105213E-6,0,0]
[200,6.1638785082694676E-3,0,0,null,200,6.1638583985513138E-3,0,0,null,200,4.4390788402473784E-6,0,0]
[210,6.288006489830438E-3,0,0,null,210,6.2879893892131972E-3,0,0,null,210,4.5285466587119579E-6,0,0]
[220,6.3933228852965244E-3,0,0,null,220,6.3933084121196582E-3,0,0,null,220,4.604457243953841E-6,0,0]
[230,6.4822304449963768E-3,0,1.1211757879335995E-40,null,230,6.4822182614472767E-3,0,1.1207723722153557E-40,null,230,4.6685421167200993E-6,0,0]
[240,6.5568496923342247E-3,0,0,null,240,6.5568395010948939E-3,0,0,null,240,4.7223294523389997E-6,0,0]
[250,6.6190429407223588E-3,0,0,null,250,6.6190344812096236E-3,0,0,null,250,4.7671613699513643E-6,0,0]
[260,6.6704398116954854E-3,0,2.1201133341598986E-38,null,260,6.670432856228866E-3,0,2.0914432366103368E-38,null,260,4.8042123103641247E-6,0,0]
[270,6.7124624725406201E-3,0,1.5476177821638529E-37,null,270,6.7124568226470853E-3,0,1.5334441976851767E-37,null,270,4.8345072162390479E-6,0,0]
[280,6.7463495749899294E-3,0,9.7574307935574954E-37,null,280,6.7463450579481566E-3,0,9.6187551939949159E-37,null,280,4.8589387791240094E-6,0,4.6640897367701975E-40]
[290,6.7731783632440376E-3,0,7.1533805103834905E-36,null,290,6.773174828930896E-3,0,7.0670539285779534E-36,null,290,4.8782833690877006E-6,0,3.5419665107550223E-39]
[300,6.7938847251877883E-3,0,4.1051796981716747E-35,null,300,6.7938820432336833E-3,0,4.0682231048058196E-35,null,300,4.8932154833324108E-6,0,2.2436754224918392E-38]
[310,6.8092811479370302E-3,0,1.803237057225229E-34,null,310,6.8092792051930697E-3,0,1.7904579239805701E-34,null,310,4.9043206853273826E-6,0,1.0464796104894629E-37]
[320,6.8200726494452545E-3,0,6.4611910085281378E-34,null,320,6.8200713477490019E-3,0,6.4258401003236565E-34,null,320,4.9121070858428953E-6,0,3.9224538954279208E-37]
[330,6.8268708187005939E-3,0,1.9019498486774444E-33,null,330,6.8268700729038267E-3,0,1.8955802394831919E-33,null,330,4.9170154612204494E-6,0,1.2233090261316689E-36]
[340,6.8302061267958578E-3,0,4.3011607961334267E-33,null,340,6.8302058630427057E-3,0,4.30134964013439E-33,null,340,4.9194281257011876E-6,0,3.031237617922178E-36]
[350,6.8305386809823987E-3,0,5.8314247833271948E-33,null,350,6.8305388352179397E-3,0,5.8835035251145179E-33,null,350,4.9196766817515343E-6,0,5.0828344391026362E-36]
[360,6.8282675918988119E-3,0,0,null,360,6.8282681085527737E-3,0,0,null,360,4.9180487709940523E-6,0,1.1828634606882042E-36]
[370,6.8237391154467881E-3,0,0,null,370,6.8237399462998888E-3,0,0,null,370,4.9147939420862358E-6,0,0]
[380,6.817253718361312E-3,0,0,null,380,6.8172548215690446E-3,0,0,null,380,4.9101287429274376E-6,0,0]
[390,6.8090722026918375E-3,0,0,null,390,6.8090735419291601E-3,0,0,null,390,4.9042411346375599E-6,0,0]
[400,6.7994210101256416E-3,0,0,null,400,6.7994225538475454E-3,0,0,null,400,4.8972943144475875E-6,0,0]
[410,6.7884968134079883E-3,0,0,null,410,6.7884985342104029E-3,0,0,null,410,4.8894300248027888E-6,0,0]
[420,6.7764704893074051E-3,0,0,null,420,6.7764723633777666E-3,0,0,null,420,4.8807714167419826E-6,0,0]
[430,6.7634905557685124E-3,0,3.9506589966970248E-30,null,430,6.7634925624006333E-3,0,3.8910930151872289E-30,null,430,4.8714255271020298E-6,0,1.5946536139681535E-33]
[440,6.7496861453852468E-3,0,1.5908858338802482E-29,null,440,6.749688266582711E-3,0,1.5813224728924544E-29,null,440,4.8614854215484262E-6,0,9.332217247091022E-33]
[450,6.7351695778442057E-3,0,3.8613614233866188E-29,null,450,6.7351717979408973E-3,0,3.8513627620276122E-29,null,450,4.8510320485679415E-6,0,2.534575248072782E-32]
[460,6.7200385858728322E-3,0,7.0994231750858836E-29,null,460,6.7200408912390947E-3,0,7.0994414409723393E-29,null,460,4.8401358437573679E-6,0,5.0405125418496508E-32]
[470,6.7043782415697282E-3,0,1.0025757118104697E-28,null,470,6.7043806203396878E-3,0,1.0056820048433773E-28,null,470,4.8288581181305349E-6,0,7.7671218047107268E-32]
[480,6.6882626241242388E-3,0,9.295402469422978E-29,null,480,6.6882650659585959E-3,0,9.3884405087049404E-29,null,480,4.8172522600932131E-6,0,8.551252517998694E-32]
[490,6.6717562638610676E-3,0,0,null,490,6.6717587597561329E-3,0,0,null,490,4.8053647761631943E-6,0,3.1327684653202212E-32]
[500,6.6549153932748233E-3,0,0,null,500,6.6549179353834953E-3,0,0,null,500,4.7932361926106507E-6,0,0]
[510,6.6377890310340771E-3,0,0,null,510,6.6377916125140626E-3,0,0,null,510,4.7809018367084708E-6,0,0]
[520,6.620419921823429E-3,0,0,null,520,6.6204225367061838E-3,0,0,null,520,4.7683925140913844E-6,0,0]
[530,6.6028453513697367E-3,0,0,null,530,6.6028479944489028E-3,0,0,null,530,4.7557350961336697E-6,0,0]
[540,6.5850978536366993E-3,0,0,null,540,6.5851005203658294E-3,0,0,null,540,4.7429530296517291E-6,0,0]
[550,6.567205824650116E-3,0,0,null,550,6.56720851106602E-3,0,0,null,550,4.7300667792660968E-6,0,0]
[560,6.5491940555569856E-3,0,0,null,560,6.5491967581996725E-3,0,0,null,560,4.7170942115980294E-6,0,0]
[570,6.5310841957089737E-3,0,3.9328451231460667E-27,null,570,6.5310869115439464E-3,0,3.8760759052833901E-27,null,570,4.7040509289970538E-6,0,1.5720389690267124E-30]
[580,6.5128951551701548E-3,0,1.2846875240872811E-26,null,580,6.5128978815612434E-3,0,1.2783141956231961E-26,null,580,4.6909505596479586E-6,0,7.7738745947348629E-30]
[590,6.4946434547242466E-3,0,2.582414306203923E-26,null,590,6.4946461893622158E-3,0,2.5773836104804094E-26,null,590,4.6778050097994824E-6,0,1.7321448388348671E-29]
[600,6.4763435302727882E-3,0,4.1635009116813922E-26,null,600,6.4763462711402205E-3,0,4.1631549932952049E-26,null,600,4.6646246831586705E-6,0,2.9628117199927875E-29]
[610,6.458007997834983E-3,0,5.6994057818256824E-26,null,610,6.4580107431657314E-3,0,5.7082045180935186E-26,null,610,4.6514186718681068E-6,0,4.2600884441370635E-29]
[620,6.4396478842101311E-3,0,6.6140831855972337E-26,null,620,6.4396506324640767E-3,0,6.6369151492989158E-26,null,620,4.6381949227419008E-6,0,5.2227929309925875E-29]
[630,6.4212728279275152E-3,0,6.0918801454745488E-26,null,630,6.4212755777586696E-3,0,6.1327872752664497E-26,null,630,4.6249603820965298E-6,0,5.2502122710549899E-29]
[640,6.4028912543292E-3,0,3.160430405556048E-26,null,640,6.4028940045597503E-3,0,3.2207956370125518E-26,null,640,4.6117211219157223E-6,0,3.5890015642164453E-29]
[650,6.3845105281927425E-3,0,0,null,650,6.384513277799651E-3,0,0,null,650,4.5984824498695677E-6,0,0]
[660,6.3661370868227278E-3,0,0,null,660,6.3661398348994012E-3,0,0,null,660,4.5852490052029495E-6,0,0]
[670,6.3477765562048359E-3,0,0,null,670,6.3477793019642969E-3,0,0,null,670,4.5720248424707849E-6,0,0]
[680,6.3294338523469914E-3,0,0,null,680,6.3294365951027751E-3,0,0,null,680,4.5588135045490012E-6,0,0]
[690,6.3111132697590815E-3,0,0,null,690,6.3111160089160227E-3,0,0,null,690,4.5456180864375551E-6,0,0]
[700,6.2928185587669072E-3,0,0,null,700,6.2928212937945396E-3,0,0,null,700,4.53244129094147E-6,0,0]
[710,6.2745529930170333E-3,1.2662802936727277E-40,0,null,710,6.2745557234587766E-3,1.232480037539213E-40,0,null,710,4.5192854773201503E-6,0,0]
[720,6.2563194285196596E-3,2.3089072347542659E-40,0,null,720,6.2563221539786293E-3,2.373389527283952E-40,0,null,720,4.5061527038847066E-6,0,0]
[730,6.2381203552690839E-3,2.6144258433969098E-40,0,null,730,6.238123075395563E-3,2.8803874841616677E-40,0,null,730,4.4930447651443629E-6,0,0]
[740,6.2199579423802102E-3,0,0,null,740,6.2199606568773677E-3,1.0618785548033114E-40,0,null,740,4.4799632243698052E-6,0,0]
[750,6.2018340775856695E-3,0,7.5200699274293378E-25,null,750,6.2018367861824044E-3,0,7.4425884758845098E-25,null,750,4.4669094420495426E-6,0,3.6442532101561782E-28]
[760,6.1837504018134645E-3,0,1.865158166579685E-24,null,760,6.1837531042946104E-3,0,1.8580301827219822E-24,null,760,4.4538846007987485E-6,0,1.1748904169013264E-27]
[770,6.1657083394712382E-3,0,3.2394393170339669E-24,null,770,6.1657110356245961E-3,0,3.2344459856428188E-24,null,770,4.440889727206348E-6,0,2.2065350377222135E-27]
[780,6.147709124941933E-3,0,4.7767487977177762E-24,null,780,6.147711814604764E-3,0,4.7757035812252144E-24,null,780,4.4279257108974965E-6,0,3.3960033127888024E-27]
[790,6.1297538258315888E-3,3.6899560615752116E-39,6.3162201084595542E-24,null,790,6.1297565088483464E-3,2.676314507657671E-39,6.3210723075883056E-24,null,790,4.4149933213206857E-6,0,4.6313023530750982E-27]
[800,6.1118433632818825E-3,1.6255386299933437E-38,7.6354772656613355E-24,null,800,6.1118460395275711E-3,1.4617065137957587E-38,7.6480793195573939E-24,null,800,4.4020932223705582E-6,0,5.7510930194538473E-27]
[810,6.0939785298801431E-3,4.0550096289171704E-38,8.4604238534342175E-24,null,810,6.093981199247079E-3,3.8156579876031625E-38,8.4822429557165819E-24,null,810,4.3892259852937739E-6,0,6.5504039618462667E-27]
[820,6.0761600052500336E-3,8.1658832675519501E-38,8.4843158208015787E-24,null,820,6.0761626676444046E-3,7.8132160526007514E-38,8.5161139676038652E-24,null,820,4.3763920999301468E-6,0,6.7935442759816914E-27]
[830,6.0583883698187976E-3,1.4766054396598043E-37,7.3958565490336097E-24,null,830,6.058391025156957E-3,1.4173458504885798E-37,7.4373719374543217E-24,null,830,4.3635919846253515E-6,0,6.234233814904384E-27]
[840,6.0406641168347609E-3,2.5603811452340619E-37,4.9149267626566194E-24,null,840,6.0406667650521901E-3,2.4430834063628796E-37,4.964595540832866E-24,null,840,4.3508259949150387E-6,0,4.6421016955353878E-27]
[850,6.0229876629439615E-3,4.4781022541735938E-37,8.3344485648524287E-25,null,850,6.0229903039806312E-3,4.2267326399607043E-37,8.8820453652215673E-25,null,850,4.3380944311054427E-6,1.2408853323403671E-40,1.8338164915707444E-27]
[860,6.0053593574733175E-3,8.1346740217779522E-37,0,null,860,6.0053619912810805E-3,7.6009239024145476E-37,0,null,860,4.3253975450191862E-6,2.2378365630059067E-40,0]
[870,5.9877794905862734E-3,1.5351101069623706E-36,0,null,870,5.9877821171316669E-3,1.427314632153039E-36,0,null,870,4.3127355458032726E-6,3.4729667853320053E-40,0]
[880,5.9702483003839088E-3,2.9493092348620056E-36,0,null,880,5.9702509196296353E-3,2.7441595767917695E-36,0,null,880,4.3001086051235316E-6,4.9889955587615262E-40,0]
[890,5.9527659792688011E-3,5.6356912310756855E-36,0,null,890,5.9527685911944829E-3,5.2664296375870731E-36,0,null,890,4.2875168616975639E-6,7.224985976272688E-40,0]
[900,5.9353326794298516E-3,1.0537944970685229E-35,0,null,900,5.9353352840086845E-3,9.9044230492793038E-36,0,null,900,4.2749604252494805E-6,1.1564102195647292E-39,0]
[910,5.9179485177072808E-3,1.9127692216825272E-35,0,null,910,5.9179511149278887E-3,1.8082918010684391E-35,0,null,910,4.2624393800399776E-6,2.1156283234113823E-39,0]
[920,5.9006135798320399E-3,3.3627690823675197E-35,0,null,920,5.9006161696820766E-3,3.1958605601624463E-35,0,null,920,4.2499537879310808E-6,4.2014689196187878E-39,0]
[930,5.8833279242323589E-3,5.7317998691218459E-35,0,null,930,5.8833305067103854E-3,5.4718630053031829E-35,0,null,930,4.2375036910628503E-6,8.4358945319227467E-39,0]
[940,5.8660915852699683E-3,9.4953696337296463E-35,0,null,940,5.8660941603669251E-3,9.0990037915559037E-35,0,null,940,4.225089114267297E-6,1.6419034081320164E-38,0]
[950,5.8489045762440597E-3,1.5331954523112374E-34,0,null,950,5.8489071439532785E-3,1.473886718402449E-34,0,null,950,4.2127100671830444E-6,3.0516209431627142E-38,0]
[960,5.8317668918240742E-3,2.4192692461640075E-34,0,null,960,5.831769452157843E-3,2.3321872303854623E-34,0,null,960,4.2003665460371645E-6,5.4096574513678704E-38,0]
[970,5.8146785103950788E-3,3.7381114628496482E-34,0,null,970,5.8146810633583762E-3,3.6129014945137364E-34,0,null,970,4.1880585353024668E-6,9.1867592568304393E-38,0]
[980,5.7976393959617784E-3,5.6630230833473831E-34,0,null,980,5.7976419415537482E-3,5.4873953115273075E-34,0,null,980,4.1757860091053525E-6,1.5037162609704293E-37,0]
[990,5.7806495000235986E-3,8.4151196167970576E-34,2.5607288236631505E-23,null,990,5.7806520382578828E-3,8.1761178112032137E-34,2.5296895268191086E-23,null,990,4.1635489325381828E-6,2.387208818576057E-37,1.1349599323509116E-26]
[1000,5.7637087629257887E-3,1.2260975782108428E-33,6.4733819030618131E-23,null,1000,5.7637112938082827E-3,1.1947812843706181E-33,6.445610582369119E-23,null,1000,4.1513472626684531E-6,3.6962774204238888E-37,4.0175257786766251E-26]
[]
[]
["Saved  22/03/2023: 12:17:54  Level Number: 5"]
[]
["BREAKTHROUGH RESULTS"]
[]
["Advanced"]
["Pollutant Linkage: Inert Restorati, Attenuation Layer, Beenham Grange Formation",null,null,null,"Pollutant Linkage: Inert Restorati, Attenuation Layer, Beenham Grange Formation, Groundwater",null,null,null,"Pollutant Linkage: Inert Restorati, Attenuation Layer, Beenham Grange Formation, River Enborne"]
["Concentrations in mg/L in Beenham Grange Formation",null,null,null,"Concentrations in mg/L in Groundwater",null,null,null,"Concentrations in mg/L in River Enborne"]
[]
["Compared with EAL (GW) target concentration in mg/L",null,null,null,"Compared with EAL (GW) target concentration in mg/L",null,null,null,"Compared with EAL (River Enborne) target concentration in mg/L"]
[null,0.39,2.0000000000000001E-4,null,null,0.39,2.0000000000000001E-4,null,null,0.39,1.1999999999999999E-3]
[]
["Time(years)","Species1","Species2",null,"Time(years)","Species1","Species2",null,"Time(years)","Species1","Species2"]
[null,"Ammoniacial Nitrogen","Lead",null,null,"Ammoniacial Nitrogen","Lead",null,null,"Ammoniacial Nitrogen","Lead"]
[10,2.6052310850188996E-11,0,null,10,2.5977335292286383E-11,0,null,10,1.7080419729461068E-13,0]
[20,4.1520306611249817E-7,0,null,20,4.1490102622847968E-7,0,null,20,2.903061518310775E-9,0]
[30,1.0673481112074599E-5,0,null,30,1.0670024267248422E-5,0,null,30,7.5537706426656018E-8,0]
[40,5.3966874601172265E-5,0,null,40,5.3957096284106561E-5,0,null,40,3.8357112463275562E-7,0]
[50,1.4153249594169303E-4,0,null,50,1.4151627366118156E-4,0,null,50,1.0079594519209716E-6,0]
[60,2.6669170272595701E-4,0,null,60,2.6667083865329242E-4,0,null,60,1.9013887505283937E-6,0]
[70,4.1560538126473435E-4,0,null,70,4.155820250244897E-4,0,null,70,2.9650356433560365E-6,0]
[80,5.7493801284436597E-4,0,null,80,5.7491394566094259E-4,0,null,80,4.1035216919908089E-6,0]
[90,7.3453938188619203E-4,0,null,90,7.3451585930298211E-4,0,null,90,5.2441976810488586E-6,0]
[100,8.8762713904337565E-4,0,null,100,8.8760495278164553E-4,0,null,100,6.3384953879821159E-6,0]
[110,1.030140047938741E-3,0,null,110,1.0301196410176434E-3,0,null,110,7.3573171629433059E-6,0]
[120,1.1599775720287963E-3,0,null,120,1.1599591460306645E-3,0,null,120,8.2856001195644933E-6,0]
[130,1.2763599730863206E-3,0,null,130,1.2763435716014908E-3,0,null,130,9.1177381005335728E-6,0]
[140,1.3793514136165278E-3,0,null,140,1.3793369821211918E-3,0,null,140,9.8541685682747774E-6,0]
[150,1.4695256099995985E-3,0,null,150,1.4695130369069805E-3,0,null,150,1.0498979221736259E-5,0]
[160,1.5477401213778779E-3,0,null,160,1.5477292653069486E-3,0,null,160,1.1058292038916785E-5,0]
[170,1.6149883344169955E-3,0,null,170,1.6149790418133179E-3,0,null,170,1.1539203444611004E-5,0]
[180,1.6723051107722688E-3,0,null,180,1.6722972269515074E-3,0,null,180,1.1949108627111846E-5,0]
[190,1.720708686998925E-3,0,null,190,1.7207020627888498E-3,0,null,190,1.2295285392660191E-5,0]
[200,1.7611666604509036E-3,0,null,200,1.7611611559326852E-3,0,null,200,1.258465046779703E-5,0]
[210,1.7945777325834716E-3,0,null,210,1.7945732189522019E-3,0,null,210,1.2823628627709973E-5,0]
[220,1.8217635822937665E-3,0,null,220,1.821759942522171E-3,0,null,220,1.3018094363945031E-5,0]
[230,1.8434671031466706E-3,0,null,230,1.8434642319101447E-3,0,null,230,1.3173359128341439E-5,0]
[240,1.8603545051990393E-3,0,null,240,1.8603523083619985E-3,0,null,240,1.3294186259274031E-5,0]
[250,1.873019638000344E-3,0,null,250,1.8730180318626455E-3,0,null,250,1.3384821823413107E-5,0]
[260,1.8819894666240683E-3,0,null,260,1.8819883770527543E-3,0,null,260,1.3449033724674381E-5,0]
[270,1.8877300175481084E-3,0,null,270,1.8877293790773085E-3,0,null,270,1.3490154188124492E-5,0]
[280,1.8906523677081934E-3,0,null,280,1.8906521226529809E-3,0,null,280,1.3511122563023715E-5,0]
[290,1.8911184199302334E-3,0,null,290,1.8911185175476788E-3,0,null,290,1.3514526605445085E-5,0]
[300,1.8894463195904771E-3,0,null,300,1.8894467153007699E-3,0,null,300,1.3502641200350498E-5,0]
[310,1.885915439840344E-3,0,null,310,1.885916094513645E-3,0,null,310,1.3477464001978543E-5,0]
[320,1.8807709090778262E-3,0,null,320,1.8807717883927598E-3,0,null,320,1.3440747803280131E-5,0]
[330,1.8742276831052286E-3,0,null,330,1.8742287569717129E-3,0,null,330,1.3394029651147693E-5,0]
[340,1.8664741816314498E-3,0,null,340,1.8664754236775414E-3,0,null,340,1.3338656847528259E-5,0]
[350,1.8576755183360922E-3,0,null,350,1.8576769054557904E-3,0,null,350,1.3275810044932557E-5,0]
[360,1.847976358254872E-3,0,null,360,1.8479778702040425E-3,0,null,360,1.3206523677578351E-5,0]
[370,1.8375034377016363E-3,0,null,370,1.837505056745223E-3,0,null,370,1.3131703979782197E-5,0]
[380,1.8263677813680061E-3,0,null,380,1.8263694919699793E-3,0,null,380,1.3052144839207547E-5,0]
[390,1.8146666495152074E-3,0,null,390,1.8146684380663206E-3,0,null,390,1.2968541720240335E-5,0]
[400,1.8024852458616259E-3,0,null,400,1.8024871004391318E-3,0,null,400,1.2881503876286607E-5,0]
[410,1.7898982141019146E-3,0,null,410,1.7899001242602229E-3,0,null,410,1.2791565050701489E-5,0]
[420,1.7769709482982608E-3,0,null,420,1.7769729048864144E-3,0,null,420,1.2699192846872507E-5,0]
[430,1.763760739752884E-3,0,null,430,1.7637627347526924E-3,0,null,430,1.2604796928999129E-5,0]
[440,1.7503177804706663E-3,0,null,440,1.7503198068602698E-3,0,null,440,1.25087361974562E-5,0]
[450,1.7366860409822665E-3,0,null,450,1.7366880926078085E-3,0,null,450,1.2411325065740686E-5,0]
[460,1.722904038289529E-3,0,null,460,1.7229061097617791E-3,0,null,460,1.2312838951782441E-5,0]
[470,1.709005507646908E-3,0,null,470,1.7090075942461933E-3,0,null,470,1.2213519081496189E-5,0]
[480,1.69501999036977E-3,0,null,480,1.6950220879622844E-3,0,null,480,1.211357669205306E-5,0]
[490,1.6809733482193512E-3,0,null,490,1.6809754531889631E-3,0,null,490,1.2013196709957419E-5,0]
[500,1.666888213674482E-3,0,null,500,1.6668903228562139E-3,0,null,500,1.1912540970787374E-5,0]
[510,1.6527843841589759E-3,0,null,510,1.6527864947851374E-3,0,null,510,1.1811751038104768E-5,0]
[520,1.6386791673668997E-3,0,null,520,1.6386812770189125E-3,0,null,520,1.1710950672779779E-5,0]
[530,1.6245876837786726E-3,0,null,530,1.6245897903438061E-3,0,null,530,1.1610247996072184E-5,0]
[540,1.6105231318347885E-3,0,null,540,1.6105252334701707E-3,0,null,540,1.1509737385842227E-5,0]
[550,1.596497020431027E-3,0,null,550,1.5964991155308847E-3,0,null,550,1.140950113893259E-5,0]
[560,1.5825193728438581E-3,0,null,560,1.5825214600113865E-3,0,null,560,1.1309610929398736E-5,0]
[570,1.5685989056767767E-3,0,null,570,1.568600983695619E-3,0,null,570,1.1210129088019577E-5,0]
[580,1.5547431859389853E-3,0,null,580,1.5547452537567398E-3,0,null,580,1.1111109725523585E-5,0]
[590,1.5409587689878149E-3,0,null,590,1.5409608256933534E-3,0,null,590,1.1012599718914815E-5,0]
[600,1.527251319708361E-3,0,null,600,1.5272533645151009E-3,0,null,600,1.0914639577971214E-5,0]
[610,1.5136257190283696E-3,0,null,610,1.5136277512595325E-3,0,null,610,1.0817264206872407E-5,0]
[620,1.5000861575546244E-3,0,null,620,1.5000881766303507E-3,0,null,620,1.0720503573727004E-5,0]
[630,1.4866362179318036E-3,0,null,630,1.4866382233587464E-3,0,null,630,1.0624383299512191E-5,0]
[640,1.4732789473197608E-3,0,null,640,1.4732809386784032E-3,0,null,640,1.0528925176247101E-5,0]
[650,1.4600169211834652E-3,0,null,650,1.4600188981226886E-3,0,null,650,1.0434147623209193E-5,0]
[660,1.4468522994504351E-3,0,null,660,1.4468542616738794E-3,0,null,660,1.0340066088378982E-5,0]
[670,1.4337868760058077E-3,0,null,670,1.4337888232697142E-3,0,null,670,1.0246693402434835E-5,0]
[680,1.4208221222835201E-3,0,null,680,1.420824054390535E-3,0,null,680,1.01540400903709E-5,0]
[690,1.4079592257019119E-3,0,null,690,1.4079611424946158E-3,0,null,690,1.0062114646423529E-5,0]
[700,1.3951991235540459E-3,0,null,700,1.3952010249079049E-3,0,null,700,9.9709237762883346E-6,0]
[710,1.3825425328951723E-3,0,null,710,1.3825444187182917E-3,0,null,710,9.8804726108530342E-6,0]
[720,1.3699899769226297E-3,0,null,720,1.3699918471507008E-3,0,null,720,9.7907648949133813E-6,0]
[730,1.3575418082624163E-3,0,null,730,1.3575436628528433E-3,0,null,730,9.7018031535506332E-6,0]
[740,1.3451982295086705E-3,0,null,740,1.3452000684435917E-3,0,null,740,9.6135888390774574E-6,0]
[750,1.332959311396263E-3,0,null,750,1.3329611346720299E-3,0,null,750,9.5261224609612798E-6,0]
[760,1.320825008808026E-3,0,null,760,1.3208268164426116E-3,0,null,760,9.4394037002453271E-6,0]
[770,1.3087951749666919E-3,0,null,770,1.3087969669860011E-3,0,null,770,9.3534315110929557E-6,0]
[780,1.2968695739482099E-3,0,null,780,1.2968713503953855E-3,0,null,780,9.2682042101664262E-6,0]
[790,1.2850478917424935E-3,0,null,790,1.2850496526679708E-3,0,null,790,9.1837195558032199E-6,0]
[800,1.2733297460569852E-3,0,null,800,1.2733314915239055E-3,0,null,800,9.099974818082335E-6,0]
[810,1.261714694950481E-3,0,null,810,1.2617164250288732E-3,0,null,810,9.0169668405337182E-6,0]
[820,1.2502022445232098E-3,1.0949616645346881E-39,null,820,1.2502039592906175E-3,8.1501988270135887E-40,null,820,8.9346920951610116E-6,0]
[830,1.2387918556397977E-3,4.5352635458275218E-39,null,830,1.2387935551799332E-3,4.095064979507447E-39,null,830,8.8531467304789479E-6,0]
[840,1.2274829499702344E-3,1.1005498581071631E-38,null,840,1.2274846343719181E-3,1.0378162997161555E-38,null,840,8.7723266147554984E-6,0]
[850,1.2162749152624876E-3,2.1706447759205105E-38,null,850,1.2162765846198728E-3,2.0812046359436604E-38,null,850,8.6922273736325164E-6,0]
[860,1.2051671100450374E-3,3.8451299949190085E-38,null,860,1.2051687644549453E-3,3.7013680997176708E-38,null,860,8.6128444238695816E-6,0]
[870,1.1941588677755715E-3,6.5039748413886244E-38,null,870,1.1941605073414031E-3,6.2309757864812184E-38,null,870,8.5341730028466675E-6,1.397313358429296E-40]
[880,1.1832495005149098E-3,1.1029008264563865E-37,null,880,1.1832511253403466E-3,1.0459286214720068E-37,null,880,8.456208195003421E-6,3.2177999536451802E-40]
[890,1.1724383021768368E-3,1.9358871974073634E-37,null,890,1.1724399123695349E-3,1.8166328480072777E-37,null,890,8.3789449549848814E-6,5.736149689822716E-40]
[900,1.1617245514209231E-3,3.5386941016080152E-37,null,900,1.1617261470879643E-3,3.2997871957491659E-37,null,900,8.3023781282930893E-6,8.8152265216030114E-40]
[910,1.1511075141815395E-3,6.6292716239995898E-37,null,910,1.1511090954344891E-3,6.1771268587566627E-37,null,910,8.2265024694285786E-6,1.2465672903717784E-39]
[920,1.1405864459221736E-3,1.2440022749896684E-36,null,920,1.1405880128725809E-3,1.1630223233503184E-36,null,920,8.1513126580797636E-6,1.748336557865951E-39]
[930,1.1301605936406278E-3,2.2968000945455435E-36,null,930,1.1301621464032084E-3,2.1586146245265098E-36,null,930,8.0768033132230517E-6,2.6592284116592631E-39]
[940,1.119829197616911E-3,4.1307203458793163E-36,null,940,1.1198307363044164E-3,3.9042717127372495E-36,null,940,8.0029690058931873E-6,4.6169905255272347E-39]
[950,1.1095914929838003E-3,7.2091523370559377E-36,null,950,1.1095930177089999E-3,6.8500757358453616E-36,null,950,7.9298042702612329E-6,8.8555164432944653E-39]
[960,1.0994467110945674E-3,1.2209125999699076E-35,null,960,1.099448221976447E-3,1.1654578327765647E-35,null,960,7.8573036134545912E-6,1.7487244662049244E-38]
[970,1.0893940807475545E-3,2.0101902030410337E-35,null,970,1.0893955779005529E-3,1.9263638120542093E-35,null,970,7.7854615242756593E-6,3.3830040496003684E-38]
[980,1.0794328292462528E-3,3.2260260981916615E-35,null,980,1.0794343127848007E-3,3.1016157558663352E-35,null,980,7.7142724808615207E-6,6.2782749802653079E-38]
[990,1.0695621833812128E-3,5.0595819106905601E-35,null,990,1.0695636534213161E-3,4.8781002964850749E-35,null,990,7.6437309575917818E-6,1.1128047843913557E-37]
[1000,1.0597813702115711E-3,7.7722750778055932E-35,null,1000,1.059782826870034E-3,7.5123053764230587E-35,null,1000,7.5738314307804249E-6,1.8890206792054249E-37]
[]
[]
["Saved  29/03/2023: 15:06:27  Level Number: 5"]
[]
["BREAKTHROUGH RESULTS"]
[]
["Advanced"]
["Pollutant Linkage: Inert Restorati, Attenuation Layer, Beenham Grange Formation",null,null,null,null,"Pollutant Linkage: Inert Restorati, Attenuation Layer, Beenham Grange Formation, Groundwater",null,null,null,null,"Pollutant Linkage: Inert Restorati, Attenuation Layer, Beenham Grange Formation, River Enborne"]
["Concentrations in mg/L in Beenham Grange Formation",null,null,null,null,"Concentrations in mg/L in Groundwater",null,null,null,null,"Concentrations in mg/L in River Enborne"]
[]
["Compared with EAL (GW) target concentration in mg/L",null,null,null,null,"Compared with EAL (GW) target concentration in mg/L",null,null,null,null,"Compared with EAL (River Enborne) target concentration in mg/L"]
[null,0.39,1E-3,2.0000000000000001E-4,null,null,0.39,1E-3,2.0000000000000001E-4,null,null,0.39,1E-3,2.0000000000000001E-4]
[]
["Time(years)","Species1","Species2","Species3",null,"Time(years)","Species1","Species2","Species3",null,"Time(years)","Species1","Species2","Species3"]
[null,"Ammoniacial Nitrogen","Copper","Lead",null,null,"Ammoniacial Nitrogen","Copper","Lead",null,null,"Ammoniacial Nitrogen","Copper","Lead"]
[10,2.6052310850188996E-11,0,0,null,10,2.5977335292286383E-11,0,0,null,10,1.7080419729461068E-13,0,0]
[20,4.1520306611249817E-7,0,0,null,20,4.1490102622847968E-7,0,0,null,20,2.903061518310775E-9,0,0]
[30,1.0673481112074599E-5,0,0,null,30,1.0670024267248422E-5,0,0,null,30,7.5537706426656018E-8,0,0]
[40,5.3966874601172265E-5,0,0,null,40,5.3957096284106561E-5,0,0,null,40,3.8357112463275562E-7,0,0]
[50,1.4153249594169303E-4,0,0,null,50,1.4151627366118156E-4,0,0,null,50,1.0079594519209716E-6,0,0]
[60,2.6669170272595701E-4,0,0,null,60,2.6667083865329242E-4,0,0,null,60,1.9013887505283937E-6,0,0]
[70,4.1560538126473435E-4,0,0,null,70,4.155820250244897E-4,0,0,null,70,2.9650356433560365E-6,0,0]
[80,5.7493801284436597E-4,0,0,null,80,5.7491394566094259E-4,0,0,null,80,4.1035216919908089E-6,0,0]
[90,7.3453938188619203E-4,0,0,null,90,7.3451585930298211E-4,0,0,null,90,5.2441976810488586E-6,0,0]
[100,8.8762713904337565E-4,0,0,null,100,8.8760495278164553E-4,0,0,null,100,6.3384953879821159E-6,0,0]
[110,1.030140047938741E-3,0,0,null,110,1.0301196410176434E-3,0,0,null,110,7.3573171629433059E-6,0,0]
[120,1.1599775720287963E-3,0,0,null,120,1.1599591460306645E-3,0,0,null,120,8.2856001195644933E-6,0,0]
[130,1.2763599730863206E-3,0,0,null,130,1.2763435716014908E-3,0,0,null,130,9.1177381005335728E-6,0,0]
[140,1.3793514136165278E-3,0,0,null,140,1.3793369821211918E-3,0,0,null,140,9.8541685682747774E-6,0,0]
[150,1.4695256099995985E-3,0,0,null,150,1.4695130369069805E-3,0,0,null,150,1.0498979221736259E-5,0,0]
[160,1.5477401213778779E-3,0,0,null,160,1.5477292653069486E-3,0,0,null,160,1.1058292038916785E-5,0,0]
[170,1.6149883344169955E-3,0,0,null,170,1.6149790418133179E-3,0,0,null,170,1.1539203444611004E-5,0,0]
[180,1.6723051107722688E-3,0,0,null,180,1.6722972269515074E-3,0,0,null,180,1.1949108627111846E-5,0,0]
[190,1.720708686998925E-3,0,0,null,190,1.7207020627888498E-3,0,0,null,190,1.2295285392660191E-5,0,0]
[200,1.7611666604509036E-3,0,0,null,200,1.7611611559326852E-3,0,0,null,200,1.258465046779703E-5,0,0]
[210,1.7945777325834716E-3,0,0,null,210,1.7945732189522019E-3,0,0,null,210,1.2823628627709973E-5,0,0]
[220,1.8217635822937665E-3,3.100290481561255E-40,0,null,220,1.821759942522171E-3,3.7616624141663968E-40,0,null,220,1.3018094363945031E-5,0,0]
[230,1.8434671031466706E-3,0,0,null,230,1.8434642319101447E-3,0,0,null,230,1.3173359128341439E-5,0,0]
[240,1.8603545051990393E-3,6.7153264315052582E-39,0,null,240,1.8603523083619985E-3,2.0426603229056025E-39,0,null,240,1.3294186259274031E-5,0,0]
[250,1.873019638000344E-3,1.3097014300126593E-37,0,null,250,1.8730180318626455E-3,1.1357498732134465E-37,0,null,250,1.3384821823413107E-5,0,0]
[260,1.8819894666240683E-3,8.5273239788617765E-37,0,null,260,1.8819883770527543E-3,6.7889522625099669E-37,0,null,260,1.3449033724674381E-5,0,0]
[270,1.8877300175481084E-3,7.1310431765915104E-36,0,null,270,1.8877293790773085E-3,5.5846879175834663E-36,0,null,270,1.3490154188124492E-5,0,0]
[280,1.8906523677081934E-3,4.9440970209788592E-35,0,null,280,1.8906521226529809E-3,4.1385590060354894E-35,0,null,280,1.3511122563023715E-5,8.1244641483008734E-39,0]
[290,1.8911184199302334E-3,2.49697136616603E-34,0,null,290,1.8911185175476788E-3,2.1804624734713249E-34,0,null,290,1.3514526605445085E-5,2.8315223649183822E-38,0]
[300,1.8894463195904771E-3,9.9194403208751885E-34,0,null,300,1.8894467153007699E-3,8.9279105389964684E-34,0,null,300,1.3502641200350498E-5,1.4436917411081961E-37,0]
[310,1.885915439840344E-3,3.1572792396751021E-33,0,null,310,1.885916094513645E-3,2.9535923342826455E-33,0,null,310,1.3477464001978543E-5,1.1268879120636928E-36,0]
[320,1.8807709090778262E-3,7.4467064990608047E-33,0,null,320,1.8807717883927598E-3,7.4225178693637174E-33,0,null,320,1.3440747803280131E-5,5.8649660347668682E-36,0]
[330,1.8742276831052286E-3,9.3000193014246227E-33,0,null,330,1.8742287569717129E-3,1.1065173533619011E-32,0,null,330,1.3394029651147693E-5,2.2130358904631714E-35,0]
[340,1.8664741816314498E-3,0,0,null,340,1.8664754236775414E-3,0,0,null,340,1.3338656847528259E-5,6.9382269059215803E-35,0]
[350,1.8576755183360922E-3,0,0,null,350,1.8576769054557904E-3,0,0,null,350,1.3275810044932557E-5,1.8448439503494896E-34,0]
[360,1.847976358254872E-3,0,0,null,360,1.8479778702040425E-3,0,0,null,360,1.3206523677578351E-5,3.7325394009989518E-34,0]
[370,1.8375034377016363E-3,0,0,null,370,1.837505056745223E-3,0,0,null,370,1.3131703979782197E-5,3.7156457303526647E-34,0]
[380,1.8263677813680061E-3,0,0,null,380,1.8263694919699793E-3,0,0,null,380,1.3052144839207547E-5,0,0]
[390,1.8146666495152074E-3,0,0,null,390,1.8146684380663206E-3,0,0,null,390,1.2968541720240335E-5,0,0]
[400,1.8024852458616259E-3,2.3132437703305389E-30,0,null,400,1.8024871004391318E-3,9.7721761563870798E-31,0,null,400,1.2881503876286607E-5,0,0]
[410,1.7898982141019146E-3,1.7831536127678726E-29,0,null,410,1.7899001242602229E-3,1.5223940030736813E-29,0,null,410,1.2791565050701489E-5,0,0]
[420,1.7769709482982608E-3,5.1964487608024088E-29,0,null,420,1.7769729048864144E-3,4.8511714403054118E-29,0,null,420,1.2699192846872507E-5,0,0]
[430,1.763760739752884E-3,1.0653405106074315E-28,0,null,430,1.7637627347526924E-3,1.0486707524990123E-28,0,null,430,1.2604796928999129E-5,0,0]
[440,1.7503177804706663E-3,1.6295092870286932E-28,0,null,440,1.7503198068602698E-3,1.6946494711360611E-28,0,null,440,1.25087361974562E-5,0,0]
[450,1.7366860409822665E-3,1.6203695246540801E-28,0,null,450,1.7366880926078085E-3,1.8733215768387029E-28,0,null,450,1.2411325065740686E-5,3.9982564551145628E-31,0]
[460,1.722904038289529E-3,0,0,null,460,1.7229061097617791E-3,4.412271088296175E-29,0,null,460,1.2312838951782441E-5,1.3548930084618514E-30,0]
[470,1.709005507646908E-3,0,0,null,470,1.7090075942461933E-3,0,0,null,470,1.2213519081496189E-5,3.0499883239848088E-30,0]
[480,1.69501999036977E-3,0,0,null,480,1.6950220879622844E-3,0,0,null,480,1.211357669205306E-5,5.2764309771006191E-30,0]
[490,1.6809733482193512E-3,0,0,null,490,1.6809754531889631E-3,0,0,null,490,1.2013196709957419E-5,6.9066035817307995E-30,0]
[500,1.666888213674482E-3,0,0,null,500,1.6668903228562139E-3,0,0,null,500,1.1912540970787374E-5,5.320791266568082E-30,0]
[510,1.6527843841589759E-3,0,0,null,510,1.6527864947851374E-3,0,0,null,510,1.1811751038104768E-5,0,0]
[520,1.6386791673668997E-3,0,0,null,520,1.6386812770189125E-3,0,0,null,520,1.1710950672779779E-5,0,0]
[530,1.6245876837786726E-3,1.1457967542241071E-27,0,null,530,1.6245897903438061E-3,0,0,null,530,1.1610247996072184E-5,0,0]
[540,1.6105231318347885E-3,1.3359445706484586E-26,0,null,540,1.6105252334701707E-3,1.1371261327335313E-26,0,null,540,1.1509737385842227E-5,0,0]
[550,1.596497020431027E-3,3.3466162458619191E-26,0,null,550,1.5964991155308847E-3,3.1480208196399285E-26,0,null,550,1.140950113893259E-5,0,0]
[560,1.5825193728438581E-3,6.0446675374853522E-26,0,null,560,1.5825214600113865E-3,5.9432215154194044E-26,0,null,560,1.1309610929398736E-5,0,0]
[570,1.5685989056767767E-3,8.9372010250177064E-26,0,null,570,1.568600983695619E-3,9.0795068096372205E-26,0,null,570,1.1210129088019577E-5,0,0]
[580,1.5547431859389853E-3,1.1014093395445067E-25,0,null,580,1.5547452537567398E-3,1.1578336425750942E-25,0,null,580,1.1111109725523585E-5,7.543111500524946E-30,0]
[590,1.5409587689878149E-3,1.0720799684002485E-25,0,null,590,1.5409608256933534E-3,1.1873635287663216E-25,0,null,590,1.1012599718914815E-5,3.997194345692598E-28,0]
[600,1.527251319708361E-3,6.1000120587533843E-26,0,null,600,1.5272533645151009E-3,7.9278937846603901E-26,0,null,600,1.0914639577971214E-5,1.0463495220365309E-27,0]
[610,1.5136257190283696E-3,0,0,null,610,1.5136277512595325E-3,0,0,null,610,1.0817264206872407E-5,1.9282207205143442E-27,0]
[620,1.5000861575546244E-3,0,0,null,620,1.5000881766303507E-3,0,0,null,620,1.0720503573727004E-5,2.9183598104020529E-27,0]
[630,1.4866362179318036E-3,0,0,null,630,1.4866382233587464E-3,0,0,null,630,1.0624383299512191E-5,3.7444867244692533E-27,0]
[640,1.4732789473197608E-3,0,0,null,640,1.4732809386784032E-3,0,0,null,640,1.0528925176247101E-5,3.9748836864807159E-27,0]
[650,1.4600169211834652E-3,0,0,null,650,1.4600188981226886E-3,0,0,null,650,1.0434147623209193E-5,3.0458458059015043E-27,0]
[660,1.4468522994504351E-3,0,0,null,660,1.4468542616738794E-3,0,0,null,660,1.0340066088378982E-5,3.4551812734882605E-28,0]
[670,1.4337868760058077E-3,0,0,null,670,1.4337888232697142E-3,0,0,null,670,1.0246693402434835E-5,0,0]
[680,1.4208221222835201E-3,0,0,null,680,1.420824054390535E-3,0,0,null,680,1.01540400903709E-5,0,0]
[690,1.4079592257019119E-3,0,0,null,690,1.4079611424946158E-3,0,0,null,690,1.0062114646423529E-5,0,0]
[700,1.3951991235540459E-3,6.1281264223034495E-25,0,null,700,1.3952010249079049E-3,3.6582801383010816E-25,0,null,700,9.9709237762883346E-6,0,0]
[710,1.3825425328951723E-3,2.4231004914526163E-24,0,null,710,1.3825444187182917E-3,2.1752188040343184E-24,0,null,710,9.8804726108530342E-6,0,0]
[720,1.3699899769226297E-3,4.7843854535249526E-24,0,null,720,1.3699918471507008E-3,4.584825809541376E-24,0,null,720,9.7907648949133813E-6,0,0]
[730,1.3575418082624163E-3,7.5358401651989055E-24,0,null,730,1.3575436628528433E-3,7.4476283906724586E-24,0,null,730,9.7018031535506332E-6,0,0]
[740,1.3451982295086705E-3,1.0379865689976737E-23,0,null,740,1.3452000684435917E-3,1.0474302727525803E-23,0,null,740,9.6135888390774574E-6,0,0]
[750,1.332959311396263E-3,1.2879779672735494E-23,0,null,750,1.3329611346720299E-3,1.3227670027749132E-23,0,null,750,9.5261224609612798E-6,0,0]
[760,1.320825008808026E-3,1.4478200790706774E-23,0,null,760,1.3208268164426116E-3,1.5138318441587344E-23,0,null,760,9.4394037002453271E-6,3.1643084015099825E-26,0]
[770,1.3087951749666919E-3,1.4538725543371223E-23,0,null,770,1.3087969669860011E-3,1.554452515793491E-23,0,null,770,9.3534315110929557E-6,9.1826369991680471E-26,0]
[780,1.2968695739482099E-3,1.2410700111387745E-23,0,null,780,1.2968713503953855E-3,1.3756757366032864E-23,0,null,780,9.2682042101664262E-6,1.6707317591475175E-25,0]
[790,1.2850478917424935E-3,7.5136818353761047E-24,0,null,790,1.2850496526679708E-3,9.1436915718183828E-24,0,null,790,9.1837195558032199E-6,2.5161280247736866E-25,0]
[800,1.2733297460569852E-3,0,0,null,800,1.2733314915239055E-3,1.2332652409119186E-24,0,null,800,9.099974818082335E-6,3.358803213548429E-25,0]
[810,1.261714694950481E-3,0,0,null,810,1.2617164250288732E-3,0,0,null,810,9.0169668405337182E-6,4.0665701659395115E-25,0]
[820,1.2502022445232098E-3,0,1.0949616645346881E-39,null,820,1.2502039592906175E-3,0,8.1501988270135887E-40,null,820,8.9346920951610116E-6,4.4778094985011099E-25,0]
[830,1.2387918556397977E-3,0,4.5352635458275218E-39,null,830,1.2387935551799332E-3,0,4.095064979507447E-39,null,830,8.8531467304789479E-6,4.4146562723922825E-25,0]
[840,1.2274829499702344E-3,0,1.1005498581071631E-38,null,840,1.2274846343719181E-3,0,1.0378162997161555E-38,null,840,8.7723266147554984E-6,3.7018909565039536E-25,0]
[850,1.2162749152624876E-3,0,2.1706447759205105E-38,null,850,1.2162765846198728E-3,0,2.0812046359436604E-38,null,850,8.6922273736325164E-6,2.1903374506403068E-25,0]
[860,1.2051671100450374E-3,0,3.8451299949190085E-38,null,860,1.2051687644549453E-3,0,3.7013680997176708E-38,null,860,8.6128444238695816E-6,0,0]
[870,1.1941588677755715E-3,0,6.5039748413886244E-38,null,870,1.1941605073414031E-3,0,6.2309757864812184E-38,null,870,8.5341730028466675E-6,0,1.397313358429296E-40]
[880,1.1832495005149098E-3,0,1.1029008264563865E-37,null,880,1.1832511253403466E-3,0,1.0459286214720068E-37,null,880,8.456208195003421E-6,0,3.2177999536451802E-40]
[890,1.1724383021768368E-3,0,1.9358871974073634E-37,null,890,1.1724399123695349E-3,0,1.8166328480072777E-37,null,890,8.3789449549848814E-6,0,5.736149689822716E-40]
[900,1.1617245514209231E-3,0,3.5386941016080152E-37,null,900,1.1617261470879643E-3,0,3.2997871957491659E-37,null,900,8.3023781282930893E-6,0,8.8152265216030114E-40]
[910,1.1511075141815395E-3,0,6.6292716239995898E-37,null,910,1.1511090954344891E-3,0,6.1771268587566627E-37,null,910,8.2265024694285786E-6,0,1.2465672903717784E-39]
[920,1.1405864459221736E-3,0,1.2440022749896684E-36,null,920,1.1405880128725809E-3,0,1.1630223233503184E-36,null,920,8.1513126580797636E-6,0,1.748336557865951E-39]
[930,1.1301605936406278E-3,5.0375875826106218E-23,2.2968000945455435E-36,null,930,1.1301621464032084E-3,4.0199557055517052E-23,2.1586146245265098E-36,null,930,8.0768033132230517E-6,0,2.6592284116592631E-39]
[940,1.119829197616911E-3,1.2430987173938449E-22,4.1307203458793163E-36,null,940,1.1198307363044164E-3,1.1529125877667181E-22,3.9042717127372495E-36,null,940,8.0029690058931873E-6,0,4.6169905255272347E-39]
[950,1.1095914929838003E-3,2.0946586009139676E-22,7.2091523370559377E-36,null,950,1.1095930177089999E-3,2.0258289848806348E-22,6.8500757358453616E-36,null,950,7.9298042702612329E-6,0,8.8555164432944653E-39]
[960,1.0994467110945674E-3,3.0231238021819008E-22,1.2209125999699076E-35,null,960,1.099448221976447E-3,2.985598297075148E-22,1.1654578327765647E-35,null,960,7.8573036134545912E-6,0,1.7487244662049244E-38]
[970,1.0893940807475545E-3,3.9818074815648339E-22,2.0101902030410337E-35,null,970,1.0893955779005529E-3,3.9848237507146478E-22,1.9263638120542093E-35,null,970,7.7854615242756593E-6,0,3.3830040496003684E-38]
[980,1.0794328292462528E-3,4.9147017857680654E-22,3.2260260981916615E-35,null,980,1.0794343127848007E-3,4.9657433217197508E-22,3.1016157558663352E-35,null,980,7.7142724808615207E-6,0,6.2782749802653079E-38]
[990,1.0695621833812128E-3,5.7597595826153348E-22,5.0595819106905601E-35,null,990,1.0695636534213161E-3,5.863355080402793E-22,4.8781002964850749E-35,null,990,7.6437309575917818E-6,1.0861278971735132E-24,1.1128047843913557E-37]
[1000,1.0597813702115711E-3,6.4534697443390424E-22,7.7722750778055932E-35,null,1000,1.059782826870034E-3,6.609837178351179E-22,7.5123053764230587E-35,null,1000,7.5738314307804249E-6,2.9811419919091537E-24,1.8890206792054249E-37]
[]
[]
["Saved  29/03/2023: 15:49:12  Level Number: 5"]
[]
["BREAKTHROUGH RESULTS"]
[]
["Advanced"]
["Pollutant Linkage: Inert Restorati, Attenuation Layer, Beenham Grange Formation",null,null,null,null,"Pollutant Linkage: Inert Restorati, Attenuation Layer, Beenham Grange Formation, Groundwater",null,null,null,null,"Pollutant Linkage: Inert Restorati, Attenuation Layer, Beenham Grange Formation, River Enborne"]
["Concentrations in mg/L in Beenham Grange Formation",null,null,null,null,"Concentrations in mg/L in Groundwater",null,null,null,null,"Concentrations in mg/L in River Enborne"]
[]
["Compared with EAL (GW) target concentration in mg/L",null,null,null,null,"Compared with EAL (GW) target concentration in mg/L",null,null,null,null,"Compared with EAL (River Enborne) target concentration in mg/L"]
[null,0.39,1E-3,2.0000000000000001E-4,null,null,0.39,1E-3,2.0000000000000001E-4,null,null,0.39,1E-3,2.0000000000000001E-4]
[]
["Time(years)","Species1","Species2","Species3",null,"Time(years)","Species1","Species2","Species3",null,"Time(years)","Species1","Species2","Species3"]
[null,"Ammoniacial Nitrogen","Copper","Lead",null,null,"Ammoniacial Nitrogen","Copper","Lead",null,null,"Ammoniacial Nitrogen","Copper","Lead"]
[10,9.724413111029293E-13,0,0,null,10,9.6925044158337405E-13,0,0,null,10,6.2995570238594956E-15,0,0]
[20,6.0803208325218186E-8,0,0,null,20,6.0752643131269424E-8,0,0,null,20,4.2380558070584274E-10,0,0]
[30,2.5078976910156756E-6,0,0,null,30,2.5069642465247949E-6,0,0,null,30,1.7723026417918811E-8,0,0]
[40,1.624800523908653E-5,0,0,null,40,1.624459626929074E-5,0,0,null,40,1.1538404388102445E-7,0,0]
[50,4.9859746245870109E-5,0,0,null,50,4.9853064876021085E-5,0,0,null,50,3.5488229162005523E-7,0,0]
[60,1.0498626326315561E-4,0,0,null,60,1.0497654960077112E-4,0,0,null,60,7.4818268493227068E-7,0,0]
[70,1.7799526944731287E-4,0,0,null,70,1.7798328035388236E-4,0,0,null,70,1.2694388848244439E-6,0,0]
[80,2.6334817498954629E-4,0,0,null,80,2.6333476064339739E-4,0,0,null,80,1.8790906238808214E-6,0,0]
[90,3.5565729324779866E-4,0,0,null,90,3.5564319682338289E-4,0,0,null,90,2.5386129827028857E-6,0,0]
[100,4.5050338541446943E-4,0,0,null,100,4.504891832797309E-4,0,0,null,100,3.2163889889145386E-6,0,0]
[110,5.4458782255877903E-4,0,0,null,110,5.4457392890727436E-4,0,0,null,110,3.8888108597611045E-6,0,0]
[120,6.3561061875214511E-4,0,0,null,120,6.3559731281841929E-4,0,0,null,120,4.5394132471399116E-6,0,0]
[130,7.2206981008863809E-4,0,0,null,130,7.2205726705691935E-4,0,0,null,130,5.1574403375176431E-6,0,0]
[140,8.0306441153623308E-4,0,0,null,140,8.0305272997030009E-4,0,0,null,140,5.7364369781176409E-6,0,0]
[150,8.7812884649397641E-4,0,0,null,150,8.7811807036788697E-4,0,0,null,150,6.2730643031073105E-6,0,0]
[160,9.4710353871663958E-4,0,0,null,160,9.4709367421919673E-4,0,0,null,160,6.7661738234189655E-6,0,0]
[170,1.0100377475359709E-3,0,0,null,170,1.0100287755019032E-3,0,0,null,170,7.2161121196291734E-6,0,0]
[180,1.0671184277317135E-3,0,0,null,180,1.0671103126504769E-3,0,0,null,180,7.6242117188239421E-6,0,0]
[190,1.1186190704836347E-3,0,0,null,190,1.1186117669257296E-3,0,0,null,190,7.9924249424081682E-6,0,0]
[200,1.1648634572646857E-3,0,0,null,200,1.1648569144001857E-3,0,0,null,200,8.3230644711270943E-6,0,0]
[210,1.2062003521659723E-3,0,0,null,210,1.206194516893561E-3,0,0,null,210,8.6186221905450803E-6,0,0]
[220,1.2429861248676132E-3,0,0,null,220,1.2429809439406161E-3,0,0,null,220,8.8816447943657567E-6,0,0]
[230,1.2755730741979615E-3,0,0,null,230,1.2755684956325473E-3,0,0,null,230,9.114650186998394E-6,0,0]
[240,1.3043018191602868E-3,0,0,null,240,1.3042977931334286E-3,0,0,null,240,9.3200729980303081E-6,0,0]
[250,1.3294965707136696E-3,1.6562623872442829E-40,0,null,250,1.3294930501013072E-3,1.8465772429176649E-40,0,null,250,9.5002307157171022E-6,0,0]
[260,1.351462426454478E-3,0,0,null,260,1.3514593671181043E-3,0,0,null,260,9.6573043000077357E-6,0,0]
[270,1.3704840704416121E-3,0,0,null,270,1.370481431341844E-3,0,0,null,270,9.7933288538917574E-6,0,0]
[280,1.3868254348056652E-3,2.5727005132082444E-38,0,null,280,1.3868231779976593E-3,2.0914275267859709E-38,0,null,280,9.9101911799385014E-6,0,0]
[290,1.4007300060534986E-3,1.5524976702402816E-37,0,null,290,1.4007280966053281E-3,1.3579601429411118E-37,0,null,290,1.0009631952569684E-5,0,0]
[300,1.4124215502462386E-3,8.5690776372934334E-37,0,null,300,1.4124199561078702E-3,6.853302483739599E-37,0,null,300,1.0093250889816209E-5,0,0]
[310,1.4221050971045064E-3,5.5360429233001966E-36,0,null,310,1.4221037889467984E-3,4.5110258904350427E-36,0,null,310,1.0162513779741448E-5,9.7082657151962092E-40,0]
[320,1.4299680706237362E-3,2.9415346028032393E-35,0,null,320,1.4299670216631373E-3,2.5207860803481426E-35,0,null,320,1.0218760556854471E-5,6.543550010779523E-39,0]
[330,1.4361814879816238E-3,1.2255869687422787E-34,0,null,330,1.4361806737982752E-3,1.0852699059334581E-34,0,null,330,1.0263213868642807E-5,1.7573658361655237E-38,0]
[340,1.4409011731374886E-3,4.2322649442379028E-34,0,null,340,1.440900571494028E-3,3.8362907176701859E-34,0,null,340,1.0296987748510409E-5,8.5094099552667973E-38,0]
[350,1.4442689491755204E-3,1.2386253015673333E-33,0,null,350,1.4442685398431321E-3,1.1531055632308153E-33,0,null,350,1.0321096137727995E-5,5.2695655219814682E-37,0]
[360,1.4464137860333384E-3,2.9764159552987892E-33,0,null,360,1.446413550622472E-3,2.8801128422803079E-33,0,null,360,1.0336461089149926E-5,2.3447428231843107E-36,0]
[370,1.4474528892354378E-3,5.2741597299871606E-33,0,null,370,1.4474528110383768E-3,5.4643773669540191E-33,0,null,370,1.0343920549684841E-5,7.9493154440527674E-36,0]
[380,1.4474927215652191E-3,4.0171997579794417E-33,0,null,380,1.4474927854090411E-3,5.4899929506054698E-33,0,null,380,1.0344235663703041E-5,2.2888824598298228E-35,0]
[390,1.446629954008636E-3,0,0,null,390,1.4466301461178574E-3,0,0,null,390,1.033809757106165E-5,5.8471619824401618E-35,0]
[400,1.4449523453490254E-3,0,0,null,400,1.4449526532192176E-3,0,0,null,400,1.032613369522532E-5,1.278318047709141E-34,0]
[410,1.4425395518085403E-3,0,0,null,410,1.4425399640902292E-3,0,0,null,410,1.0308913531416161E-5,2.120512047364018E-34,0]
[420,1.439463869468041E-3,0,0,null,420,1.4394643758607328E-3,0,0,null,420,1.0286953954283993E-5,1.5953929501494912E-34,0]
[430,1.4357909130050279E-3,0,0,null,430,1.435791504159368E-3,0,0,null,430,1.0260724070342158E-5,0,0]
[440,1.4315802347340022E-3,0,0,null,440,1.431580902165855E-3,0,0,null,440,1.0230649643674852E-5,0,0]
[450,1.4268858881418068E-3,0,0,null,450,1.426886624148587E-3,0,0,null,450,1.0197117124830819E-5,0,0]
[460,1.4217569401559216E-3,2.9354476474924023E-30,0,null,460,1.421757737745954E-3,2.0998437938487372E-30,0,null,460,1.0160477313254572E-5,0,0]
[470,1.4162379362329634E-3,1.2357686960501845E-29,0,null,470,1.4162387890582447E-3,1.0955527134750809E-29,0,null,470,1.012104868235479E-5,0,0]
[480,1.4103693222777378E-3,3.0417284072542813E-29,0,null,480,1.4103702245736234E-3,2.8695355603410224E-29,0,null,480,1.0079120396038463E-5,0,0]
[490,1.4041878271035273E-3,5.7583603007295156E-29,0,null,490,1.4041887736355981E-3,5.6576886574338871E-29,0,null,490,1.0034955043061115E-5,0,0]
[500,1.3977268089705214E-3,8.7404632148989828E-29,0,null,500,1.3977277949839685E-3,8.9404067129476463E-29,0,null,500,9.9887911146060247E-6,2.4589796158710254E-32,0]
[510,1.3910165694445387E-3,1.0046557677081511E-28,0,null,510,1.3910175906201726E-3,1.0922366777353426E-28,0,null,510,9.9408452482116884E-6,2.3262783752845304E-31,0]
[520,1.3840846376117562E-3,5.8914572519211329E-29,0,null,520,1.3840856900249718E-3,7.9101393249263628E-29,0,null,520,9.8913142597735086E-6,6.6922827756963212E-31,0]
[530,1.3769560273818721E-3,0,0,null,530,1.3769571074665854E-3,0,0,null,530,9.8403769830991417E-6,1.4000826896250332E-30,0]
[540,1.3696534704440175E-3,0,0,null,540,1.3696545749587116E-3,0,0,null,540,9.7881959354772191E-6,2.3748205858458781E-30,0]
[550,1.3621976271612391E-3,0,0,null,550,1.3621987531603787E-3,0,0,null,550,9.7349188254106777E-6,3.2871167191053657E-30,0]
[560,1.3546072775152142E-3,0,0,null,560,1.3546084223213513E-3,0,0,null,560,9.6806799178156413E-6,3.4125747015978563E-30,0]
[570,1.3468994940030394E-3,0,0,null,570,1.3469006551804353E-3,0,0,null,570,9.6256012701147284E-6,1.4928068234662342E-30,0]
[580,1.3390897982233029E-3,0,0,null,580,1.3390909735593352E-3,0,0,null,580,9.5697938517756781E-6,0,0]
[590,1.3311923027127467E-3,0,0,null,590,1.3311934901945883E-3,0,0,null,590,9.5133585583404523E-6,0,0]
[600,1.3232198394413205E-3,0,0,null,600,1.3232210372390975E-3,0,0,null,600,9.4563871301189695E-6,0,0]
[610,1.3151840762761699E-3,2.9168865987235844E-27,0,null,610,1.3151852827253357E-3,2.0509697384092994E-27,0,null,610,9.3989629848266734E-6,0,0]
[620,1.3070956225323803E-3,1.0328659453470872E-26,0,null,620,1.3070968361200662E-3,9.3036477385015889E-27,0,null,620,9.341161972221667E-6,0,0]
[630,1.2989641246930093E-3,2.1234748952999322E-26,0,null,630,1.2989653440440686E-3,2.0283838159842271E-26,0,null,630,9.2830530584582489E-6,0,0]
[640,1.290798353214785E-3,3.4997756079638913E-26,0,null,640,1.2907995770785195E-3,3.4522704418825352E-26,0,null,640,9.2246989466700473E-6,0,0]
[650,1.2826062812853194E-3,4.9589493856014309E-26,0,null,650,1.2826075085253317E-3,5.0156953967302301E-26,0,null,650,9.1661566400807788E-6,0,0]
[660,1.2743951562937334E-3,6.1227615757872447E-26,0,null,660,1.2743963858760721E-3,6.3514498226794045E-26,0,null,660,9.1074779529392766E-6,5.6317151130110391E-29,0]
[670,1.2661715647172794E-3,6.4270238395956734E-26,0,null,670,1.2661727957024851E-3,6.8944794382227746E-26,0,null,670,9.0487099744408225E-6,2.5999423066301917E-28,0]
[680,1.2579414910394004E-3,5.1528882915253398E-26,0,null,680,1.2579427225748077E-3,5.9064621488040954E-26,0,null,680,8.9898954899349441E-6,5.6453551399544233E-28,0]
[690,1.2497103712747913E-3,1.5129868170009113E-26,0,null,690,1.2497116025862376E-3,2.5564829545798114E-26,0,null,690,8.9310733636442287E-6,9.587270602621078E-28,0]
[700,1.2414831415975692E-3,0,0,null,700,1.2414843719802933E-3,0,0,null,700,8.8722788862693188E-6,1.3972592136649177E-27,0]
[710,1.2332642825462988E-3,0,0,null,710,1.2332655113625555E-3,0,0,null,710,8.8135440910279948E-6,1.790737824146987E-27,0]
[720,1.2250578592253706E-3,0,0,null,720,1.2250590858966031E-3,0,0,null,720,8.7548980411355107E-6,2.0011631908492532E-27,0]
[730,1.216867557853712E-3,0,0,null,730,1.2168687818543702E-3,0,0,null,730,8.6963670910273461E-6,1.8466953096845425E-27,0]
[740,1.20869671903114E-3,0,0,null,740,1.2086979398865561E-3,0,0,null,740,8.6379751242291513E-6,1.1190313042353856E-27,0]
[750,1.2005483680084801E-3,0,0,null,750,1.2005495852874515E-3,0,0,null,750,8.5797437697677583E-6,0,0]
[760,1.1924252422469363E-3,0,0,null,760,1.1924264555614324E-3,0,0,null,760,8.5216925991828482E-6,0,0]
[770,1.184329816511228E-3,0,0,null,770,1.1843310255081115E-3,0,0,null,770,8.4638393059586955E-6,0,0]
[780,1.1762643257408464E-3,0,0,null,780,1.1762655301034322E-3,0,0,null,780,8.4061998689811259E-6,0,0]
[790,1.168230785874392E-3,0,0,null,790,1.1682319853156924E-3,0,0,null,790,8.348788701478012E-6,0,0]
[800,1.1602310128390964E-3,3.6403293360041211E-25,0,null,800,1.1602322071017138E-3,2.4078201925308122E-25,0,null,800,8.2916187867515619E-6,0,0]
[810,1.1522666398712657E-3,1.2558809864749982E-24,0,null,810,1.1522678287240698E-3,1.1316584410495015E-24,0,null,810,8.2347018020013947E-6,0,0]
[820,1.1443391333001553E-3,2.3939074905167765E-24,0,null,820,1.1443403165356386E-3,2.2869205398771741E-24,0,null,820,8.1780482311827588E-6,0,0]
[830,1.136449806955429E-3,3.7251831938997017E-24,0,null,830,1.1364509843873338E-3,3.658448429196244E-24,0,null,830,8.1216674679773231E-6,0,0]
[840,1.1285998353105903E-3,5.151899583228036E-24,0,null,840,1.1286010067731794E-3,5.1518403361941104E-24,0,null,840,8.0655679098308629E-6,0,0]
[850,1.1207902654847095E-3,6.5290932371351368E-24,0,null,850,1.1207914308299244E-3,6.6232964862393795E-24,0,null,850,8.0097570436484326E-6,0,0]
[860,1.113022028199704E-3,7.6673103433412238E-24,0,null,860,1.1130231872963036E-3,7.8815093405856459E-24,0,null,860,7.9542415242484876E-6,1.4829395930225314E-26,0]
[870,1.1052959477767645E-3,8.3410172318232659E-24,0,null,870,1.1052971005101476E-3,8.6954702229082068E-24,0,null,870,7.8990272457199811E-6,4.0504687284014093E-26,0]
[880,1.0976127512823484E-3,8.3030742801385219E-24,0,null,880,1.0976138975502231E-3,8.8086107892260057E-24,0,null,880,7.8441194068931491E-6,7.2216809741383567E-26,0]
[890,1.0899730768787928E-3,7.3049990579776749E-24,0,null,890,1.0899742165915666E-3,7.9590914242415226E-24,0,null,890,7.7895225710023136E-6,1.0827261726694499E-25,0]
[900,1.0823774814595118E-3,5.1221029067913254E-24,0,null,900,1.082378614539122E-3,5.9053809934678646E-24,0,null,900,7.7352407202584149E-6,1.4586024438339617E-25,0]
[910,1.0748264476218986E-3,1.5819549922812674E-24,0,null,910,1.0748275740023331E-3,2.4556071123694504E-24,0,null,910,7.6812773057231465E-6,1.8104232894095343E-25,0]
[920,1.0673203900453359E-3,0,0,null,920,1.0673215096686601E-3,0,0,null,920,7.6276352929343063E-6,2.0887373992657023E-25,0]
[930,1.0598596613360541E-3,0,0,null,930,1.0598607741541964E-3,0,0,null,930,7.5743172035808396E-6,2.2365725190095289E-25,0]
[940,1.0524445573544994E-3,0,1.0994178110617722E-39,null,940,1.052445663327254E-3,0,9.3559594924055726E-40,null,940,7.5213251537375188E-6,2.1933819785013903E-25,0]
[950,1.0450753221141881E-3,0,3.1444026105150393E-39,null,950,1.0450764212075994E-3,0,2.9074922390006237E-39,null,950,7.4686608887810675E-6,1.9002496100619433E-25,0]
[960,1.0377521522335117E-3,0,6.6078413626455512E-39,null,960,1.0377532444228214E-3,0,6.2855914771133822E-39,null,960,7.4163258152693673E-6,1.3060754372319827E-25,0]
[970,1.0304752010391969E-3,0,1.1967430731834703E-38,null,970,1.0304762863048761E-3,0,1.1525620597532706E-38,null,970,7.3643210302416638E-6,3.7432820243816663E-26,0]
[980,1.0232445823108052E-3,0,1.9919439506744263E-38,null,980,1.0232456606370261E-3,0,1.9257836822899897E-38,null,980,7.3126473480160126E-6,0,0]
[990,1.0160603737197605E-3,0,3.1776606668851397E-38,null,990,1.0160614450985582E-3,0,3.0650436382625145E-38,null,990,7.2613053247513518E-6,0,0]
[1000,1.0089226199500184E-3,0,5.0278939154041421E-38,null,1000,1.0089236843766052E-3,0,4.8176070733541709E-38,null,1000,7.2102952807848964E-6,0,1.6187380494048214E-40]
[]
[]
["Saved  29/03/2023: 16:53:06  Level Number: 5"]
[]
["BREAKTHROUGH RESULTS"]
[]
["Advanced"]
["Pollutant Linkage: Inert Restorati, Attenuation Layer, Beenham Grange Formation",null,null,null,null,"Pollutant Linkage: Inert Restorati, Attenuation Layer, Beenham Grange Formation, Groundwater",null,null,null,null,"Pollutant Linkage: Inert Restorati, Attenuation Layer, Beenham Grange Formation, River Enborne"]
["Concentrations in mg/L in Beenham Grange Formation",null,null,null,null,"Concentrations in mg/L in Groundwater",null,null,null,null,"Concentrations in mg/L in River Enborne"]
[]
["Compared with EAL (GW) target concentration in mg/L",null,null,null,null,"Compared with EAL (GW) target concentration in mg/L",null,null,null,null,"Compared with EAL (River Enborne) target concentration in mg/L"]
[null,0.39,1E-3,2.0000000000000001E-4,null,null,0.39,1E-3,2.0000000000000001E-4,null,null,0.39,1E-3,2.0000000000000001E-4]
[]
["Time(years)","Species1","Species2","Species3",null,"Time(years)","Species1","Species2","Species3",null,"Time(years)","Species1","Species2","Species3"]
[null,"Ammoniacial Nitrogen","Copper","Lead",null,null,"Ammoniacial Nitrogen","Copper","Lead",null,null,"Ammoniacial Nitrogen","Copper","Lead"]
[10,2.6052310850188996E-11,0,0,null,10,2.5977335292286383E-11,0,0,null,10,1.7080419729461068E-13,0,0]
[20,4.1520306611249817E-7,0,0,null,20,4.1490102622847968E-7,0,0,null,20,2.903061518310775E-9,0,0]
[30,1.0673481112074599E-5,0,0,null,30,1.0670024267248422E-5,0,0,null,30,7.5537706426656018E-8,0,0]
[40,5.3966874601172265E-5,0,0,null,40,5.3957096284106561E-5,0,0,null,40,3.8357112463275562E-7,0,0]
[50,1.4153249594169303E-4,0,0,null,50,1.4151627366118156E-4,0,0,null,50,1.0079594519209716E-6,0,0]
[60,2.6669170272595701E-4,0,0,null,60,2.6667083865329242E-4,0,0,null,60,1.9013887505283937E-6,0,0]
[70,4.1560538126473435E-4,0,0,null,70,4.155820250244897E-4,0,0,null,70,2.9650356433560365E-6,0,0]
[80,5.7493801284436597E-4,0,0,null,80,5.7491394566094259E-4,0,0,null,80,4.1035216919908089E-6,0,0]
[90,7.3453938188619203E-4,0,0,null,90,7.3451585930298211E-4,0,0,null,90,5.2441976810488586E-6,0,0]
[100,8.8762713904337565E-4,0,0,null,100,8.8760495278164553E-4,0,0,null,100,6.3384953879821159E-6,0,0]
[110,1.030140047938741E-3,0,0,null,110,1.0301196410176434E-3,0,0,null,110,7.3573171629433059E-6,0,0]
[120,1.1599775720287963E-3,0,0,null,120,1.1599591460306645E-3,0,0,null,120,8.2856001195644933E-6,0,0]
[130,1.2763599730863206E-3,0,0,null,130,1.2763435716014908E-3,0,0,null,130,9.1177381005335728E-6,0,0]
[140,1.3793514136165278E-3,0,0,null,140,1.3793369821211918E-3,0,0,null,140,9.8541685682747774E-6,0,0]
[150,1.4695256099995985E-3,0,0,null,150,1.4695130369069805E-3,0,0,null,150,1.0498979221736259E-5,0,0]
[160,1.5477401213778779E-3,0,0,null,160,1.5477292653069486E-3,0,0,null,160,1.1058292038916785E-5,0,0]
[170,1.6149883344169955E-3,0,0,null,170,1.6149790418133179E-3,0,0,null,170,1.1539203444611004E-5,0,0]
[180,1.6723051107722688E-3,0,0,null,180,1.6722972269515074E-3,0,0,null,180,1.1949108627111846E-5,0,0]
[190,1.720708686998925E-3,0,0,null,190,1.7207020627888498E-3,0,0,null,190,1.2295285392660191E-5,0,0]
[200,1.7611666604509036E-3,0,0,null,200,1.7611611559326852E-3,0,0,null,200,1.258465046779703E-5,0,0]
[210,1.7945777325834716E-3,0,0,null,210,1.7945732189522019E-3,0,0,null,210,1.2823628627709973E-5,0,0]
[220,1.8217635822937665E-3,3.100290481561255E-40,0,null,220,1.821759942522171E-3,3.7616624141663968E-40,0,null,220,1.3018094363945031E-5,0,0]
[230,1.8434671031466706E-3,0,0,null,230,1.8434642319101447E-3,0,0,null,230,1.3173359128341439E-5,0,0]
[240,1.8603545051990393E-3,6.7153264315052582E-39,0,null,240,1.8603523083619985E-3,2.0426603229056025E-39,0,null,240,1.3294186259274031E-5,0,0]
[250,1.873019638000344E-3,1.3097014300126593E-37,0,null,250,1.8730180318626455E-3,1.1357498732134465E-37,0,null,250,1.3384821823413107E-5,0,0]
[260,1.8819894666240683E-3,8.5273239788617765E-37,0,null,260,1.8819883770527543E-3,6.7889522625099669E-37,0,null,260,1.3449033724674381E-5,0,0]
[270,1.8877300175481084E-3,7.1310431765915104E-36,0,null,270,1.8877293790773085E-3,5.5846879175834663E-36,0,null,270,1.3490154188124492E-5,0,0]
[280,1.8906523677081934E-3,4.9440970209788592E-35,0,null,280,1.8906521226529809E-3,4.1385590060354894E-35,0,null,280,1.3511122563023715E-5,8.1244641483008734E-39,0]
[290,1.8911184199302334E-3,2.49697136616603E-34,0,null,290,1.8911185175476788E-3,2.1804624734713249E-34,0,null,290,1.3514526605445085E-5,2.8315223649183822E-38,0]
[300,1.8894463195904771E-3,9.9194403208751885E-34,0,null,300,1.8894467153007699E-3,8.9279105389964684E-34,0,null,300,1.3502641200350498E-5,1.4436917411081961E-37,0]
[310,1.885915439840344E-3,3.1572792396751021E-33,0,null,310,1.885916094513645E-3,2.9535923342826455E-33,0,null,310,1.3477464001978543E-5,1.1268879120636928E-36,0]
[320,1.8807709090778262E-3,7.4467064990608047E-33,0,null,320,1.8807717883927598E-3,7.4225178693637174E-33,0,null,320,1.3440747803280131E-5,5.8649660347668682E-36,0]
[330,1.8742276831052286E-3,9.3000193014246227E-33,0,null,330,1.8742287569717129E-3,1.1065173533619011E-32,0,null,330,1.3394029651147693E-5,2.2130358904631714E-35,0]
[340,1.8664741816314498E-3,0,0,null,340,1.8664754236775414E-3,0,0,null,340,1.3338656847528259E-5,6.9382269059215803E-35,0]
[350,1.8576755183360922E-3,0,0,null,350,1.8576769054557904E-3,0,0,null,350,1.3275810044932557E-5,1.8448439503494896E-34,0]
[360,1.847976358254872E-3,0,0,null,360,1.8479778702040425E-3,0,0,null,360,1.3206523677578351E-5,3.7325394009989518E-34,0]
[370,1.8375034377016363E-3,0,0,null,370,1.837505056745223E-3,0,0,null,370,1.3131703979782197E-5,3.7156457303526647E-34,0]
[380,1.8263677813680061E-3,0,0,null,380,1.8263694919699793E-3,0,0,null,380,1.3052144839207547E-5,0,0]
[390,1.8146666495152074E-3,0,0,null,390,1.8146684380663206E-3,0,0,null,390,1.2968541720240335E-5,0,0]
[400,1.8024852458616259E-3,2.3132437703305389E-30,0,null,400,1.8024871004391318E-3,9.7721761563870798E-31,0,null,400,1.2881503876286607E-5,0,0]
[410,1.7898982141019146E-3,1.7831536127678726E-29,0,null,410,1.7899001242602229E-3,1.5223940030736813E-29,0,null,410,1.2791565050701489E-5,0,0]
[420,1.7769709482982608E-3,5.1964487608024088E-29,0,null,420,1.7769729048864144E-3,4.8511714403054118E-29,0,null,420,1.2699192846872507E-5,0,0]
[430,1.763760739752884E-3,1.0653405106074315E-28,0,null,430,1.7637627347526924E-3,1.0486707524990123E-28,0,null,430,1.2604796928999129E-5,0,0]
[440,1.7503177804706663E-3,1.6295092870286932E-28,0,null,440,1.7503198068602698E-3,1.6946494711360611E-28,0,null,440,1.25087361974562E-5,0,0]
[450,1.7366860409822665E-3,1.6203695246540801E-28,0,null,450,1.7366880926078085E-3,1.8733215768387029E-28,0,null,450,1.2411325065740686E-5,3.9982564551145628E-31,0]
[460,1.722904038289529E-3,0,0,null,460,1.7229061097617791E-3,4.412271088296175E-29,0,null,460,1.2312838951782441E-5,1.3548930084618514E-30,0]
[470,1.709005507646908E-3,0,0,null,470,1.7090075942461933E-3,0,0,null,470,1.2213519081496189E-5,3.0499883239848088E-30,0]
[480,1.69501999036977E-3,0,0,null,480,1.6950220879622844E-3,0,0,null,480,1.211357669205306E-5,5.2764309771006191E-30,0]
[490,1.6809733482193512E-3,0,0,null,490,1.6809754531889631E-3,0,0,null,490,1.2013196709957419E-5,6.9066035817307995E-30,0]
[500,1.666888213674482E-3,0,0,null,500,1.6668903228562139E-3,0,0,null,500,1.1912540970787374E-5,5.320791266568082E-30,0]
[510,1.6527843841589759E-3,0,0,null,510,1.6527864947851374E-3,0,0,null,510,1.1811751038104768E-5,0,0]
[520,1.6386791673668997E-3,0,0,null,520,1.6386812770189125E-3,0,0,null,520,1.1710950672779779E-5,0,0]
[530,1.6245876837786726E-3,1.1457967542241071E-27,0,null,530,1.6245897903438061E-3,0,0,null,530,1.1610247996072184E-5,0,0]
[540,1.6105231318347885E-3,1.3359445706484586E-26,0,null,540,1.6105252334701707E-3,1.1371261327335313E-26,0,null,540,1.1509737385842227E-5,0,0]
[550,1.596497020431027E-3,3.3466162458619191E-26,0,null,550,1.5964991155308847E-3,3.1480208196399285E-26,0,null,550,1.140950113893259E-5,0,0]
[560,1.5825193728438581E-3,6.0446675374853522E-26,0,null,560,1.5825214600113865E-3,5.9432215154194044E-26,0,null,560,1.1309610929398736E-5,0,0]
[570,1.5685989056767767E-3,8.9372010250177064E-26,0,null,570,1.568600983695619E-3,9.0795068096372205E-26,0,null,570,1.1210129088019577E-5,0,0]
[580,1.5547431859389853E-3,1.1014093395445067E-25,0,null,580,1.5547452537567398E-3,1.1578336425750942E-25,0,null,580,1.1111109725523585E-5,7.543111500524946E-30,0]
[590,1.5409587689878149E-3,1.0720799684002485E-25,0,null,590,1.5409608256933534E-3,1.1873635287663216E-25,0,null,590,1.1012599718914815E-5,3.997194345692598E-28,0]
[600,1.527251319708361E-3,6.1000120587533843E-26,0,null,600,1.5272533645151009E-3,7.9278937846603901E-26,0,null,600,1.0914639577971214E-5,1.0463495220365309E-27,0]
[610,1.5136257190283696E-3,0,0,null,610,1.5136277512595325E-3,0,0,null,610,1.0817264206872407E-5,1.9282207205143442E-27,0]
[620,1.5000861575546244E-3,0,0,null,620,1.5000881766303507E-3,0,0,null,620,1.0720503573727004E-5,2.9183598104020529E-27,0]
[630,1.4866362179318036E-3,0,0,null,630,1.4866382233587464E-3,0,0,null,630,1.0624383299512191E-5,3.7444867244692533E-27,0]
[640,1.4732789473197608E-3,0,0,null,640,1.4732809386784032E-3,0,0,null,640,1.0528925176247101E-5,3.9748836864807159E-27,0]
[650,1.4600169211834652E-3,0,0,null,650,1.4600188981226886E-3,0,0,null,650,1.0434147623209193E-5,3.0458458059015043E-27,0]
[660,1.4468522994504351E-3,0,0,null,660,1.4468542616738794E-3,0,0,null,660,1.0340066088378982E-5,3.4551812734882605E-28,0]
[670,1.4337868760058077E-3,0,0,null,670,1.4337888232697142E-3,0,0,null,670,1.0246693402434835E-5,0,0]
[680,1.4208221222835201E-3,0,0,null,680,1.420824054390535E-3,0,0,null,680,1.01540400903709E-5,0,0]
[690,1.4079592257019119E-3,0,0,null,690,1.4079611424946158E-3,0,0,null,690,1.0062114646423529E-5,0,0]
[700,1.3951991235540459E-3,6.1281264223034495E-25,0,null,700,1.3952010249079049E-3,3.6582801383010816E-25,0,null,700,9.9709237762883346E-6,0,0]
[710,1.3825425328951723E-3,2.4231004914526163E-24,0,null,710,1.3825444187182917E-3,2.1752188040343184E-24,0,null,710,9.8804726108530342E-6,0,0]
[720,1.3699899769226297E-3,4.7843854535249526E-24,0,null,720,1.3699918471507008E-3,4.584825809541376E-24,0,null,720,9.7907648949133813E-6,0,0]
[730,1.3575418082624163E-3,7.5358401651989055E-24,0,null,730,1.3575436628528433E-3,7.4476283906724586E-24,0,null,730,9.7018031535506332E-6,0,0]
[740,1.3451982295086705E-3,1.0379865689976737E-23,0,null,740,1.3452000684435917E-3,1.0474302727525803E-23,0,null,740,9.6135888390774574E-6,0,0]
[750,1.332959311396263E-3,1.2879779672735494E-23,0,null,750,1.3329611346720299E-3,1.3227670027749132E-23,0,null,750,9.5261224609612798E-6,0,0]
[760,1.320825008808026E-3,1.4478200790706774E-23,0,null,760,1.3208268164426116E-3,1.5138318441587344E-23,0,null,760,9.4394037002453271E-6,3.1643084015099825E-26,0]
[770,1.3087951749666919E-3,1.4538725543371223E-23,0,null,770,1.3087969669860011E-3,1.554452515793491E-23,0,null,770,9.3534315110929557E-6,9.1826369991680471E-26,0]
[780,1.2968695739482099E-3,1.2410700111387745E-23,0,null,780,1.2968713503953855E-3,1.3756757366032864E-23,0,null,780,9.2682042101664262E-6,1.6707317591475175E-25,0]
[790,1.2850478917424935E-3,7.5136818353761047E-24,0,null,790,1.2850496526679708E-3,9.1436915718183828E-24,0,null,790,9.1837195558032199E-6,2.5161280247736866E-25,0]
[800,1.2733297460569852E-3,0,0,null,800,1.2733314915239055E-3,1.2332652409119186E-24,0,null,800,9.099974818082335E-6,3.358803213548429E-25,0]
[810,1.261714694950481E-3,0,0,null,810,1.2617164250288732E-3,0,0,null,810,9.0169668405337182E-6,4.0665701659395115E-25,0]
[820,1.2502022445232098E-3,0,1.0949616645346881E-39,null,820,1.2502039592906175E-3,0,8.1501988270135887E-40,null,820,8.9346920951610116E-6,4.4778094985011099E-25,0]
[830,1.2387918556397977E-3,0,4.5352635458275218E-39,null,830,1.2387935551799332E-3,0,4.095064979507447E-39,null,830,8.8531467304789479E-6,4.4146562723922825E-25,0]
[840,1.2274829499702344E-3,0,1.1005498581071631E-38,null,840,1.2274846343719181E-3,0,1.0378162997161555E-38,null,840,8.7723266147554984E-6,3.7018909565039536E-25,0]
[850,1.2162749152624876E-3,0,2.1706447759205105E-38,null,850,1.2162765846198728E-3,0,2.0812046359436604E-38,null,850,8.6922273736325164E-6,2.1903374506403068E-25,0]
[860,1.2051671100450374E-3,0,3.8451299949190085E-38,null,860,1.2051687644549453E-3,0,3.7013680997176708E-38,null,860,8.6128444238695816E-6,0,0]
[870,1.1941588677755715E-3,0,6.5039748413886244E-38,null,870,1.1941605073414031E-3,0,6.2309757864812184E-38,null,870,8.5341730028466675E-6,0,1.397313358429296E-40]
[880,1.1832495005149098E-3,0,1.1029008264563865E-37,null,880,1.1832511253403466E-3,0,1.0459286214720068E-37,null,880,8.456208195003421E-6,0,3.2177999536451802E-40]
[890,1.1724383021768368E-3,0,1.9358871974073634E-37,null,890,1.1724399123695349E-3,0,1.8166328480072777E-37,null,890,8.3789449549848814E-6,0,5.736149689822716E-40]
[900,1.1617245514209231E-3,0,3.5386941016080152E-37,null,900,1.1617261470879643E-3,0,3.2997871957491659E-37,null,900,8.3023781282930893E-6,0,8.8152265216030114E-40]
[910,1.1511075141815395E-3,0,6.6292716239995898E-37,null,910,1.1511090954344891E-3,0,6.1771268587566627E-37,null,910,8.2265024694285786E-6,0,1.2465672903717784E-39]
[920,1.1405864459221736E-3,0,1.2440022749896684E-36,null,920,1.1405880128725809E-3,0,1.1630223233503184E-36,null,920,8.1513126580797636E-6,0,1.748336557865951E-39]
[930,1.1301605936406278E-3,5.0375875826106218E-23,2.2968000945455435E-36,null,930,1.1301621464032084E-3,4.0199557055517052E-23,2.1586146245265098E-36,null,930,8.0768033132230517E-6,0,2.6592284116592631E-39]
[940,1.119829197616911E-3,1.2430987173938449E-22,4.1307203458793163E-36,null,940,1.1198307363044164E-3,1.1529125877667181E-22,3.9042717127372495E-36,null,940,8.0029690058931873E-6,0,4.6169905255272347E-39]
[950,1.1095914929838003E-3,2.0946586009139676E-22,7.2091523370559377E-36,null,950,1.1095930177089999E-3,2.0258289848806348E-22,6.8500757358453616E-36,null,950,7.9298042702612329E-6,0,8.8555164432944653E-39]
[960,1.0994467110945674E-3,3.0231238021819008E-22,1.2209125999699076E-35,null,960,1.099448221976447E-3,2.985598297075148E-22,1.1654578327765647E-35,null,960,7.8573036134545912E-6,0,1.7487244662049244E-38]
[970,1.0893940807475545E-3,3.9818074815648339E-22,2.0101902030410337E-35,null,970,1.0893955779005529E-3,3.9848237507146478E-22,1.9263638120542093E-35,null,970,7.7854615242756593E-6,0,3.3830040496003684E-38]
[980,1.0794328292462528E-3,4.9147017857680654E-22,3.2260260981916615E-35,null,980,1.0794343127848007E-3,4.9657433217197508E-22,3.1016157558663352E-35,null,980,7.7142724808615207E-6,0,6.2782749802653079E-38]
[990,1.0695621833812128E-3,5.7597595826153348E-22,5.0595819106905601E-35,null,990,1.0695636534213161E-3,5.863355080402793E-22,4.8781002964850749E-35,null,990,7.6437309575917818E-6,1.0861278971735132E-24,1.1128047843913557E-37]
[1000,1.0597813702115711E-3,6.4534697443390424E-22,7.7722750778055932E-35,null,1000,1.059782826870034E-3,6.609837178351179E-22,7.5123053764230587E-35,null,1000,7.5738314307804249E-6,2.9811419919091537E-24,1.8890206792054249E-37]
[]
[]
["Saved  27/03/2024: 22:05:15  Level Number: 5"]
[]
["BREAKTHROUGH RESULTS"]
[]
["Advanced"]
["Pollutant Linkage: Inert Restorati, Attenuation Layer, Beenham Grange Formation",null,null,null,null,null,null,null,null,null,"Pollutant Linkage: Inert Restorati, Attenuation Layer, Beenham Grange Formation, Groundwater"]
["Concentrations in mg/L in Beenham Grange Formation",null,null,null,null,null,null,null,null,null,"Concentrations in mg/L in Groundwater"]
[]
["Compared with EAL (GW) target concentration in mg/L",null,null,null,null,null,null,null,null,null,"Compared with EAL (GW) target concentration in mg/L"]
[null,6.25E-2,2.9999999999999997E-4,1E-3,1E-3,2.0000000000000002E-5,2.2000000000000001E-3,2.0000000000000002E-5,5.0000000000000001E-3,null,null,6.25E-2,2.9999999999999997E-4,1E-3,1E-3,2.0000000000000002E-5,2.2000000000000001E-3,2.0000000000000002E-5,5.0000000000000001E-3]
[]
["Time(years)","Species1","Species2","Species3","Species4","Species5","Species6","Species7","Species8",null,"Time(years)","Species1","Species2","Species3","Species4","Species5","Species6","Species7","Species8"]
[null,"Barium","Cadmium","Chromium","Copper","Mercury","Molybdenum","Lead","Antimony",null,null,"Barium","Cadmium","Chromium","Copper","Mercury","Molybdenum","Lead","Antimony"]
[10,1.684166794258473E-4,0,0,0,0,0,0,0,null,10,1.4103977255786984E-4,0,0,0,0,0,0,0]
[20,1.0611504025757754E-2,0,0,0,0,0,0,0,null,20,1.0199220012576572E-2,0,0,0,0,0,0,0]
[30,3.4281990106614993E-2,0,0,0,0,0,0,0,null,30,3.3801030697244022E-2,0,0,0,0,0,0,0]
[40,5.3405567835553794E-2,0,0,0,0,2.5537734997904843E-34,0,1.2669388376833567E-39,null,40,5.3110370596688897E-2,0,0,0,0,1.4144004347964864E-34,0,1.2113337931495171E-39]
[50,6.3120619219353857E-2,0,0,3.3868444780866194E-32,0,0,0,4.6046729158517359E-35,null,50,6.3003075426692048E-2,0,0,1.6670396576741896E-32,0,0,0,4.2529982071547596E-35]
[60,6.5805795083666407E-2,0,0,0,0,3.4600139243400689E-28,0,7.5823739335241937E-32,null,60,6.5799911607921535E-2,0,0,0,0,2.2112811277401629E-28,0,7.6500803389634945E-32]
[70,6.4452564901344947E-2,0,0,1.8535151936188346E-27,0,0,0,0,null,70,6.450553892343576E-2,0,0,7.6072159152773248E-28,0,0,0,0]
[80,6.1102490405890712E-2,1.5203950665803689E-35,0,0,0,5.244093071562119E-25,0,9.7303774151784108E-28,null,80,6.1182289596808513E-2,1.2376160328821496E-35,0,0,0,4.1840646214365631E-25,0,9.6973606341070987E-28]
[90,5.6923763226609712E-2,3.1321158212764586E-33,0,3.3428750306956276E-25,0,0,0,0,null,90,5.7013004484269457E-2,2.9082425190536599E-33,0,0,0,0,0,0]
[100,5.2530147815975405E-2,0,0,5.1216447125711853E-24,0,0,0,9.9006715201107681E-26,null,100,5.2620007940743001E-2,0,0,9.4241062058485264E-24,0,0,0,9.3582972531597104E-26]
[110,4.8224586175175888E-2,0,0,0,0,2.5730737113629342E-22,0,9.1588120330113035E-25,null,110,4.8310864540328041E-2,0,0,0,0,2.7846503170425312E-22,0,9.5387076234123432E-25]
[120,4.4145692507058638E-2,2.1547184676478418E-29,0,1.8533271571862663E-22,0,0,0,0,null,120,4.4226581346705457E-2,1.8214317639692944E-29,0,8.4790705174652777E-23,0,0,0,0]
[130,4.0348207719754066E-2,2.8708473001521593E-28,0,7.8448207288271298E-22,0,0,0,6.9040373014932619E-24,null,130,4.0423101403640208E-2,3.0022487032400736E-28,0,1.1538756906071008E-21,0,0,4.9773554018297798E-39,6.1949927382081875E-24]
[140,3.6845302834840291E-2,0,0,0,0,5.9898223218539987E-21,2.4189062921491198E-37,1.285392771039069E-22,null,140,3.6914181119161206E-2,0,0,0,0,5.7914374592733369E-21,9.7067063099603508E-38,1.3001507684651628E-22]
[150,3.3630292832434835E-2,0,0,0,0,1.3065307628698866E-20,9.7489772578093303E-36,0,null,150,3.3693407248040159E-2,0,0,0,0,1.4554859319960931E-20,7.0674237033841561E-36,0]
[160,3.0687605513314967E-2,3.6786531809582329E-26,0,1.3873452935931208E-20,0,4.8277658065839668E-21,3.534479737926971E-34,0,null,160,3.074532214270783E-2,3.369546349438212E-26,0,1.0964153347364328E-20,0,0,2.5728667087892169E-34,0]
[170,2.7998243487532316E-2,1.8835327176322645E-25,0,3.9612230251667105E-20,0,2.2726212153652843E-19,5.6817891716735918E-33,0,null,170,2.8050965368563538E-2,1.9573496943570968E-25,0,4.8153176840307345E-20,0,1.4719651808920894E-19,4.6932879915556552E-33,0]
[180,2.5542453590877381E-2,0,0,1.6820827334613549E-20,0,2.5896097050876399E-18,4.404338685301686E-32,3.9943803945072338E-21,null,180,2.5590583328759482E-2,0,0,2.1265205045938665E-20,0,1.9660928722920324E-18,4.0199495039929509E-32,3.9998262311350792E-21]
[190,2.3300990418538416E-2,0,0,1.1500809104039559E-19,0,1.8813162772702631E-17,9.610796017276158E-32,6.569128283646623E-21,null,190,2.3344912968428218E-2,0,0,0,0,1.4800111988173637E-17,1.2569649992930513E-31,6.6520539869150967E-21]
[200,2.1255676901794435E-2,0,0,1.7376376824673373E-18,0,1.1019876755284671E-16,0,1.9398227763270874E-21,null,200,2.1295752392758761E-2,0,0,7.6095788460062614E-19,0,8.860405922012932E-17,0,1.8238767064471748E-21]
[210,1.938961666735016E-2,6.7585987105961729E-24,0,1.2201046739101591E-17,0,5.4689224978343696E-16,0,2.0159364913744272E-20,null,210,1.9426178164891783E-2,6.4078744465400242E-24,0,6.6706493368095481E-18,0,4.4831666071455402E-16,0,1.8379992310489013E-20]
[220,1.7687236680258012E-2,2.3277154065169356E-23,0,6.5719713893797683E-17,0,2.3493666875861822E-15,0,2.4493551519592136E-19,null,220,1.7720590322931155E-2,2.3820498020366192E-23,0,3.8267932086829411E-17,0,1.9595518428943446E-15,0,2.3471255723035212E-19]
[230,1.6134249733530108E-2,1.8762446616673311E-23,0,3.0332058409923258E-16,0,8.8911056570428652E-15,3.0867817007514813E-29,1.4946950733569783E-18,null,230,1.6164675960364631E-2,2.1080999283316573E-23,0,1.8407460658607512E-16,0,7.5300467625467222E-15,6.9821774175603493E-30,1.4454502839192289E-18]
[240,1.4717581532843376E-2,0,0,1.2350931094328078E-15,0,3.010442940022876E-14,4.7857540914233681E-28,7.1259272055491018E-18,null,240,1.4745336761140475E-2,0,0,7.7823883423809527E-16,0,2.5841478569316418E-14,4.1648688720597652E-28,6.9142124961545309E-18]
[250,1.3425284550683652E-2,0,0,4.500380384061694E-15,0,9.2413474047564337E-14,1.544893504538186E-27,2.9582080141392402E-17,null,250,1.3450602990740574E-2,0,0,2.9355962647664444E-15,0,8.0276990144124823E-14,1.5664592060252537E-27,2.8768060651692016E-17]
[260,1.2246449468861345E-2,0,0,1.4847787745192256E-14,0,2.6011628160451644E-13,1.4340469205747022E-27,1.1020345665263241E-16,null,260,1.2269544923389908E-2,0,0,9.9931478941517764E-15,0,2.283582221540712E-13,2.0224301277252059E-27,1.0738661074272645E-16]
[270,1.1171119319414747E-2,1.1233569698667581E-23,1.3203252762345272E-40,4.4828233768861539E-14,0,6.7779623885546796E-13,0,3.7302518275726563E-16,null,270,1.1192186898592003E-2,0,1.0285562019672886E-40,3.1031468783500149E-14,0,6.0068829466592225E-13,0,3.6416335960521527E-16]
[280,1.0190208573831775E-2,5.1709650420459415E-22,2.4625525313975287E-39,1.2502439556506703E-13,0,1.6485597276327725E-12,0,1.1578862119242523E-15,null,280,1.0209426297114223E-2,5.0956585732437519E-22,2.5133510744609402E-39,8.876095213842368E-14,0,1.4734365253742094E-12,0,1.1322819270366501E-15]
[290,9.2954280140774351E-3,1.0963085318945024E-21,0,3.2474263591646808E-13,0,3.7693393493311334E-12,0,3.3236927747615452E-15,null,290,9.312958290998246E-3,1.1159858435837149E-21,0,2.3586605475547873E-13,0,3.3946982257203655E-12,0,3.2551396244499683E-15]
[300,8.4792155252701486E-3,1.2799307497611605E-21,0,7.9116308118051329E-13,0,8.1517616930932904E-12,0,8.8901535544697581E-15,null,300,8.4952065153793156E-3,1.3280445998222103E-21,0,5.8661185594239052E-13,0,7.3922470349404027E-12,0,8.7187459072412886E-15]
[310,7.7346726157896924E-3,7.1971777193443117E-22,1.1745086586086966E-37,1.8191036825138311E-12,0,1.6764480805469128E-11,1.8060750321620529E-25,2.2308524736701002E-14,null,310,7.7492594747727997E-3,7.5085820645758996E-22,1.0826956406804085E-37,1.3742853918122918E-12,0,1.5297625770692581E-11,1.4227101490126737E-25,2.1905594856344569E-14]
[320,7.0555063357794464E-3,0,9.410959789117627E-37,3.9688069110040432E-12,0,3.2939552179756672E-11,6.6242322652744856E-25,5.2831770087669234E-14,null,320,7.0688123545414819E-3,0,9.2050964674607124E-37,3.0499192115355817E-12,0,3.0228343903608148E-11,6.3721429645496483E-25,5.1936077526791029E-14]
[330,6.4359762030922535E-3,1.6071657033870868E-21,3.5727661676085016E-36,8.2553448333301557E-12,0,6.209041389222149E-11,1.2061884832040997E-24,1.1870270220241663E-13,null,330,6.4481138480700587E-3,9.6658367239097186E-22,3.4530975730764171E-36,6.4436275568703702E-12,0,5.727521567313865E-11,1.2759108799200181E-24,1.1681018246117078E-13]
[340,5.8708457415452033E-3,1.3466239710307032E-20,1.7128217844057691E-35,1.6440025041092761E-11,0,1.126914516385545E-10,1.0610603964816983E-24,2.5420083762651607E-13,null,340,5.8819176044523323E-3,1.1391096033366991E-20,1.6307943528521069E-35,1.3016504164512157E-11,0,1.044446680797499E-10,1.3292141204761549E-24,2.5038287033828985E-13]
[350,5.3553382525161272E-3,5.5329316081326576E-20,9.1544736634627762E-35,3.14610681057497E-11,0,1.9756823667885605E-10,0,5.2098314803913914E-13,null,350,5.3654379171816872E-3,4.9391010965562304E-20,8.7940536624957524E-35,2.5237941589908851E-11,0,1.8390542569298685E-10,0,5.1359955247348369E-13]
[360,4.8850964546930135E-3,1.7696161346961295E-19,3.9867914168808131E-34,5.8047195995053627E-11,0,3.3554290908440169E-10,0,1.0256096842127141E-12,null,360,4.8943092877469681E-3,1.6089004357979575E-19,3.8689741718042497E-34,4.7129852072649355E-11,0,3.1358486657611136E-10,0,1.0118728145639831E-12]
[370,4.4561456644841421E-3,5.0037173214257733E-19,1.3980654091687344E-33,1.0356293906550258E-10,0,5.5347074558637672E-10,0,1.9456413874772176E-12,null,370,4.4645495368946971E-3,4.5871570679273653E-19,1.3652746807074576E-33,8.5024932213096548E-11,0,5.1915240620172962E-10,0,1.920977305011436E-12]
[380,4.0648602029490647E-3,1.3137457635056712E-18,4.1705469785847259E-33,1.7913776960864289E-10,0,8.8869196747975102E-10,0,3.567204312808126E-12,null,380,4.0725261477382113E-3,1.210382345116767E-18,4.0904966530443077E-33,1.4859013819170959E-10,0,8.3641572421387782E-10,0,3.524346751326375E-12]
[390,3.7079327529940037E-3,3.2681980385987479E-18,1.0871298271761703E-32,3.0113202352011572E-10,0,1.3919078940920504E-9,0,6.337394827322797E-12,null,390,3.7149255662419938E-3,3.0228466184190407E-18,1.0715006830834519E-32,2.5216830763504915E-10,0,1.3141410480982327E-9,0,6.2651383567702717E-12]
[400,3.3823464060077002E-3,7.7696075807768446E-18,2.4267879395545635E-32,4.9299055180959163E-10,0,2.1304734663395905E-9,9.6798090255278569E-24,1.0935312863478086E-11,null,400,3.3887251940496054E-3,7.2119624085904349E-18,2.4093467957572668E-32,4.1648989244013049E-10,0,2.0172918549512487E-9,4.7250567355260837E-24,1.0816844156812435E-11]
[410,3.0853491612103652E-3,1.7725071483836008E-17,4.2851646303942066E-32,7.8752992180244592E-10,0,3.1920799490153283E-9,5.447877630790973E-23,1.8365813328161419E-11,null,410,3.0911678404360043E-3,1.6508865377822601E-17,4.3082831999129124E-32,6.7080275191173966E-10,0,3.0306622278315805E-9,5.0093531600967856E-23,1.8176534581387682E-11]
[420,2.8144306654262906E-3,3.8909027308795366E-17,4.4805912513274795E-32,1.2296967567833595E-9,0,4.6887833305970637E-9,1.1450350110020221E-22,3.0080221070119706E-11,null,420,2.8197384177959949E-3,3.6357088309622536E-17,4.6789647971781889E-32,1.0554608109825289E-9,0,4.4628627642899174E-9,1.1449932072511238E-22,2.978497813950815E-11]
[430,2.567300994685366E-3,8.2373136495032237E-17,0,1.8798236766344259E-9,0,6.7613166097747107E-9,1.6667118097138637E-22,4.8128231150588101E-11,null,430,2.5721426836067367E-3,7.7207821604660609E-17,0,1.6250022512510711E-9,0,6.4505994240346127E-9,1.7566292209962462E-22,4.7677861404702848E-11]
[440,2.3418712989711154E-3,1.6855495224885205E-16,0,2.8173956952820812E-9,0,9.583608718482915E-9,1.7236574694302024E-22,7.5344992143775966E-11,null,440,2.3462878488681796E-3,1.584444936025296E-16,0,2.4517351199903508E-9,0,9.1631699676486787E-9,1.9370961798900214E-22,7.4672113707192246E-11]
[450,2.1362361452822573E-3,3.3406428458665002E-16,0,4.1453244211031113E-9,0,1.3367420049163531E-8,8.6626794629582883E-23,1.1557693613588369E-10,null,450,2.1402648866320111E-3,3.1488260422963628E-16,0,3.6298333386737942E-9,0,1.2807089469968489E-8,1.1967670267934503E-22,1.1459091120043648E-10]
[460,1.9486574139040893E-3,6.4256595244048848E-16,0,5.9947106864049819E-9,0,1.8366994996653221E-8,0,1.7394927784170492E-10,null,460,1.9523323993717175E-3,6.0721930987503611E-16,0,5.2799297251664894E-9,0,1.7630746385206923E-8,0,1.7253029785621849E-10]
[470,1.7775496051075596E-3,1.2017568198504125E-15,0,8.5300590561755922E-9,0,2.4883625943882637E-8,0,2.5717727192910252E-10,null,470,1.7809018973726843E-3,1.1383731743245197E-15,0,7.5541755506036399E-9,0,2.3928984176252419E-8,0,2.5516953132398713E-10]
[480,1.6214664399090376E-3,2.1891761704913106E-15,0,1.1954890798378845E-8,0,3.327002085301022E-8,0,3.7392231840378883E-10,null,480,1.6245243739807212E-3,2.0783804541729902E-15,0,1.0641719098837078E-8,0,3.2047500762854558E-8,0,3.7112626542752794E-10]
[490,1.47908863284869E-3,3.8905111623530379E-15,0,1.6517686063767127E-8,0,4.3934368010161298E-8,0,5.3519287603940308E-10,null,490,1.4818780558102005E-3,3.7014202002912317E-15,0,1.4774539426762289E-8,0,4.2386958957721685E-8,0,5.3135655348115564E-10]
[500,1.3492127438203927E-3,6.7551778984464345E-15,0,2.2518071870092701E-8,0,5.7343996283385513E-8,0,7.5478892527950671E-10,null,500,1.3517572331233278E-3,6.4396414333547481E-15,0,2.0233556716521328E-8,0,5.54067054372819E-8,0,7.4959843941719683E-10]
[510,1.2307410030288767E-3,1.1475281080665391E-14,2.6136922033802804E-29,3.0313160553389646E-8,0,7.4028537124629617E-8,0,1.0497874606888367E-9,null,510,1.2330620658457373E-3,1.0959769924966003E-14,2.455377414324696E-29,2.735492784577145E-8,0,7.1628003285753972E-8,0,1.0428566427728839E-9]
[520,1.1226720351881399E-3,1.9095579927577154E-14,1.006298908379131E-28,4.0323934049893744E-8,0,9.4582505012960516E-8,0,1.4410652360344984E-9,null,520,1.12478929010691E-3,1.8269979185348832E-14,9.8068814065716178E-29,3.6536425538563199E-8,0,9.1636693303808722E-8,0,1.4319245860321591E-9]
[530,1.0240923925876702E-3,3.1163803323647169E-14,2.3952472932113278E-28,5.3041562981592355E-8,0,1.1966722557039459E-7,1.0395940663545046E-21,1.9538537782847237E-9,null,530,1.026023735701485E-3,2.9866209379695904E-14,2.3631254280028271E-28,4.824379202105682E-8,0,1.1608521156526337E-7,8.2617552735500172E-22,1.9419388045572003E-9]
[540,9.3416883593894066E-4,4.9932540009736442E-14,4.5094289977384877E-28,6.903354617471586E-8,0,1.5001205462649886E-7,2.9609017159216717E-21,2.6183205725705849E-9,null,540,9.3593059172969917E-4,4.7928987076502497E-14,4.4849056419029861E-28,6.3016953679679912E-8,0,1.4569390458209833E-7,2.8180481141831378E-21,2.6029596628141843E-9]
[550,8.5214129157634103E-4,7.8625945362319112E-14,7.0444048865034898E-28,8.8949555952285698E-8,0,1.8641484650667747E-7,5.1536324026823947E-21,3.4701693355293574E-9,null,550,8.5374835104710999E-4,7.5583804341514838E-14,7.0591327230768569E-28,8.147598185770206E-8,0,1.8125159834135823E-7,5.1553172584998217E-21,3.4505713129855139E-9]
[560,7.773164260136534E-4,1.2178660897981173E-13,8.9490979774327827E-28,1.1352687720122772E-7,0,2.2974164523941929E-7,7.1968383745345292E-21,4.551251469913563E-9,null,560,7.7878237287863129E-4,1.1724021273985881E-13,9.0567860524840323E-28,1.0432668656126082E-7,0,2.2361539287048163E-7,7.4082483272986304E-21,4.526493003987776E-9]
[570,7.0906178554263461E-4,1.8572006065446254E-13,8.04340166783579E-28,1.4359533361424481E-7,0,2.8092558773122093E-7,8.5563453778274755E-21,5.9101801519841292E-9,null,570,7.1039901074223123E-4,1.7902692090735111E-13,8.3168436944126826E-28,1.3236573430345908E-7,0,2.7370966937512686E-7,9.0116342329409691E-21,5.879193203614965E-9]
[580,6.4680045198568814E-4,2.7905649148614668E-13,7.9693686763231776E-29,1.8008160235982457E-7,0,3.4096502281285211E-7,8.6858082300116928E-21,7.6029380603330951E-9,null,580,6.4802025796850877E-4,2.6934228931387688E-13,1.3106923988284939E-28,1.6648518833454034E-7,0,3.3252431193596567E-7,9.3632599929580046E-21,7.5644975494828977E-9]
[590,5.9000616453258299E-4,4.1345126058540974E-13,0,2.2401282839444267E-7,0,4.1092086405145528E-7,7.1723490798293602E-21,9.6934695180334558E-9,null,590,5.9111886201091519E-4,3.9954162183422466E-13,0,2.0767637876010416E-7,0,4.0111215987356183E-7,7.9684851862546045E-21,9.6461814034503663E-9]
[600,5.381988728337799E-4,6.0444757089775207E-13,0,2.765194613144055E-7,0,4.9191320705390438E-7,3.920819862795976E-21,1.2254247789743316E-8,null,600,5.3921386676933076E-4,5.8478448587248208E-13,0,2.5703302116478774E-7,0,4.80585719888256E-7,4.6226865009104619E-21,1.2196537749731753E-8]
[610,4.9094067814167339E-4,8.7252625410478067E-13,0,3.3883725064611224E-7,0,5.8511725343250691E-7,0,1.5366808445339592E-8,null,610,4.9186654750399124E-4,8.4506687496488871E-13,0,3.1575351493627416E-7,0,5.7211317872037859E-7,0,1.5296911342861443E-8]
[620,4.4783213302641779E-4,1.244368830330614E-12,0,4.1230834938500989E-7,0,6.9175859350709441E-7,0,1.9122240059851773E-8,null,620,4.486767037300256E-4,1.2064642857215556E-12,0,3.8514236611558614E-7,0,6.7691376718893281E-7,0,1.9038190366159892E-8]
[630,4.0850886493307213E-4,1.7543608345205771E-12,0,4.9838149001882928E-7,0,8.1310790808335301E-7,0,2.3621624049185116E-8,null,630,4.0927927563098209E-4,1.7026126451193249E-12,0,4.6661069388265782E-7,0,7.9625253495171773E-7,0,2.3521247387747591E-8]
[640,3.7263849645448923E-4,2.4463627666413267E-12,0,5.9861121183685467E-7,0,9.5047515623837638E-7,0,2.8976416121994461E-8,null,640,3.7334125906925717E-4,2.3764544325138657E-12,0,5.6167579433889621E-7,0,9.3143460214206409E-7,0,2.8857322079149344E-8]
[650,3.3991783486539515E-4,3.3757758762387882E-12,0,7.14656132693322E-7,0,1.1052033209726013E-6,1.4116225002397003E-20,3.5308762637077778E-8,null,650,3.4055888949136568E-4,3.2822772412709444E-12,0,6.7195974971794796E-7,0,1.0837989591825505E-6,3.0949348142639943E-21,3.5168338968154949E-8]
[660,3.1007031041741163E-4,4.6119292945301435E-12,0,8.4827627225818146E-7,0,1.2786617879060467E-6,5.4924712215554877E-20,4.2751746068200727E-8,null,660,3.106550754267438E-4,4.4880713776241589E-12,0,7.9918708522642563E-7,0,1.2547118896027809E-6,3.527367185615955E-20,4.2587154408274618E-8]
[670,2.8284363864290436E-4,6.240813753927673E-12,1.6244741902237308E-26,1.0013294468937228E-6,0,1.4722394339931756E-6,1.3576866831586893E-19,5.1449554769049407E-8,null,670,2.8337705672637812E-4,6.0782318728183284E-12,1.4639725337890995E-26,9.4518148911381873E-7,0,1.4455600926795621E-6,1.0193161142630307E-19,5.1257727936561885E-8]
[680,2.5800768765727827E-4,8.3681852751680867E-12,7.3087753182991114E-26,1.1757667684280195E-6,7.2292600428221225E-40,1.6873375036183977E-6,2.8289783474051257E-19,6.1557573274897463E-8,null,680,2.5849426751153133E-4,8.1566284769442481E-12,7.1117376306501361E-26,1.1118616240660891E-6,3.7406514361550208E-40,1.6577435832841951E-6,2.2573580245399304E-19,6.1335214234625805E-8]
[690,2.3535253277438321E-4,1.1123059760559285E-11,1.5861931615474881E-25,1.3736272900876854E-6,3.5719455975969275E-39,1.9253623485451221E-6,5.3807580815627976E-19,7.3242390450300317E-8,null,690,2.3579638719219845E-4,1.0850064812282839E-11,1.5660160544849165E-25,1.3012360694265586E-6,3.0455626169303555E-39,1.8926684455929105E-6,4.4265879902621957E-19,7.2985972980020965E-8]
[700,2.1468668281481181E-4,1.4661616427664345E-11,2.7102147506553069E-25,1.5970318525795192E-6,8.9241662487363662E-39,2.1877181061710829E-6,9.6761721014041713E-19,8.6681723870837388E-8,null,700,2.1509156341647536E-4,1.4312144908560327E-11,2.6953735186507894E-25,1.5153974439316808E-6,8.2830839635211936E-39,2.1517395154371244E-6,8.0983551671976516E-19,8.6387494954008811E-8]
[710,1.9583546070773682E-4,1.9171524484681104E-11,3.9970582846174643E-25,1.8481761916911745E-6,1.7276175293979127E-38,2.4757993875420902E-6,1.6761913626316936E-18,1.0206425989068668E-7,null,710,1.9620478961770941E-4,1.872756185470234E-11,3.9962048899274749E-25,1.7565157675116655E-6,1.6472794625809721E-38,2.4363530631902175E-6,1.4176505125186932E-18,1.0172824383594636E-7]
[720,1.7863952714892322E-4,2.4876703433659138E-11,5.2228939447311158E-25,2.1293233757709989E-6,2.9767719013405196E-38,2.7909840427507892E-6,2.8275133992220623E-18,1.1958940987790092E-7,null,720,1.7897642614813367E-4,2.4316819327167803E-11,5.2471273966769422E-25,2.0268311281894983E-6,2.8155506500499929E-38,2.7478895453622888E-6,2.407965802833287E-18,1.1920741414550684E-7]
[730,1.6295353493377395E-4,3.2042522949019595E-11,6.026722466648565E-25,2.4427956470377024E-6,5.134141613503405E-38,3.1346260668461498E-6,4.6748406617104669E-18,1.3946698407939921E-7,null,730,1.6326085182356617E-4,3.1341392351264632E-11,6.088349960927395E-25,2.3286457261961348E-6,4.6745869727827953E-38,3.0877064886542372E-6,4.0011256443088546E-18,1.3903460677524886E-7]
[740,1.486448986299556E-4,4.0981443485019643E-11,5.9121785483086875E-25,2.790965744881557E-6,9.7714460778597519E-38,3.5080487043511699E-6,7.6052440464224215E-18,1.6191678549416455E-7,null,740,1.4892523066310827E-4,4.010932888660924E-11,6.0224860137879389E-25,2.664315372114199E-6,8.5041521926696482E-38,3.457131565255839E-6,6.5353374249441654E-18,1.6142942447395505E-7]
[750,1.3559267582877499E-4,5.2059093693184629E-11,4.2802165147371295E-25,3.1762477921970947E-6,2.0742248121233295E-37,3.9125378050673154E-6,1.2202995388256479E-17,1.8716812697483403E-7,null,750,1.3584839263419094E-4,5.0981288776825484E-11,4.4462556597781767E-25,3.03624051920574E-6,1.7690798033335239E-37,3.8574559127978695E-6,1.0523288431609359E-17,1.8662099048448062E-7]
[760,1.2368654282986821E-4,6.5700775461429811E-11,5.0025630653890769E-26,3.6010878273997489E-6,4.5952185113858799E-37,4.3493354781637316E-6,1.9339178361083534E-17,2.1545927553619808E-7,null,760,1.2391980574337204E-4,6.437701134835856E-11,7.208687403689549E-26,3.4468569121312854E-6,3.9477106674976289E-37,4.2899277467154225E-6,1.673248867329627E-17,2.1484739429996538E-7]
[770,1.1282586382794921E-4,8.2398382006456963E-11,0,4.0679540652095165E-6,9.9692282510439092E-37,4.8196340857224084E-6,3.0296878208479204E-17,2.4703682851792841E-7,null,770,1.1303864455888956E-4,8.0782197569531726E-11,0,3.898625935106201E-6,8.7272133744565314E-37,4.7557463069660497E-6,2.6297912989622369E-17,2.4635506917294258E-7]
[780,1.0291883969322772E-4,1.0271770904726025E-10,0,4.5793269686307786E-6,2.0555981578215149E-36,5.3245706110437688E-6,4.694413280704173E-17,2.8215502682427094E-7,null,780,1.0311293676887507E-4,1.0075578727585153E-10,0,4.3940247422592649E-6,1.8350226914566538E-36,5.2560561751794544E-6,4.0878145531950595E-17,2.8139810658923379E-7]
[790,9.3881731918219667E-5,1.2730613374701066E-10,0,5.1376892129233754E-6,4.001843966337703E-36,5.8652214312002611E-6,7.1970343474894399E-17,3.2107501094370219E-7,null,790,9.405878592100899E-5,1.2493760661801317E-10,0,4.9355362516591008E-6,3.6315835669585235E-36,5.7919419924874635E-6,6.2869511992323783E-17,3.2023751340074367E-7]
[800,8.5638154582407322E-5,1.5690063091736916E-10,0,5.7455156198588121E-6,7.3833336868030545E-36,6.4425975176398378E-6,1.0920616915250081E-16,3.6406402583667557E-7,null,800,8.5799661942184737E-5,1.5405635567951875E-10,0,5.5256390822681624E-6,6.7857726772741551E-36,6.3644236025758073E-6,9.569673661176603E-17,3.6314041769832089E-7]
[810,7.8118429463875378E-5,1.9233609101354025E-10,0,6.4052631372985384E-6,1.300317744320264E-35,7.0576400831517839E-6,1.6405219326863022E-16,4.1139458107143402E-7,null,810,7.8265755311919004E-5,1.8893790122186234E-10,0,6.166797510081862E-6,1.2064452699826745E-35,6.9744516389809844E-6,1.4420360977789515E-16,4.1037922979960012E-7]
[820,7.1258996502388474E-5,2.3455389978435281E-10,0,7.11936093523509E-6,2.2025518505430238E-35,7.7112166882717023E-6,2.4404799954213232E-16,4.6334357278940184E-7,null,820,7.1393386206165449E-5,2.3051383482166439E-10,0,6.8614515160291728E-6,2.0581406740125842E-35,7.6229035703832277E-6,2.1517313565758341E-16,4.6223076493008156E-7]
[830,6.5001876745651133E-5,2.8461073514673867E-10,0,7.8902006850091438E-6,3.6110091496809899E-35,8.4041178152624215E-6,3.5962087005419593E-16,5.2019137419742756E-7,null,830,6.5124466077793813E-5,2.7983025233400082E-10,0,7.6120069939592161E-6,3.3937047305794751E-35,8.3105802126661053E-6,3.1801379417232622E-16,5.1897533429316935E-7]
[840,5.929418212278369E-5,3.4368753298744089E-10,0,8.7201270835680828E-6,5.7544403836390403E-35,9.1370539131988098E-6,5.250622813785495E-16,5.8222090131915716E-7,null,840,5.9406007349966888E-5,3.3805670670948715E-10,0,8.4208261823293105E-6,5.4371617856071394E-35,9.0382027118586436E-6,4.656570510616349E-16,5.8089581126149915E-7]
[850,5.4087668853573376E-5,4.130985702072563E-10,0,9.6114286794618349E-6,8.9290011617699346E-35,9.9106529134304897E-6,7.5979088151087739E-16,6.4971666069827202E-7,null,850,5.418967493526266E-5,4.0649528276088942E-10,0,9.2902183781432688E-6,8.4859232490441036E-35,9.8064099977744875E-6,6.75721241880257E-16,6.4827667938381022E-7]
[860,4.9338329112277877E-5,4.9430061045578289E-10,0,1.0566329051878908E-5,1.3478250615665893E-34,1.0725458210813921E-5,1.0899728421799214E-15,7.2296378563871136E-7,null,860,4.9431378404810478E-5,4.8658973956012939E-10,0,1.0222430986365855E-5,1.2899355929487423E-34,1.0615756704230403E-5,9.720086007955432E-16,7.214030687953093E-7]
[870,4.5006019444508241E-5,5.889020556893944E-10,4.8579147890964811E-25,1.1586978388493968E-5,1.9722940715203675E-34,1.1581927102602931E-5,1.550584556252576E-15,8.02247067398045E-7,null,870,4.5090898492161996E-5,5.7993466378132812E-10,2.3856873831534202E-25,1.1219640952548034E-5,1.9041770432878226E-34,1.1466711548173648E-5,1.386415662369082E-15,8.0055978745173573E-7]
[880,4.1054121295922589E-5,6.9867204494402866E-10,7.6209603652743042E-24,1.2675445502311121E-5,2.7805110177231165E-34,1.24804296737638E-5,2.1880187414325744E-15,8.8784998752736203E-7,null,880,4.1131547456149867E-5,6.882845755127968E-10,7.3556111320493869E-24,1.2283946620822341E-5,2.7144517592969924E-34,1.2359656156874623E-5,1.9613526892873649E-15,8.8603035338554289E-7]
[890,3.7449231059964165E-5,8.2554944056020145E-10,1.7071453763442378E-23,1.3833710322113474E-5,3.7403054895079999E-34,1.3421248114740944E-5,3.0633532630453594E-15,9.8005375728095809E-7,null,890,3.7519858706323703E-5,8.1356292685438129E-10,1.6816454399615199E-23,1.3417360053842625E-5,3.7042899066090344E-34,1.3294884329551685E-5,2.752785318400248E-15,9.7809603391344426E-7]
[900,3.4160879048239613E-5,9.7165164153400284E-10,2.8591916279779554E-23,1.5063656885635394E-5,4.7270696235450454E-34,1.4404576455323466E-5,4.2564225312121315E-15,1.0791363697093715E-6,null,900,3.4225305168927114E-5,9.5787093300056637E-10,2.8385539398435648E-23,1.4621799845714151E-5,4.7739183156981192E-34,1.4272601717371006E-5,3.8340314068941476E-15,1.0770348974155693E-6]
[910,3.1161270644182828E-5,1.1392831636900066E-9,4.1595370826925475E-23,1.6367066859212056E-5,5.4559921462711497E-34,1.5430520696248552E-5,5.8708542745093573E-15,1.1853716697064729E-6,null,910,3.1220039673728545E-5,1.1234961754803805E-9,4.1484343333681101E-23,1.5899084453546293E-5,5.6746436994178869E-34,1.5292925903703872E-5,5.3004682193547136E-15,1.1831208829642525E-6]
[920,2.842505196680144E-5,1.3309439269665394E-9,5.5110823305199456E-23,1.7745613602481495E-5,5.3900884543727261E-34,1.649909931850408E-5,8.0402599354956392E-15,1.2990284469119301E-6,null,920,2.8478660859960533E-5,1.3129209177695468E-9,5.5147593729973206E-23,1.7250926068011818E-5,5.9182394965836282E-34,1.635588686480595E-5,7.2753297243894208E-15,1.2966228927115734E-6]
[930,2.5929094797407034E-5,1.5493371912512689E-9,6.7771504565292069E-23,1.9200856791752396E-5,3.6246312318429541E-34,1.761024414894266E-5,1.093579494026465E-14,1.4203695559811324E-6,null,930,2.5977996540365197E-5,1.528830074589753E-9,6.801007465295798E-23,1.8678925038254369E-5,4.6611356031161892E-34,1.7461427789691316E-5,9.9168009419622366E-15,1.4178039115558659E-6]
[940,2.3652302624822347E-5,1.7973770838781332E-9,7.7842244513242238E-23,2.0734237610945868E-5,0,1.8763801559774521E-5,1.4775335701909686E-14,1.549651068330847E-6,null,940,2.3696910490493094E-5,1.7741187778375805E-9,7.8332667598896845E-23,2.0184564861687107E-5,5.6784802013249383E-35,1.8609406236890262E-5,1.3426646046936347E-14,1.5469201582038423E-6]
[950,2.1575430895626915E-5,2.0781956640631991E-9,8.3292086392771425E-23,2.2347074514589277E-5,0,1.9959533978744481E-5,1.9834553431923146E-14,1.6871214590566268E-6,null,950,2.1616122043728972E-5,2.0518994842097633E-9,8.4073897568976331E-23,2.1769207744696267E-5,0,1.9799595604981796E-5,1.8060639306857491E-14,1.684220271332895E-6]
[960,1.9680925194740862E-5,2.3951494721805307E-9,8.191485958988256E-23,2.4040559563207581E-5,0,2.1197121686295257E-5,2.6460200623232301E-14,1.8330208323015541E-6,null,960,1.9718043534470096E-5,2.365508572176048E-9,8.3009865077484686E-23,2.3434090736023133E-5,0,2.1031686893255161E-5,2.4141102893758926E-14,1.8299445341416381E-6]
[970,1.7952772023640241E-5,2.7518255148175219E-9,7.1496251311300886E-23,2.5815755327639311E-5,0,2.2476164875759326E-5,3.5085964364629275E-14,1.9875801879406623E-6,null,970,1.7986631200467009E-5,2.7185123789541242E-9,7.290125019552766E-23,2.5180322430668871E-5,0,2.2305290728565111E-5,3.2071893104255348E-14,1.984324140161581E-6]
[980,1.6376363953263557E-5,3.1520466399593937E-9,5.0021264066023133E-23,2.76735923553018E-5,0,2.3796185952572209E-5,4.6251281339373687E-14,2.1510207320344595E-6,null,980,1.6407250231256994E-5,3.1147126315201866E-9,5.1701388106919866E-23,2.7008880238550787E-5,0,2.3619939634368474E-5,4.2356216453262003E-14,2.147580502791638E-6]
[990,1.4938377512481343E-5,3.5998762603882294E-9,1.5911203014198047E-23,2.9614867188251937E-5,0,2.5156632048649517E-5,6.0623552298557917E-14,2.3235532331028901E-6,null,990,1.496655172678286E-5,3.5581512293974267E-9,1.7794624721884027E-23,2.8920608208846155E-5,0,2.4975090518055068E-5,5.5617699335924487E-14,2.3199246106150202E-6]
[1000,1.3626657487531665E-5,4.0996223873947128E-9,0,3.1640240920033748E-5,0,2.6556877728387918E-5,7.9024238788337513E-14,2.505377425879916E-6,null,1000,1.3652357990144228E-5,4.0531143409546874E-9,0,3.0916215397990765E-5,0,2.6370127352981883E-5,7.2625179299546786E-14,2.5015564301664903E-6]
[]
[]
["Saved  28/03/2024: 13:26:55  Level Number: 5"]
[]
["BREAKTHROUGH RESULTS"]
[]
["Advanced"]
["Pollutant Linkage: Inert Restorati, Attenuation Layer, Beenham Grange Formation",null,null,null,null,null,null,null,null,null,"Pollutant Linkage: Inert Restorati, Attenuation Layer, Beenham Grange Formation, Groundwater"]
["Concentrations in mg/L in Beenham Grange Formation",null,null,null,null,null,null,null,null,null,"Concentrations in mg/L in Groundwater"]
[]
["Compared with EAL (GW) target concentration in mg/L",null,null,null,null,null,null,null,null,null,"Compared with EAL (GW) target concentration in mg/L"]
[null,4.3499999999999997E-2,1.9599999999999994E-4,1E-3,5.0599999999999994E-3,2.0000000000000002E-5,2E-3,2.0000000000000001E-4,5.0000000000000001E-4,null,null,4.3499999999999997E-2,1.9599999999999994E-4,1E-3,5.0599999999999994E-3,2.0000000000000002E-5,2E-3,2.0000000000000001E-4,5.0000000000000001E-4]
[]
["Time(years)","Species1","Species2","Species3","Species4","Species5","Species6","Species7","Species8",null,"Time(years)","Species1","Species2","Species3","Species4","Species5","Species6","Species7","Species8"]
[null,"Barium","Cadmium","Chromium","Copper","Mercury","Molybdenum","Lead","Antimony",null,null,"Barium","Cadmium","Chromium","Copper","Mercury","Molybdenum","Lead","Antimony"]
[10,6.5722025627427982E-26,0,0,0,0,0,0,0,null,10,7.2264653995214626E-26,0,0,0,0,0,0,0]
[20,0,0,0,0,0,0,0,0,null,20,0,0,0,0,0,0,0,0]
[30,7.9337785087618532E-16,0,0,0,0,0,0,0,null,30,6.285488348118151E-16,0,0,0,0,0,0,0]
[40,4.7959784343439887E-12,0,0,0,0,2.5537734997904843E-34,0,1.2669388376833567E-39,null,40,4.1986982221076633E-12,0,0,0,0,1.4144004347964864E-34,0,1.2113337931495171E-39]
[50,8.9441972889787979E-10,0,0,3.3868444780866194E-32,0,0,0,4.6046729158517359E-35,null,50,8.2121138589895669E-10,0,0,1.6670396576741896E-32,0,0,0,4.2529982071547596E-35]
[60,2.9099006778122013E-8,0,0,0,0,3.4600139243400689E-28,0,7.5823739335241937E-32,null,60,2.7423187836096157E-8,0,0,0,0,2.2112811277401629E-28,0,7.6500803389634945E-32]
[70,3.4814233609871613E-7,0,0,1.8535151936188346E-27,0,0,0,0,null,70,3.3332298129106777E-7,0,0,7.6072159152773248E-28,0,0,0,0]
[80,2.2252770173387396E-6,1.5203950665803689E-35,0,0,0,5.244093071562119E-25,0,9.7303774151784108E-28,null,80,2.1526358506146348E-6,1.2376160328821496E-35,0,0,0,4.1840646214365631E-25,0,9.6973606341070987E-28]
[90,9.3546092458616127E-6,3.1321158212764586E-33,0,3.3428750306956276E-25,0,0,0,0,null,90,9.1136866547574276E-6,2.9082425190536599E-33,0,0,0,0,0,0]
[100,2.9304346598229466E-5,0,0,5.1216447125711853E-24,0,0,0,9.9006715201107681E-26,null,100,2.8695425873533262E-5,0,0,9.4241062058485264E-24,0,0,0,9.3582972531597104E-26]
[110,7.4077226038836305E-5,0,0,0,0,2.5730737113629342E-22,0,9.1588120330113035E-25,null,110,7.2812758810389354E-5,0,0,0,0,2.7846503170425312E-22,0,9.5387076234123432E-25]
[120,1.5935925955537161E-4,2.1547184676478418E-29,0,1.8533271571862663E-22,0,0,0,0,null,120,1.5709161875045567E-4,1.8214317639692944E-29,0,8.4790705174652777E-23,0,0,0,0]
[130,3.0270896948441793E-4,2.8708473001521593E-28,0,7.8448207288271298E-22,0,0,0,6.9040373014932619E-24,null,130,2.9907430309553525E-4,3.0022487032400736E-28,0,1.1538756906071008E-21,0,0,4.9773554018297798E-39,6.1949927382081875E-24]
[140,5.213006161381914E-4,0,0,0,0,5.9898223218539987E-21,2.4189062921491198E-37,1.285392771039069E-22,null,140,5.1596532058027192E-4,0,0,0,0,5.7914374592733369E-21,9.7067063099603508E-38,1.3001507684651628E-22]
[150,8.2982146659688766E-4,0,0,0,0,1.3065307628698866E-20,9.7489772578093303E-36,0,null,150,8.2252077011035817E-4,0,0,0,0,1.4554859319960931E-20,7.0674237033841561E-36,0]
[160,1.2389099697335132E-3,3.6786531809582329E-26,0,1.3873452935931208E-20,0,4.8277658065839668E-21,3.534479737926971E-34,0,null,160,1.2294732176013669E-3,3.369546349438212E-26,0,1.0964153347364328E-20,0,0,2.5728667087892169E-34,0]
[170,1.7542809648263989E-3,1.8835327176322645E-25,0,3.9612230251667105E-20,0,2.2726212153652843E-19,5.6817891716735918E-33,0,null,170,1.7426426824563145E-3,1.9573496943570968E-25,0,4.8153176840307345E-20,0,1.4719651808920894E-19,4.6932879915556552E-33,0]
[180,2.376504553577366E-3,0,0,1.6820827334613549E-20,0,2.5896097050876399E-18,4.404338685301686E-32,3.9943803945072338E-21,null,180,2.3627032222987253E-3,0,0,2.1265205045938665E-20,0,1.9660928722920324E-18,4.0199495039929509E-32,3.9998262311350792E-21]
[190,3.1013064127579483E-3,0,0,1.1500809104039559E-19,0,1.8813162772702631E-17,9.610796017276158E-32,6.569128283646623E-21,null,190,3.0854741846711459E-3,0,0,0,0,1.4800111988173637E-17,1.2569649992930513E-31,6.6520539869150967E-21]
[200,3.9202240573338303E-3,0,0,1.7376376824673373E-18,0,1.1019876755284671E-16,0,1.9398227763270874E-21,null,200,3.9025708212862549E-3,0,0,7.6095788460062614E-19,0,8.860405922012932E-17,0,1.8238767064471748E-21]
[210,4.8214617579982405E-3,6.7585987105961729E-24,0,1.2201046739101591E-17,0,5.4689224978343696E-16,0,2.0159364913744272E-20,null,210,4.8022565352959529E-3,6.4078744465400242E-24,0,6.6706493368095481E-18,0,4.4831666071455402E-16,0,1.8379992310489013E-20]
[220,5.790815475509907E-3,2.3277154065169356E-23,0,6.5719713893797683E-17,0,2.3493666875861822E-15,0,2.4493551519592136E-19,null,220,5.7703674377551362E-3,2.3820498020366192E-23,0,3.8267932086829411E-17,0,1.9595518428943446E-15,0,2.3471255723035212E-19]
[230,6.8125739691874626E-3,1.8762446616673311E-23,0,3.0332058409923258E-16,0,8.8911056570428652E-15,3.0867817007514813E-29,1.4946950733569783E-18,null,230,6.7912146585080982E-3,2.1080999283316573E-23,0,1.8407460658607512E-16,0,7.5300467625467222E-15,6.9821774175603493E-30,1.4454502839192289E-18]
[240,7.8703350195822985E-3,0,0,1.2350931094328078E-15,0,3.010442940022876E-14,4.7857540914233681E-28,7.1259272055491018E-18,null,240,7.8484027297313873E-3,0,0,7.7823883423809527E-16,0,2.5841478569316418E-14,4.1648688720597652E-28,6.9142124961545309E-18]
[250,8.9477027688882466E-3,0,0,4.500380384061694E-15,0,9.2413474047564337E-14,1.544893504538186E-27,2.9582080141392402E-17,null,250,8.9255295577373162E-3,0,0,2.9355962647664444E-15,0,8.0276990144124823E-14,1.5664592060252537E-27,2.8768060651692016E-17]
[260,1.0028852546447925E-2,0,0,1.4847787745192256E-14,0,2.6011628160451644E-13,1.4340469205747022E-27,1.1020345665263241E-16,null,260,1.0006753998401164E-2,0,0,9.9931478941517764E-15,0,2.283582221540712E-13,2.0224301277252059E-27,1.0738661074272645E-16]
[270,1.1098963671819792E-2,1.1233569698667581E-23,1.3203252762345272E-40,4.4828233768861539E-14,0,6.7779623885546796E-13,0,3.7302518275726563E-16,null,270,1.1077231294906956E-2,0,1.0285562019672886E-40,3.1031468783500149E-14,0,6.0068829466592225E-13,0,3.6416335960521527E-16]
[280,1.2144529688906872E-2,5.1709650420459415E-22,2.4625525313975287E-39,1.2502439556506703E-13,0,1.6485597276327725E-12,0,1.1578862119242523E-15,null,280,1.2123425691204857E-2,5.0956585732437519E-22,2.5133510744609402E-39,8.876095213842368E-14,0,1.4734365253742094E-12,0,1.1322819270366501E-15]
[290,1.3153560495910819E-2,1.0963085318945024E-21,0,3.2474263591646808E-13,0,3.7693393493311334E-12,0,3.3236927747615452E-15,null,290,1.3133314615067417E-2,1.1159858435837149E-21,0,2.3586605475547873E-13,0,3.3946982257203655E-12,0,3.2551396244499683E-15]
[300,1.4115693013892124E-2,1.2799307497611605E-21,0,7.9116308118051329E-13,0,8.1517616930932904E-12,0,8.8901535544697581E-15,null,300,1.4096501050765993E-2,1.3280445998222103E-21,0,5.8661185594239052E-13,0,7.3922470349404027E-12,0,8.7187459072412886E-15]
[310,1.5022227305009092E-2,7.1971777193443117E-22,1.1745086586086966E-37,1.8191036825138311E-12,0,1.6764480805469128E-11,1.8060750321620529E-25,2.2308524736701002E-14,null,310,1.5004251020995429E-2,7.5085820645758996E-22,1.0826956406804085E-37,1.3742853918122918E-12,0,1.5297625770692581E-11,1.4227101490126737E-25,2.1905594856344569E-14]
[320,1.5866104122858372E-2,0,9.410959789117627E-37,3.9688069110040432E-12,0,3.2939552179756672E-11,6.6242322652744856E-25,5.2831770087669234E-14,null,320,1.5849472187747179E-2,0,9.2050964674607124E-37,3.0499192115355817E-12,0,3.0228343903608148E-11,6.3721429645496483E-25,5.1936077526791029E-14]
[330,1.6641838273138705E-2,1.6071657033870868E-21,3.5727661676085016E-36,8.2553448333301557E-12,0,6.209041389222149E-11,1.2061884832040997E-24,1.1870270220241663E-13,null,330,1.6626647987363099E-2,9.6658367239097186E-22,3.4530975730764171E-36,6.4436275568703702E-12,0,5.727521567313865E-11,1.2759108799200181E-24,1.1681018246117078E-13]
[340,1.7345420246717966E-2,1.3466239710307032E-20,1.7128217844057691E-35,1.6440025041092761E-11,0,1.126914516385545E-10,1.0610603964816983E-24,2.5420083762651607E-13,null,340,1.7331739802484182E-2,1.1391096033366991E-20,1.6307943528521069E-35,1.3016504164512157E-11,0,1.044446680797499E-10,1.3292141204761549E-24,2.5038287033828985E-13]
[350,1.7974196600151163E-2,5.5329316081326576E-20,9.1544736634627762E-35,3.14610681057497E-11,0,1.9756823667885605E-10,0,5.2098314803913914E-13,null,350,1.7962067686262899E-2,4.9391010965562304E-20,8.7940536624957524E-35,2.5237941589908851E-11,0,1.8390542569298685E-10,0,5.1359955247348369E-13]
[360,1.8526737651319476E-2,1.7696161346961295E-19,3.9867914168808131E-34,5.8047195995053627E-11,0,3.3554290908440169E-10,0,1.0256096842127141E-12,null,360,1.85161782441573E-2,1.6089004357979575E-19,3.8689741718042497E-34,4.7129852072649355E-11,0,3.1358486657611136E-10,0,1.0118728145639831E-12]
[370,1.9002699315988129E-2,5.0037173214257733E-19,1.3980654091687344E-33,1.0356293906550258E-10,0,5.5347074558637672E-10,0,1.9456413874772176E-12,null,370,1.8993706532820922E-2,4.5871570679273653E-19,1.3652746807074576E-33,8.5024932213096548E-11,0,5.1915240620172962E-10,0,1.920977305011436E-12]
[380,1.9402684376471687E-2,1.3137457635056712E-18,4.1705469785847259E-33,1.7913776960864289E-10,0,8.8869196747975102E-10,0,3.567204312808126E-12,null,380,1.9395237296538761E-2,1.210382345116767E-18,4.0904966530443077E-33,1.4859013819170959E-10,0,8.3641572421387782E-10,0,3.524346751326375E-12]
[390,1.972810715879577E-2,3.2681980385987479E-18,1.0871298271761703E-32,3.0113202352011572E-10,0,1.3919078940920504E-9,0,6.337394827322797E-12,null,390,1.9722169542367291E-2,3.0228466184190407E-18,1.0715006830834519E-32,2.5216830763504915E-10,0,1.3141410480982327E-9,0,6.2651383567702717E-12]
[400,1.9981064494285411E-2,7.7696075807768446E-18,2.4267879395545635E-32,4.9299055180959163E-10,0,2.1304734663395905E-9,9.6798090255278569E-24,1.0935312863478086E-11,null,400,1.9976587350415589E-2,7.2119624085904349E-18,2.4093467957572668E-32,4.1648989244013049E-10,0,2.0172918549512487E-9,4.7250567355260837E-24,1.0816844156812435E-11]
[410,2.0164214939265235E-2,1.7725071483836008E-17,4.2851646303942066E-32,7.8752992180244592E-10,0,3.1920799490153283E-9,5.447877630790973E-23,1.8365813328161419E-11,null,410,2.0161138909598864E-2,1.6508865377822601E-17,4.3082831999129124E-32,6.7080275191173966E-10,0,3.0306622278315805E-9,5.0093531600967856E-23,1.8176534581387682E-11]
[420,2.0280667501258294E-2,3.8909027308795366E-17,4.4805912513274795E-32,1.2296967567833595E-9,0,4.6887833305970637E-9,1.1450350110020221E-22,3.0080221070119706E-11,null,420,2.0278925040498483E-2,3.6357088309622536E-17,4.6789647971781889E-32,1.0554608109825289E-9,0,4.4628627642899174E-9,1.1449932072511238E-22,2.978497813950815E-11]
[430,2.0333880548391192E-2,8.2373136495032237E-17,0,1.8798236766344259E-9,0,6.7613166097747107E-9,1.6667118097138637E-22,4.8128231150588101E-11,null,430,2.0333397892382456E-2,7.7207821604660609E-17,0,1.6250022512510711E-9,0,6.4505994240346127E-9,1.7566292209962462E-22,4.7677861404702848E-11]
[440,2.0327571137636089E-2,1.6855495224885205E-16,0,2.8173956952820812E-9,0,9.583608718482915E-9,1.7236574694302024E-22,7.5344992143775966E-11,null,440,2.0328270057885556E-2,1.584444936025296E-16,0,2.4517351199903508E-9,0,9.1631699676486787E-9,1.9370961798900214E-22,7.4672113707192246E-11]
[450,2.0265634665422187E-2,3.3406428458665002E-16,0,4.1453244211031113E-9,0,1.3367420049163531E-8,8.6626794629582883E-23,1.1557693613588369E-10,null,450,2.0267434014734308E-2,3.1488260422963628E-16,0,3.6298333386737942E-9,0,1.2807089469968489E-8,1.1967670267934503E-22,1.1459091120043648E-10]
[460,2.0152074501607366E-2,6.4256595244048848E-16,0,5.9947106864049819E-9,0,1.8366994996653221E-8,0,1.7394927784170492E-10,null,460,2.0154891559708874E-2,6.0721930987503611E-16,0,5.2799297251664894E-9,0,1.7630746385206923E-8,0,1.7253029785621849E-10]
[470,1.9990941097623678E-2,1.2017568198504125E-15,0,8.5300590561755922E-9,0,2.4883625943882637E-8,0,2.5717727192910252E-10,null,470,1.9994692728507284E-2,1.1383731743245197E-15,0,7.5541755506036399E-9,0,2.3928984176252419E-8,0,2.5516953132398713E-10]
[480,1.9786279947231446E-2,2.1891761704913106E-15,0,1.1954890798378845E-8,0,3.327002085301022E-8,0,3.7392231840378883E-10,null,480,1.9790883581769364E-2,2.0783804541729902E-15,0,1.0641719098837078E-8,0,3.2047500762854558E-8,0,3.7112626542752794E-10]
[490,1.9542087711101656E-2,3.8905111623530379E-15,0,1.6517686063767127E-8,0,4.3934368010161298E-8,0,5.3519287603940308E-10,null,490,1.9547462169473662E-2,3.7014202002912317E-15,0,1.4774539426762289E-8,0,4.2386958957721685E-8,0,5.3135655348115564E-10]
[500,1.9262275784364243E-2,6.7551778984464345E-15,0,2.2518071870092701E-8,0,5.7343996283385513E-8,0,7.5478892527950671E-10,null,500,1.926834195320366E-2,6.4396414333547481E-15,0,2.0233556716521328E-8,0,5.54067054372819E-8,0,7.4959843941719683E-10]
[510,1.8950640580385026E-2,1.1475281080665391E-14,2.6136922033802804E-29,3.0313160553389646E-8,0,7.4028537124629617E-8,0,1.0497874606888367E-9,null,510,1.8957321959470134E-2,1.0959769924966003E-14,2.455377414324696E-29,2.735492784577145E-8,0,7.1628003285753972E-8,0,1.0428566427728839E-9]
[520,1.8610839817869537E-2,1.9095579927577154E-14,1.006298908379131E-28,4.0323934049893744E-8,0,9.4582505012960516E-8,0,1.4410652360344984E-9,null,520,1.8618062950720181E-2,1.8269979185348832E-14,9.8068814065716178E-29,3.6536425538563199E-8,0,9.1636693303808722E-8,0,1.4319245860321591E-9]
[530,1.8246374126073855E-2,3.1163803323647169E-14,2.3952472932113278E-28,5.3041562981592355E-8,0,1.1966722557039459E-7,1.0395940663545046E-21,1.9538537782847237E-9,null,530,1.8254068928165428E-2,2.9866209379695904E-14,2.3631254280028271E-28,4.824379202105682E-8,0,1.1608521156526337E-7,8.2617552735500172E-22,1.9419388045572003E-9]
[540,1.786057332014861E-2,4.9932540009736442E-14,4.5094289977384877E-28,6.903354617471586E-8,0,1.5001205462649886E-7,2.9609017159216717E-21,2.6183205725705849E-9,null,540,1.7868673317597256E-2,4.7928987076502497E-14,4.4849056419029861E-28,6.3016953679679912E-8,0,1.4569390458209833E-7,2.8180481141831378E-21,2.6029596628141843E-9]
[550,1.7456586742023394E-2,7.8625945362319112E-14,7.0444048865034898E-28,8.8949555952285698E-8,0,1.8641484650667747E-7,5.1536324026823947E-21,3.4701693355293574E-9,null,550,1.7465029232682974E-2,7.5583804341514838E-14,7.0591327230768569E-28,8.147598185770206E-8,0,1.8125159834135823E-7,5.1553172584998217E-21,3.4505713129855139E-9]
[560,1.7037377108938375E-2,1.2178660897981173E-13,8.9490979774327827E-28,1.1352687720122772E-7,0,2.2974164523941929E-7,7.1968383745345292E-21,4.551251469913563E-9,null,560,1.704610325685876E-2,1.1724021273985881E-13,9.0567860524840323E-28,1.0432668656126082E-7,0,2.2361539287048163E-7,7.4082483272986304E-21,4.526493003987776E-9]
[570,1.6605717359939046E-2,1.8572006065446254E-13,8.04340166783579E-28,1.4359533361424481E-7,0,2.8092558773122093E-7,8.5563453778274755E-21,5.9101801519841292E-9,null,570,1.661467223315425E-2,1.7902692090735111E-13,8.3168436944126826E-28,1.3236573430345908E-7,0,2.7370966937512686E-7,9.0116342329409691E-21,5.879193203614965E-9]
[580,1.6164190038602814E-2,2.7905649148614668E-13,7.9693686763231776E-29,1.8008160235982457E-7,0,3.4096502281285211E-7,8.6858082300116928E-21,7.6029380603330951E-9,null,580,1.6173322599235842E-2,2.6934228931387688E-13,1.3106923988284939E-28,1.6648518833454034E-7,0,3.3252431193596567E-7,9.3632599929580046E-21,7.5644975494828977E-9]
[590,1.5715188797024562E-2,4.1345126058540974E-13,0,2.2401282839444267E-7,0,4.1092086405145528E-7,7.1723490798293602E-21,9.6934695180334558E-9,null,590,1.5724451851773739E-2,3.9954162183422466E-13,0,2.0767637876010416E-7,0,4.0111215987356183E-7,7.9684851862546045E-21,9.6461814034503663E-9]
[600,1.5260921650815721E-2,6.0444757089775207E-13,0,2.765194613144055E-7,0,4.9191320705390438E-7,3.920819862795976E-21,1.2254247789743316E-8,null,600,1.5270271768953719E-2,5.8478448587248208E-13,0,2.5703302116478774E-7,0,4.80585719888256E-7,4.6226865009104619E-21,1.2196537749731753E-8]
[610,1.480341565708833E-2,8.7252625410478067E-13,0,3.3883725064611224E-7,0,5.8511725343250691E-7,0,1.5366808445339592E-8,null,610,1.481281306231555E-2,8.4506687496488871E-13,0,3.1575351493627416E-7,0,5.7211317872037859E-7,0,1.5296911342861443E-8]
[620,1.4344522726715886E-2,1.244368830330614E-12,0,4.1230834938500989E-7,0,6.9175859350709441E-7,0,1.9122240059851773E-8,null,620,1.4353931168412914E-2,1.2064642857215556E-12,0,3.8514236611558614E-7,0,6.7691376718893281E-7,0,1.9038190366159892E-8]
[630,1.3885926318387446E-2,1.7543608345205771E-12,0,4.9838149001882928E-7,0,8.1310790808335301E-7,0,2.3621624049185116E-8,null,630,1.3895312927084446E-2,1.7026126451193249E-12,0,4.6661069388265782E-7,0,7.9625253495171773E-7,0,2.3521247387747591E-8]
[640,1.3429148795369147E-2,2.4463627666413267E-12,0,5.9861121183685467E-7,0,9.5047515623837638E-7,0,2.8976416121994461E-8,null,640,1.343848392662236E-2,2.3764544325138657E-12,0,5.6167579433889621E-7,0,9.3143460214206409E-7,0,2.8857322079149344E-8]
[650,1.2975559255824153E-2,3.3757758762387882E-12,0,7.14656132693322E-7,0,1.1052033209726013E-6,1.4116225002397003E-20,3.5308762637077778E-8,null,650,1.2984816326090824E-2,3.2822772412709444E-12,0,6.7195974971794796E-7,0,1.0837989591825505E-6,3.0949348142639943E-21,3.5168338968154949E-8]
[660,1.2526381674964608E-2,4.6119292945301435E-12,0,8.4827627225818146E-7,0,1.2786617879060467E-6,5.4924712215554877E-20,4.2751746068200727E-8,null,660,1.2535536992542111E-2,4.4880713776241589E-12,0,7.9918708522642563E-7,0,1.2547118896027809E-6,3.527367185615955E-20,4.2587154408274618E-8]
[670,1.2082703221626726E-2,6.240813753927673E-12,1.6244741902237308E-26,1.0013294468937228E-6,0,1.4722394339931756E-6,1.3576866831586893E-19,5.1449554769049407E-8,null,670,1.20917358152352E-2,6.0782318728183284E-12,1.4639725337890995E-26,9.4518148911381873E-7,0,1.4455600926795621E-6,1.0193161142630307E-19,5.1257727936561885E-8]
[680,1.164548263360703E-2,8.3681852751680867E-12,7.3087753182991114E-26,1.1757667684280195E-6,7.2292600428221225E-40,1.6873375036183977E-6,2.8289783474051257E-19,6.1557573274897463E-8,null,680,1.1654374080798611E-2,8.1566284769442481E-12,7.1117376306501361E-26,1.1118616240660891E-6,3.7406514361550208E-40,1.6577435832841951E-6,2.2573580245399304E-19,6.1335214234625805E-8]
[690,1.1215558555402285E-2,1.1123059760559285E-11,1.5861931615474881E-25,1.3736272900876854E-6,3.5719455975969275E-39,1.9253623485451221E-6,5.3807580815627976E-19,7.3242390450300317E-8,null,690,1.1224292812591768E-2,1.0850064812282839E-11,1.5660160544849165E-25,1.3012360694265586E-6,3.0455626169303555E-39,1.8926684455929105E-6,4.4265879902621957E-19,7.2985972980020965E-8]
[700,1.0793657758989821E-2,1.4661616427664345E-11,2.7102147506553069E-25,1.5970318525795192E-6,8.9241662487363662E-39,2.1877181061710829E-6,9.6761721014041713E-19,8.6681723870837388E-8,null,700,1.0802220994561348E-2,1.4312144908560327E-11,2.6953735186507894E-25,1.5153974439316808E-6,8.2830839635211936E-39,2.1517395154371244E-6,8.0983551671976516E-19,8.6387494954008811E-8]
[710,1.0380403183267443E-2,1.9171524484681104E-11,3.9970582846174643E-25,1.8481761916911745E-6,1.7276175293979127E-38,2.4757993875420902E-6,1.6761913626316936E-18,1.0206425989068668E-7,null,710,1.0388783614967345E-2,1.872756185470234E-11,3.9962048899274749E-25,1.7565157675116655E-6,1.6472794625809721E-38,2.4363530631902175E-6,1.4176505125186932E-18,1.0172824383594636E-7]
[720,9.9763217406673398E-3,2.4876703433659138E-11,5.2228939447311158E-25,2.1293233757709989E-6,2.9767719013405196E-38,2.7909840427507892E-6,2.8275133992220623E-18,1.1958940987790092E-7,null,720,9.9845094781969325E-3,2.4316819327167803E-11,5.2471273966769422E-25,2.0268311281894983E-6,2.8155506500499929E-38,2.7478895453622888E-6,2.407965802833287E-18,1.1920741414550684E-7]
[730,9.5818518508474625E-3,3.2042522949019595E-11,6.026722466648565E-25,2.4427956470377024E-6,5.134141613503405E-38,3.1346260668461498E-6,4.6748406617104669E-18,1.3946698407939921E-7,null,730,9.5898387443945771E-3,3.1341392351264632E-11,6.088349960927395E-25,2.3286457261961348E-6,4.6745869727827953E-38,3.0877064886542372E-6,4.0011256443088546E-18,1.3903460677524886E-7]
[740,9.1973506710944022E-3,4.0981443485019643E-11,5.9121785483086875E-25,2.790965744881557E-6,9.7714460778597519E-38,3.5080487043511699E-6,7.6052440464224215E-18,1.6191678549416455E-7,null,740,9.2051301663066756E-3,4.010932888660924E-11,6.0224860137879389E-25,2.664315372114199E-6,8.5041521926696482E-38,3.457131565255839E-6,6.5353374249441654E-18,1.6142942447395505E-7]
[750,8.8231010014462423E-3,5.2059093693184629E-11,4.2802165147371295E-25,3.1762477921970947E-6,2.0742248121233295E-37,3.9125378050673154E-6,1.2202995388256479E-17,1.8716812697483403E-7,null,750,8.8306680012781164E-3,5.0981288776825484E-11,4.4462556597781767E-25,3.03624051920574E-6,1.7690798033335239E-37,3.8574559127978695E-6,1.0523288431609359E-17,1.8662099048448062E-7]
[760,8.4593178495789238E-3,6.5700775461429811E-11,5.0025630653890769E-26,3.6010878273997489E-6,4.5952185113858799E-37,4.3493354781637316E-6,1.9339178361083534E-17,2.1545927553619808E-7,null,760,8.4666685831873718E-3,6.437701134835856E-11,7.208687403689549E-26,3.4468569121312854E-6,3.9477106674976289E-37,4.2899277467154225E-6,1.673248867329627E-17,2.1484739429996538E-7]
[770,8.1061546467116018E-3,8.2398382006456963E-11,0,4.0679540652095165E-6,9.9692282510439092E-37,4.8196340857224084E-6,3.0296878208479204E-17,2.4703682851792841E-7,null,770,8.1132865455649118E-3,8.0782197569531726E-11,0,3.898625935106201E-6,8.7272133744565314E-37,4.7557463069660497E-6,2.6297912989622369E-17,2.4635506917294258E-7]
[780,7.7637091106597129E-3,1.0271770904726025E-10,0,4.5793269686307786E-6,2.0555981578215149E-36,5.3245706110437688E-6,4.694413280704173E-17,2.8215502682427094E-7,null,780,7.7706206919051059E-3,1.0075578727585153E-10,0,4.3940247422592649E-6,1.8350226914566538E-36,5.2560561751794544E-6,4.0878145531950595E-17,2.8139810658923379E-7]
[790,7.4320287565274616E-3,1.2730613374701066E-10,0,5.1376892129233754E-6,4.001843966337703E-36,5.8652214312002611E-6,7.1970343474894399E-17,3.2107501094370219E-7,null,790,7.4387195135301679E-3,1.2493760661801317E-10,0,4.9355362516591008E-6,3.6315835669585235E-36,5.7919419924874635E-6,6.2869511992323783E-17,3.2023751340074367E-7]
[800,7.1111160589278155E-3,1.5690063091736916E-10,0,5.7455156198588121E-6,7.3833336868030545E-36,6.4425975176398378E-6,1.0920616915250081E-16,3.6406402583667557E-7,null,800,7.1175863589081094E-3,1.5405635567951875E-10,0,5.5256390822681624E-6,6.7857726772741551E-36,6.3644236025758073E-6,9.569673661176603E-17,3.6314041769832089E-7]
[810,6.8009332724181838E-3,1.9233609101354025E-10,0,6.4052631372985384E-6,1.300317744320264E-35,7.0576400831517839E-6,1.6405219326863022E-16,4.1139458107143402E-7,null,810,6.807184261008954E-3,1.8893790122186234E-10,0,6.166797510081862E-6,1.2064452699826745E-35,6.9744516389809844E-6,1.4420360977789515E-16,4.1037922979960012E-7]
[820,6.5014069192252475E-3,2.3455389978435281E-10,0,7.11936093523509E-6,2.2025518505430238E-35,7.7112166882717023E-6,2.4404799954213232E-16,4.6334357278940184E-7,null,820,6.5074404317520341E-3,2.3051383482166439E-10,0,6.8614515160291728E-6,2.0581406740125842E-35,7.6229035703832277E-6,2.1517313565758341E-16,4.6223076493008156E-7]
[830,6.2124319548890724E-3,2.8461073514673867E-10,0,7.8902006850091438E-6,3.6110091496809899E-35,8.4041178152624215E-6,3.5962087005419593E-16,5.2019137419742756E-7,null,830,6.2182504341039124E-3,2.7983025233400082E-10,0,7.6120069939592161E-6,3.3937047305794751E-35,8.3105802126661053E-6,3.1801379417232622E-16,5.1897533429316935E-7]
[840,5.9338756240072546E-3,3.4368753298744089E-10,0,8.7201270835680828E-6,5.7544403836390403E-35,9.1370539131988098E-6,5.250622813785495E-16,5.8222090131915716E-7,null,840,5.9394820441028666E-3,3.3805670670948715E-10,0,8.4208261823293105E-6,5.4371617856071394E-35,9.0382027118586436E-6,4.656570510616349E-16,5.8089581126149915E-7]
[850,5.6655810191839915E-3,4.130985702072563E-10,0,9.6114286794618349E-6,8.9290011617699346E-35,9.9106529134304897E-6,7.5979088151087739E-16,6.4971666069827202E-7,null,850,5.6709788156950871E-3,4.0649528276088942E-10,0,9.2902183781432688E-6,8.4859232490441036E-35,9.8064099977744875E-6,6.75721241880257E-16,6.4827667938381022E-7]
[860,5.4073703568506236E-3,4.9430061045578289E-10,0,1.0566329051878908E-5,1.3478250615665893E-34,1.0725458210813921E-5,1.0899728421799214E-15,7.2296378563871136E-7,null,860,5.4125633622660154E-3,4.8658973956012939E-10,0,1.0222430986365855E-5,1.2899355929487423E-34,1.0615756704230403E-5,9.720086007955432E-16,7.214030687953093E-7]
[870,5.1590479843027373E-3,5.889020556893944E-10,4.8579147890964811E-25,1.1586978388493968E-5,1.9722940715203675E-34,1.1581927102602931E-5,1.550584556252576E-15,8.02247067398045E-7,null,870,5.1640403690128662E-3,5.7993466378132812E-10,2.3856873831534202E-25,1.1219640952548034E-5,1.9041770432878226E-34,1.1466711548173648E-5,1.386415662369082E-15,8.0055978745173573E-7]
[880,4.9204031322492743E-3,6.9867204494402866E-10,7.6209603652743042E-24,1.2675445502311121E-5,2.7805110177231165E-34,1.24804296737638E-5,2.1880187414325744E-15,8.8784998752736203E-7,null,880,4.9251993505782885E-3,6.882845755127968E-10,7.3556111320493869E-24,1.2283946620822341E-5,2.7144517592969924E-34,1.2359656156874623E-5,1.9613526892873649E-15,8.8603035338554289E-7]
[890,4.6912124273750262E-3,8.2554944056020145E-10,1.7071453763442378E-23,1.3833710322113474E-5,3.7403054895079999E-34,1.3421248114740944E-5,3.0633532630453594E-15,9.8005375728095809E-7,null,890,4.6958171683837016E-3,8.1356292685438129E-10,1.6816454399615199E-23,1.3417360053842625E-5,3.7042899066090344E-34,1.3294884329551685E-5,2.752785318400248E-15,9.7809603391344426E-7]
[900,4.4712421793306461E-3,9.7165164153400284E-10,2.8591916279779554E-23,1.5063656885635394E-5,4.7270696235450454E-34,1.4404576455323466E-5,4.2564225312121315E-15,1.0791363697093715E-6,null,900,4.475660322101109E-3,9.5787093300056637E-10,2.8385539398435648E-23,1.4621799845714151E-5,4.7739183156981192E-34,1.4272601717371006E-5,3.8340314068941476E-15,1.0770348974155693E-6]
[910,4.2602504559820674E-3,1.1392831636900066E-9,4.1595370826925475E-23,1.6367066859212056E-5,5.4559921462711497E-34,1.5430520696248552E-5,5.8708542745093573E-15,1.1853716697064729E-6,null,910,4.2644870291113929E-3,1.1234961754803805E-9,4.1484343333681101E-23,1.5899084453546293E-5,5.6746436994178869E-34,1.5292925903703872E-5,5.3004682193547136E-15,1.1831208829642525E-6]
[920,4.0579889609825117E-3,1.3309439269665394E-9,5.5110823305199456E-23,1.7745613602481495E-5,5.3900884543727261E-34,1.649909931850408E-5,8.0402599354956392E-15,1.2990284469119301E-6,null,920,4.062049105984622E-3,1.3129209177695468E-9,5.5147593729973206E-23,1.7250926068011818E-5,5.9182394965836282E-34,1.635588686480595E-5,7.2753297243894208E-15,1.2966228927115734E-6]
[930,3.8642047268538349E-3,1.5493371912512689E-9,6.7771504565292069E-23,1.9200856791752396E-5,3.6246312318429541E-34,1.761024414894266E-5,1.093579494026465E-14,1.4203695559811324E-6,null,930,3.8680936652049232E-3,1.528830074589753E-9,6.801007465295798E-23,1.8678925038254369E-5,4.6611356031161892E-34,1.7461427789691316E-5,9.9168009419622366E-15,1.4178039115558659E-6]
[940,3.6786416363825051E-3,1.7973770838781332E-9,7.7842244513242238E-23,2.0734237610945868E-5,0,1.8763801559774521E-5,1.4775335701909686E-14,1.549651068330847E-6,null,940,3.682364639983106E-3,1.7741187778375805E-9,7.8332667598896845E-23,2.0184564861687107E-5,5.6784802013249383E-35,1.8609406236890262E-5,1.3426646046936347E-14,1.5469201582038423E-6]
[950,3.5010417849380008E-3,2.0781956640631991E-9,8.3292086392771425E-23,2.2347074514589277E-5,0,1.9959533978744481E-5,1.9834553431923146E-14,1.6871214590566268E-6,null,950,3.5046041497035544E-3,2.0518994842097633E-9,8.4073897568976331E-23,2.1769207744696267E-5,0,1.9799595604981796E-5,1.8060639306857491E-14,1.684220271332895E-6]
[960,3.3311466952200709E-3,2.3951494721805307E-9,8.191485958988256E-23,2.4040559563207581E-5,0,2.1197121686295257E-5,2.6460200623232301E-14,1.8330208323015541E-6,null,960,3.334553717563873E-3,2.365508572176048E-9,8.3009865077484686E-23,2.3434090736023133E-5,0,2.1031686893255161E-5,2.4141102893758926E-14,1.8299445341416381E-6]
[970,3.1686983959419313E-3,2.7518255148175219E-9,7.1496251311300886E-23,2.5815755327639311E-5,0,2.2476164875759326E-5,3.5085964364629275E-14,1.9875801879406623E-6,null,970,3.1719553519772639E-3,2.7185123789541242E-9,7.290125019552766E-23,2.5180322430668871E-5,0,2.2305290728565111E-5,3.2071893104255348E-14,1.984324140161581E-6]
[980,3.0134403750380441E-3,3.1520466399593937E-9,5.0021264066023133E-23,2.76735923553018E-5,0,2.3796185952572209E-5,4.6251281339373687E-14,2.1510207320344595E-6,null,980,3.0165525022101502E-3,3.1147126315201866E-9,5.1701388106919866E-23,2.7008880238550787E-5,0,2.3619939634368474E-5,4.2356216453262003E-14,2.147580502791638E-6]
[990,2.8651184174191798E-3,3.5998762603882294E-9,1.5911203014198047E-23,2.9614867188251937E-5,0,2.5156632048649517E-5,6.0623552298557917E-14,2.3235532331028901E-6,null,990,2.8680908984244136E-3,3.5581512293974267E-9,1.7794624721884027E-23,2.8920608208846155E-5,0,2.4975090518055068E-5,5.5617699335924487E-14,2.3199246106150202E-6]
[1000,2.7234813368878681E-3,4.0996223873947128E-9,0,3.1640240920033748E-5,0,2.6556877728387918E-5,7.9024238788337513E-14,2.505377425879916E-6,null,1000,2.7263192856838846E-3,4.0531143409546874E-9,0,3.0916215397990765E-5,0,2.6370127352981883E-5,7.2625179299546786E-14,2.5015564301664903E-6]
[]
[]
["Saved  28/03/2024: 13:54:39  Level Number: 5"]
[]
["BREAKTHROUGH RESULTS"]
[]
["Advanced"]
["Pollutant Linkage: Inert Restorati, Attenuation Layer, Beenham Grange Formation",null,null,"Pollutant Linkage: Inert Restorati, Attenuation Layer, Beenham Grange Formation, Groundwater"]
["Concentrations in mg/L in Beenham Grange Formation",null,null,"Concentrations in mg/L in Groundwater"]
[]
["Compared with EAL (GW) target concentration in mg/L",null,null,"Compared with EAL (GW) target concentration in mg/L"]
[null,1.1999999999999999E-3,null,null,1.1999999999999999E-3]
[]
["Time(years)","Species1",null,"Time(years)","Species1"]
[null,"Arsenic",null,null,"Arsenic"]
[10,0,null,10,0]
[20,0,null,20,0]
[30,0,null,30,0]
[40,1.8118529148476104E-39,null,40,1.9569829910317522E-39]
[50,9.3226713461144197E-35,null,50,8.4324343842008536E-35]
[60,5.060996793646858E-32,null,60,5.4921984647121916E-32]
[70,0,null,70,0]
[80,8.7309538246929588E-28,null,80,8.9005067461439772E-28]
[90,0,null,90,0]
[100,1.8548523868985659E-25,null,100,1.8054519569439872E-25]
[110,5.2714645124776824E-26,null,110,1.0870453749569434E-25]
[120,0,null,120,0]
[130,2.1323178899220227E-23,null,130,2.0748229867684369E-23]
[140,8.012789171003723E-23,null,140,8.2916211488914814E-23]
[150,0,null,150,0]
[160,0,null,160,0]
[170,6.2757368331546262E-22,null,170,6.0313008547424881E-22]
[180,3.4230807960657348E-21,null,180,3.4582967919631673E-21]
[190,3.1737640451622818E-21,null,190,3.2370464577126634E-21]
[200,1.3808009627816582E-21,null,200,9.1950921561239697E-22]
[210,4.4320331668815769E-20,null,210,4.0650925157037527E-20]
[220,3.6764672209682996E-19,null,220,3.4791037010355806E-19]
[230,2.0127751445172864E-18,null,230,1.9198497119328606E-18]
[240,9.1766068615504266E-18,null,240,8.7874963603426305E-18]
[250,3.6966060608845885E-17,null,250,3.5512262839298353E-17]
[260,1.3404238535100324E-16,null,260,1.291494756769429E-16]
[270,4.4223925690355602E-16,null,270,4.2724001212183676E-16]
[280,1.3399221244107936E-15,null,280,1.2976148499945869E-15]
[290,3.7599870555036186E-15,null,290,3.649218967187075E-15]
[300,9.8460516632528534E-15,null,300,9.57481602751892E-15]
[310,2.4221361516069555E-14,null,310,2.3596115696656972E-14]
[320,5.6303110149611187E-14,null,320,5.4938514165965934E-14]
[330,1.2430620591496621E-13,null,330,1.2147233098300809E-13]
[340,2.6184599053179602E-13,null,340,2.562213144231E-13]
[350,5.2836338162915782E-13,null,350,5.1765184858337331E-13]
[360,1.024945275083116E-12,null,360,1.0053048554807196E-12]
[370,1.9174774302371831E-12,null,370,1.8826966779486607E-12]
[380,3.4694200801853764E-12,null,380,3.4097690156490283E-12]
[390,6.0868079145776899E-12,null,390,5.9874810992020495E-12]
[400,1.0378314550601144E-11,null,400,1.0217378392051279E-11]
[410,1.7233357741600032E-11,null,410,1.6979111708114047E-11]
[420,2.7921230743108943E-11,null,420,2.7528893915846114E-11]
[430,4.421410994946467E-11,null,430,4.3621750611170883E-11]
[440,6.8536500350611255E-11,null,440,6.7660137224627407E-11]
[450,1.0414323926021271E-10,null,450,1.0287105841544384E-10]
[460,1.5532759527049877E-10,null,460,1.5351324616048229E-10]
[470,2.2766029219801166E-10,null,470,2.2511524913181458E-10]
[480,3.2825948270142585E-10,null,480,3.2474448338893385E-10]
[490,4.6609082430715263E-10,null,490,4.6130642399213345E-10]
[500,6.522959059346697E-10,null,500,6.4587221297322884E-10]
[510,9.0054637085799859E-10,null,510,8.920320563639888E-10]
[520,1.2274202166047313E-9,null,520,1.2162709159688477E-9]
[530,1.6527959551402795E-9,null,530,1.6383622019394811E-9]
[540,2.2002596153246986E-9,null,540,2.1817744676151008E-9]
[550,2.8975189865258336E-9,null,550,2.8740855211595772E-9]
[560,3.7768190542331215E-9,null,560,3.7473979162377943E-9]
[570,4.8753522764390147E-9,null,570,4.8387494774048236E-9]
[580,6.2356571985113382E-9,null,580,6.19051236027556E-9]
[590,7.905998903853111E-9,null,590,7.8507741416408935E-9]
[600,9.940724942486833E-9,null,600,9.8736945752880304E-9]
[610,1.2400590660220391E-8,null,610,1.231983192589604E-8]
[620,1.5353048254213981E-8,null,620,1.5256433193068114E-8]
[630,1.8872494390904591E-8,null,630,1.8757683044728025E-8]
[640,2.3040471821870442E-8,null,640,2.2904906876308727E-8]
[650,2.7945821103810399E-8,null,650,2.7786724080892061E-8]
[660,3.3684779251498772E-8,null,660,3.3499148336850281E-8]
[670,4.0361022908760222E-8,null,670,4.0145632474980134E-8]
[680,4.8085654394407796E-8,null,680,4.7837056258792558E-8]
[690,5.6977129751089286E-8,null,690,5.6691656182877423E-8]
[700,6.716112868007557E-8,null,700,6.6834897150031306E-8]
[710,7.8770366970881592E-8,null,710,7.8399286614747216E-8]
[720,9.1944352719862172E-8,null,720,9.1524132467284183E-8]
[730,1.0682908826712088E-7,null,730,1.0635524656935413E-7]
[740,1.2357672035876701E-7,null,740,1.2304459643198018E-7]
[750,1.4234514155611917E-7,null,750,1.41749908042604E-7]
[760,1.6329754636118801E-7,null,760,1.6263422329830646E-7]
[770,1.8660194590645054E-7,null,770,1.8586541588277025E-7]
[780,2.1243064536606396E-7,null,780,2.1161566973584904E-7]
[790,2.4095968848586555E-7,null,790,2.4006092450684028E-7]
[800,2.7236827380270864E-7,null,800,2.7138029255775657E-7]
[810,3.0683814723272491E-7,null,810,3.0575545219380249E-7]
[820,3.4455297575658893E-7,null,820,3.4337002184850939E-7]
[830,3.8569770692208119E-7,null,830,3.8440891994483585E-7]
[840,4.3045791882491509E-7,null,840,4.2905771509567637E-7]
[850,4.790191651229633E-7,null,850,4.7750197120272986E-7]
[860,5.3156631949188858E-7,null,860,5.2992659186669513E-7]
[870,5.8828292374714493E-7,null,870,5.8651516833974447E-7]
[880,6.4935054364349107E-7,null,880,6.4744933503823492E-7]
[890,7.1494813612393516E-7,null,890,7.1290813639509731E-7]
[900,7.852514315301085E-7,null,900,7.8306740857196874E-7]
[910,8.6043233401045845E-7,null,910,8.5809917927593123E-7]
[920,9.4065834307562366E-7,null,920,9.3817108863897531E-7]
[930,1.0260919989560241E-6,null,930,1.0234458338241448E-6]
[940,1.1168903541190979E-6,null,940,1.1140806397247612E-6]
[950,1.2132044730057328E-6,null,950,1.210226757825188E-6]
[960,1.3151789617509031E-6,null,960,1.3120289949969661E-6]
[970,1.4229515293644112E-6,null,970,1.4196252737147614E-6]
[980,1.536652581566979E-6,null,980,1.5331462248957237E-6]
[990,1.656404848205988E-6,null,990,1.6527148142944871E-6]
[1000,1.7823230449165119E-6,null,1000,1.7784460031271023E-6]

{"sheet":"User_Water_Balance","index":9,"n_rows":43,"n_cols":11,"rows_kept":43,"cut":false,"hidden":false,"merged":[]}
[null,null,null,"RAINFALL"]
["Input",null,null,"Annual Effective Rainfall",255,"mm",null,null,"FLUX AND DILUTION CALCULATION"]
["Calculations",null,null,"Effective Rainfall  ",{"$f":"E2/(60*60*24*365)/1000","v":8.0859969558599694E-9},"m3/s"]
[null,null,null,null,null,null,null,null,"Void C"]
[null,null,null,"VOID PARAMETERS"]
[null,null,null,"Void Area",{"$f":"119768+29777","v":149545},"m2",null,null,"Max Elevation of void surface",{"$f":"maxele_c","v":58.59},"mAOD"]
[null,null,null,"Void Perimeter",{"$f":"1428+731","v":2159},"m",null,null,"Average GW head downstream",{"$f":"gwele_c","v":54.5},"mAOD"]
[null,null,null,null,null,null,null,null,"Distance from centre of void to perimeter",{"$f":"distancetoedge_c","v":170},"m"]
[null,null,null,"Restoration Material Thickness",{"$f":"maxele_c-E11","v":5.4300000000000068},"m",null,null,"Average depth of restoration material",{"$f":"thick_c","v":5.4300000000000068},"m"]
[null,null,null,null,null,null,null,null,"Perimeter of void ",{"$f":"peri_c","v":2159},"m"]
[null,null,null,"Base of Void C",53.16,"mAOD",null,null,"K",{"$f":"AL_K","v":9.9999999999999995E-8},"m/s"]
[null,null,null,"Maximum Elevation",58.59,"mAOD",null,null,"Qs",{"$f":"((J6-J7)/J8)*J9*J10*J11","v":2.8205049000000064E-5},"m3/s"]
[]
[null,null,null,"Groundwater Elevation at perimeter",54.5,"mAOD",null,null,"Qer_c",{"$f":"effective_rainfall*area_c","v":1.2092204147640792E-3},"m3/s"]
[]
[null,null,null,"Distance from centre void to edge",170,"m",null,null,"QRO_c",{"$f":"J14-J12","v":1.1810153657640791E-3},"m3/s"]
[]
[null,null,null,"Total Volume of restoration material",1153000,"m3"]
[null,null,null,"Volume in Void C",322827.98760536074,"m3"]
[]
[null,null,null,"AQUIFER PROPERTIES"]
[]
[null,null,null,"Attenuation Layer Hydraulic Conductivity",9.9999999999999995E-8,"m/s"]
[null,null,null,"Beenham Grange Formation Hydraulic Conductivity",1.4120000000000001E-3,"m/s"]
[null,null,null,"Attenuation Layer Hydraulic Gradient",{"$f":"(maxele_c-gwele_c)/distancetoedge_c","v":2.4058823529411785E-2}]
[null,null,null,"Beenham Grange Formation Hydraulic Gradient",3.0000000000000001E-3]
[null,null,null,"Attenuation Layer Bulk Density",2000,"kg/m3"]
[null,null,null,"Beenham Grange Formation Bulk Density",1600,"kg/m3"]
[null,null,null,"Attenuation Layer Porosity",0.05]
[null,null,null,"Beenham Grange Formation Porosity",0.2]
[null,null,null,"Tortuosity",5]
[]
[null,null,null,"RECEPTOR TRAVEL DISTANCES"]
[]
[null,null,null,"Attenutation Layer Travel Distance",1,"m"]
[null,null,null,"Distance to River Enborne",30,"m"]
[null,null,null,"Distance to GW Receptor",1,"m"]
[]
[]
[null,null,null,"River Flows"]
[null,null,null,"River Enborne Q95",0.16800000000000001,"m3/s"]
[]
[null,null,null,null,{"$f":"Q_riverEn/0.00000282","v":59574.468085106382}]

{"sheet":"User_Attenuation_Parameters","index":10,"n_rows":22,"n_cols":8,"rows_kept":22,"cut":false,"hidden":false,"merged":[[1,3,1,4],[1,6,1,7]]}
[]
[null,null,null,"Attenuation Layer",null,null,"Beenham Grange Formation"]
["Parameter",null,null,"Kd (L/kg)","Comment",null,"Kd (L/kg)","Comment"]
["Ammoniacial Nitrogen",null,null,0.5,"Mid-range value for engineered clay barriers in Table 4.1 of Buss et al. (2003)",null,0,"Conservative Assumption"]
["Arsenic","As","Haz",137,"Midpoint from range by Golder Associates (2007)",null,25,"Minimum value from range by Golder Associates (2007)"]
["Barium","Ba","Non Haz",17,"Value at pH 8 (representative of Water Chemistry) for unspecified material by Golder Associates (2003)",null,17,"Value at pH 8 (representative of Water Chemistry) for unspecified material by Golder Associates (2003)"]
["Cadmium","Cd","Non Haz",222,"Value for glacial till (representative of clayey conditions) Golder Associates (2003)",null,74,"Value for sand Golder Associates (2003)"]
["Total Chromium","Cr total","Haz",966,"Value for glacial till (representative of clayey conditions) Golder Associates (2003)",null,67,"Value for sand Golder Associates (2003)"]
["Copper","Cu","Non Haz",126.8,"Value for glacial till (representative of clayey conditions) Golder Associates (2003)",null,295,"Value for unspecified conditions, Golder Associates(2003)"]
["Mercury","Hg","Haz",2142,"Midpoint from range by Golder Associates (2007)",null,450,"Value for sand Golder Associates (2003)"]
["Molybdenum","Mo","Non Haz",110,"Value for unspecified conditions, Golder Associates(2003)",null,110,"Value for unspecified conditions, Golder Associates(2003)"]
["Nickel","Ni","Non Haz",410,"Midpoint from range by Golder Associates (2007)",null,400,"Value for sand Golder Associates (2003)"]
["Lead","Pb","Haz",434.6,"Value for glacial till (representative of clayey conditions) Golder Associates (2003)",null,270,"Value for sand Golder Associates (2003)"]
["Antimony","Sb","Non Haz",140,"Geometric mean value for clay (Sheppard et al., 2009)",null,17,"Value for sand Golder Associates (2003)"]
["Selenium","Se","Non Haz",9.5,"Value for unspecified conditions, Golder Associates(2003)",null,9.5,"Value for unspecified conditions, Golder Associates(2003)"]
["Zinc","Zn","Non Haz",20.7,"Value for glacial till (representative of clayey conditions) Golder Associates (2003)",null,200,"Value for sand Golder Associates (2003)"]
["Chloride","Cl","Non Haz",0,"assume zero retardation",null,0,"assume zero retardation"]
["Fluoride","F","Non Haz"]
["Sulphate(a)","SO4","Non Haz",0,"assume zero retardation",null,0,"assume zero retardation"]
[]
[]
[null,null,"Free Water Diffusion Coefficient",2.0000000000000001E-9]

{"sheet":"User_ScreeningAssessment_VoidC","index":11,"n_rows":21,"n_cols":11,"rows_kept":21,"cut":false,"hidden":false,"merged":[[0,0,0,12]]}
["Waste Source Screening Assessment - South of River Enborne"]
["Chemical Name","Symbol","Haz / Non Haz","Pass/Fail","Source Term concentration (mg/l)","Max acceptable concentration (mg/l)","Target Concentration to assess against (mg/l)","UK DWS (mg/l)","UKTAG Quantification Limit (mg/l)","Baseline 95th percentile concentration from ESSD (mg/l)","Comment"]
["Arsenic","As","Haz",{"$f":"IF(E3<=F3,\"Pass\",\"FAIL\")","v":"FAIL"},0.06,{"$f":"G3/B$21","v":5.1446976664245171E-2},{"$f":"MIN(H3:J3)","v":1.1999999999999999E-3},0.01,5.0000000000000001E-3,1.1999999999999999E-3]
["Barium","Ba","Non Haz",{"$f":"IF(E4<=F4,\"Pass\",\"FAIL\")","v":"FAIL"},4,{"$f":"G4/B$21","v":1.8649529040788875},4.3499999999999997E-2,null,null,4.3499999999999997E-2]
["Cadmium","Cd","Non Haz","FAIL",0.02,8.4030061884933765E-3,1.9599999999999994E-4,5.0000000000000001E-3,null,1.9599999999999994E-4]
["Total Chromium","Cr total","Haz","FAIL",0.1,4.2872480553537651E-2,1E-3,0.05,1E-3,1E-3,"Chromium VI hazardous.  Most WIF's only include total chromium so assume all chromium is chromium VI which is very conservative."]
["Copper","Cu","Non Haz",{"$f":"IF(E7<=F7,\"Pass\",\"FAIL\")","v":"FAIL"},0.6,0.21693475160090048,5.0599999999999994E-3,2,null,5.0599999999999994E-3]
["Mercury","Hg","Haz","FAIL",2E-3,8.5744961107075306E-4,2.0000000000000002E-5,1E-3,2.0000000000000002E-5,5.5999999999999938E-5,"Concentrations in all samples were below LOD"]
["Molybdenum","Mo","Non Haz","FAIL",0.2,8.5744961107075301E-2,2E-3,null,null,2E-3]
["Nickel","Ni","Non Haz","Pass",0.12,0.28295837165334825,6.5999999999999948E-3,0.02,null,6.5999999999999948E-3]
["Lead","Pb","Haz","FAIL",0.15,8.5744961107075291E-3,2.0000000000000001E-4,0.01,2.0000000000000001E-4,2.3599999999999966E-3]
["Antimony","Sb","Non Haz","FAIL",0.1,2.1436240276768825E-2,5.0000000000000001E-4,5.0000000000000001E-3,null,5.0000000000000001E-4,"Concentrations in all samples were below LOD"]
["Selenium","Se","Non Haz","Pass",0.04,7.717046499636776E-2,1.8E-3,0.01,null,1.8E-3]
["Zinc","Zn","Non Haz","Pass",1.2,1.4147918582667411,3.2999999999999974E-2,null,null,3.2999999999999974E-2]
["Chloride","Cl","Non Haz","Pass",460,2400.8589109981081,56,250,null,56]
["Fluoride","F","Non Haz","Pass",2.5,8.5959323509842918,0.20049999999999985,1.5,null,0.20049999999999985]
["Sulphate(a)","SO4","Non Haz","Pass",1500,10718.120138384413,250,250,null,413.49999999999915]
["Ammoniacal N","NH3-N","Non Haz","Pass",1,{"$f":"G18/B$21","v":11.318334866133915},0.26399999999999946,0.39,null,0.26399999999999946]
["Dilution  ",{"$f":"Q_RO","v":1.1810153657640791E-3}]
["Q Side",{"$f":"Q_S","v":2.8205049000000064E-5},"m3/s"]
["Dilution Factor",{"$f":"B20/(B20+B19)","v":2.3324985797153377E-2}]

{"sheet":"Groundwater","index":12,"n_rows":7,"n_cols":6,"rows_kept":7,"cut":false,"hidden":true,"merged":[]}
["RECEPTOR: Groundwater"]
[]
["Receptor Options"]
[]
[null,null,null,null,null,"No further dilution along pathway"]
[]
[null,null,null,null,null,"No data requirement"]