{"text_format":"1","workbook":"xlsx","n_sheets":13,"sheets":["Control","Inert Restorati","Contaminants","Hydrogeology","Attenuation","WaterBalance","Pathways","Groundwater ","Simulation","Audit","User_Water_Balance","User_Attenuation_Parameters","User_ScreeningAssessment_VoidB"],"not_rendered":{"charts":0,"images":3,"macros":1,"external_links":0,"defined_names":5466,"comments":1,"pivot_tables":0},"unopened":[],"bounds":{"document_bytes":16777216,"sheet_cells":100000,"rows_first":2000,"rows_last":500,"rows_between":2000,"halvings":0,"cell_chars":16384,"cell_head_chars":4096},"cells_cut":0,"cells_raw":0,"read":"whole","date_system":"1900"}

{"sheet":"Control","index":0,"n_rows":34,"n_cols":3,"rows_kept":34,"cut":false,"hidden":false,"merged":[]}
[]
[]
[]
[]
[]
[]
[]
[]
[]
[]
[]
[]
[]
[]
[]
[]
[]
[]
[]
[]
[]
[]
[]
[]
[]
[]
[]
[]
[]
[null,null,"Numerical value"]
[null,null,"Suggested formula"]
[null,null,"Probabilistic parameters"]
[null,null,"Data specified elsewhere"]
[null,null,"Suggested formula edited"]

{"sheet":"Inert Restorati","index":1,"n_rows":131,"n_cols":10,"rows_kept":131,"cut":false,"hidden":true,"merged":[]}
["SOURCE CONCENTRATIONS: Inert Restorati"]
[]
["Source Data Options","Source Type"]
[]
[]
[]
[]
[]
[]
[]
["Target Standard"]
[]
["Select which Quality Standard (defined on the Contaminants sheet) to apply"]
["Not Specified"]
[]
[]
["Source Geometry"]
[]
["Inert_Restorati_Source_length",null,"m"]
["Inert_Restorati_Source_width",null,"m"]
["Inert_Restorati_Source_area",{"$f":"area_b","v":160618},"m2"]
["Inert_Restorati_Source_thickness",{"$f":"thick_b","v":6.2800000000000011},"m"]
["Inert_Restorati_Source_volume",{"$f":"vol_b","v":417835.8074747686},"m3"]
[]
[]
["General Source Properties"]
[]
["Inert_Restorati_Source_field_capacity","[-]",0.3]
["Distribution",null,"constant"]
["Inert_Restorati_Source_field_capacity_param1"]
["Inert_Restorati_Source_field_capacity_param2"]
["Inert_Restorati_Source_field_capacity_param3"]
[]
[]
["Inert_Restorati_Source_porosity_total","[-]"]
["Distribution",null,"constant"]
["Inert_Restorati_Source_porosity_total_param1"]
["Inert_Restorati_Source_porosity_total_param2"]
["Inert_Restorati_Source_porosity_total_param3"]
[]
[]
["Inert_Restorati_Source_porosity_water_filled","[-]"]
["Distribution",null,"constant"]
["Inert_Restorati_Source_porosity_water_filled_param1"]
["Inert_Restorati_Source_porosity_water_filled_param2"]
["Inert_Restorati_Source_porosity_water_filled_param3"]
[]
[]
["Inert_Restorati_Source_porosity_air_filled","[-]",{"$f":" Inert_Restorati_Source_porosity_total - Inert_Restorati_Source_porosity_water_filled","v":0}]
["Distribution",null,"constant"]
["Inert_Restorati_Source_porosity_air_filled_param1"]
["Inert_Restorati_Source_porosity_air_filled_param2"]
["Inert_Restorati_Source_porosity_air_filled_param3"]
[]
[]
["Inert_Restorati_Source_dry_bulk_density","kg/m3"]
["Distribution",null,"constant"]
["Inert_Restorati_Source_dry_bulk_density_param1"]
["Inert_Restorati_Source_dry_bulk_density_param2"]
["Inert_Restorati_Source_dry_bulk_density_param3"]
[]
[]
["Inert_Restorati_Source_fraction_organic_carbon","[-]"]
["Distribution",null,"constant"]
["Inert_Restorati_Source_fraction_organic_carbon_param1"]
["Inert_Restorati_Source_fraction_organic_carbon_param2"]
["Inert_Restorati_Source_fraction_organic_carbon_param3"]
[]
[]
[]
["Source Contaminant Information"]
[]
["Source determinand names",null,{"$f":" IF( ISTEXT( (Contaminants_Source_determinand_names Contaminants_Species1)), (Contaminants_Source_determinand_names Contaminants_Species1), \"Undefined\" )","v":"Barium"},{"$f":" IF( ISTEXT( (Contaminants_Source_determinand_names Contaminants_Species2)), (Contaminants_Source_determinand_names Contaminants_Species2), \"Undefined\" )","v":"Copper"},{"$f":" IF( ISTEXT( (Contaminants_Source_determinand_names Contaminants_Species3)), (Contaminants_Source_determinand_names Contaminants_Species3), \"Undefined\" )","v":"Lead"},{"$f":" IF( ISTEXT( (Contaminants_Source_determinand_names Contaminants_Species4)), (Contaminants_Source_determinand_names Contaminants_Species4), \"Undefined\" )","v":"Total Chromium"},{"$f":" IF( ISTEXT( (Contaminants_Source_determinand_names Contaminants_Species5)), (Contaminants_Source_determinand_names Contaminants_Species5), \"Undefined\" )","v":"Cadmium"},{"$f":" IF( ISTEXT( (Contaminants_Source_determinand_names Contaminants_Species6)), (Contaminants_Source_determinand_names Contaminants_Species6), \"Undefined\" )","v":"Mercury"},{"$f":" IF( ISTEXT( (Contaminants_Source_determinand_names Contaminants_Species7)), (Contaminants_Source_determinand_names Contaminants_Species7), \"Undefined\" )","v":"Molybdenum"},{"$f":" IF( ISTEXT( (Contaminants_Source_determinand_names Contaminants_Species8)), (Contaminants_Source_determinand_names Contaminants_Species8), \"Undefined\" )","v":"Antimony"}]
[]
["Inert_Restorati_Pore_water_concentration","mg/L",4,0.6,0.15,{"$f":"User_ScreeningAssessment_VoidB!E6","v":0.1},0.02,{"$f":"User_ScreeningAssessment_VoidB!E8","v":2E-3},{"$f":"User_ScreeningAssessment_VoidB!E9","v":0.2},0.1]
["Distribution",null,"constant","constant","constant","constant","constant","constant","constant","constant"]
["Inert_Restorati_Pore_water_concentration_param1"]
["Inert_Restorati_Pore_water_concentration_param2"]
["Inert_Restorati_Pore_water_concentration_param3"]
[]
[]
["Inert_Restorati_Leaching_test_concentration","mg/L"]
["Distribution",null,"constant","constant","constant","constant","constant","constant","constant","constant"]
["Inert_Restorati_Leaching_test_concentration_param1"]
["Inert_Restorati_Leaching_test_concentration_param2"]
["Inert_Restorati_Leaching_test_concentration_param3"]
[]
[]
["Inert_Restorati_Soil_contaminant_concentration","mg/kg",1,4,0.1,0.6,2E-3,0.2,0.15,0.1]
["Distribution",null,"constant","constant","constant","constant","constant","constant","constant","constant"]
["Inert_Restorati_Soil_contaminant_concentration_param1"]
["Inert_Restorati_Soil_contaminant_concentration_param2"]
["Inert_Restorati_Soil_contaminant_concentration_param3"]
[]
[]
["Inert_Restorati_Source_solid_water_partitioning_coefficient_Kd","L/kg",{"$f":" (Contaminants_Organic_Carbon_Water_Partition_Coefficient_Koc  Contaminants_Species1) * ( Inert_Restorati_Source_fraction_organic_carbon)","v":0},{"$f":" (Contaminants_Organic_Carbon_Water_Partition_Coefficient_Koc  Contaminants_Species2) * ( Inert_Restorati_Source_fraction_organic_carbon)","v":0},{"$f":" (Contaminants_Organic_Carbon_Water_Partition_Coefficient_Koc  Contaminants_Species3) * ( Inert_Restorati_Source_fraction_organic_carbon)","v":0},{"$f":" (Contaminants_Organic_Carbon_Water_Partition_Coefficient_Koc  Contaminants_Species4) * ( Inert_Restorati_Source_fraction_organic_carbon)","v":0},{"$f":" (Contaminants_Organic_Carbon_Water_Partition_Coefficient_Koc  Contaminants_Species5) * ( Inert_Restorati_Source_fraction_organic_carbon)","v":0},{"$f":" (Contaminants_Organic_Carbon_Water_Partition_Coefficient_Koc  Contaminants_Species6) * ( Inert_Restorati_Source_fraction_organic_carbon)","v":0},{"$f":" (Contaminants_Organic_Carbon_Water_Partition_Coefficient_Koc  Contaminants_Species7) * ( Inert_Restorati_Source_fraction_organic_carbon)","v":0},{"$f":" (Contaminants_Organic_Carbon_Water_Partition_Coefficient_Koc  Contaminants_Species8) * ( Inert_Restorati_Source_fraction_organic_carbon)","v":0}]
["Distribution",null,"constant","constant","constant","constant","constant","constant","constant","constant"]
["Inert_Restorati_Source_solid_water_partitioning_coefficient_Kd_param1"]
["Inert_Restorati_Source_solid_water_partitioning_coefficient_Kd_param2"]
["Inert_Restorati_Source_solid_water_partitioning_coefficient_Kd_param3"]
[]
[]
["Inert_Restorati_Initial_inventory","kg",{"$f":" 0.001 * (Inert_Restorati_Pore_water_concentration) * (Inert_Restorati_Source_field_capacity) * (Inert_Restorati_Source_volume)","v":501.40296896972228},75.210445345458339,18.802611336364585,12.535074224243058,2.5070148448486118,0.25070148448486113,25.070148448486115,12.535074224243058]
["Distribution",null,"constant","constant","constant","constant","constant","constant","constant","constant"]
["Inert_Restorati_Initial_inventory_param1"]
["Inert_Restorati_Initial_inventory_param2"]
["Inert_Restorati_Initial_inventory_param3"]
[]
[]
["Inert_Restorati_Kappa_slope_value_m","kg/L"]
["Distribution",null,"constant","constant","constant","constant","constant","constant","constant","constant"]
["Inert_Restorati_Kappa_slope_value_m_param1"]
["Inert_Restorati_Kappa_slope_value_m_param2"]
["Inert_Restorati_Kappa_slope_value_m_param3"]
[]
[]
["Inert_Restorati_Kappa_intercept_value_c","kg/L"]
["Distribution",null,"constant","constant","constant","constant","constant","constant","constant","constant"]
["Inert_Restorati_Kappa_intercept_value_c_param1"]
["Inert_Restorati_Kappa_intercept_value_c_param2"]
["Inert_Restorati_Kappa_intercept_value_c_param3"]
[]
[]
["Inert_Restorati_Kappa_Value","kg/L",{"$f":" IF(AND(ISNUMBER(Inert_Restorati_Kappa_slope_value_m),ISNUMBER(Inert_Restorati_Kappa_intercept_value_c),ISNUMBER(Inert_Restorati_Input_concentration)), IF(Inert_Restorati_Input_concentration>0,MAX(0,Inert_Restorati_Kappa_slope_value_m * LN(1000 * Inert_Restorati_Input_concentration) + Inert_Restorati_Kappa_intercept_value_c),\"\"),\"Not-used\")","v":"Not-used"},"Not-used","Not-used","Not-used","Not-used","Not-used","Not-used","Not-used"]
["Distribution",null,"constant","constant","constant","constant","constant","constant","constant","constant"]
["Inert_Restorati_Kappa_Value_param1"]
["Inert_Restorati_Kappa_Value_param2"]
["Inert_Restorati_Kappa_Value_param3"]
[]
[]
["Inert_Restorati_Input_concentration","mg/L",{"$f":" (Inert_Restorati_Pore_water_concentration)","v":4},0.6,0.15,0.1,0.02,2E-3,0.2,0.1]

{"sheet":"Contaminants","index":2,"n_rows":42,"n_cols":11,"rows_kept":42,"cut":false,"hidden":false,"merged":[]}
["CONTAMINANT INFORMATION"]
[]
[null,null,null,"Species1","Species2","Species3","Species4","Species5","Species6","Species7","Species8"]
["Source determinand names",null,8,"Barium","Copper","Lead","Total Chromium","Cadmium","Mercury","Molybdenum","Antimony"]
[]
[]
["Receptor Target Concentrations"]
[null,"Name",null,"Values in mg/L"]
["Quality Standard 1  ","EAL (GW)",null,{"$f":"User_ScreeningAssessment_VoidB!G4","v":0.05},{"$f":"User_ScreeningAssessment_VoidB!G7","v":4.2000000000000006E-3},{"$f":"User_ScreeningAssessment_VoidB!G11","v":2.0000000000000002E-5},{"$f":"User_ScreeningAssessment_VoidB!G6","v":5.0000000000000001E-4},{"$f":"User_ScreeningAssessment_VoidB!G5","v":2.5099999999999992E-4},{"$f":"User_ScreeningAssessment_VoidB!G8","v":2.0000000000000002E-5},{"$f":"User_ScreeningAssessment_VoidB!G9","v":1E-3},{"$f":"User_ScreeningAssessment_VoidB!G12","v":1E-3}]
["Quality Standard 2  "]
["Quality Standard 3  "]
["Quality Standard 4  "]
[null,"Not Specified"]
[]
["Generic Contaminant Properties"]
[]
["Contaminants_Solubility","mg/L"]
["Distribution",null,null,"constant","constant","constant","constant","constant","constant","constant","constant"]
["Contaminants_Solubility_param1"]
["Contaminants_Solubility_param2"]
["Contaminants_Solubility_param3"]
[]
[]
["Contaminants_Henrys_Law_Constant","[-]"]
["Distribution",null,null,"constant","constant","constant","constant","constant","constant","constant","constant"]
["Contaminants_Henrys_Law_Constant_param1"]
["Contaminants_Henrys_Law_Constant_param2"]
["Contaminants_Henrys_Law_Constant_param3"]
[]
[]
["Contaminants_Organic_Carbon_Water_Partition_Coefficient_Koc","L/kg"]
["Distribution",null,null,"constant","constant","constant","constant","constant","constant","constant","constant"]
["Contaminants_Organic_Carbon_Water_Partition_Coefficient_Koc_param1"]
["Contaminants_Organic_Carbon_Water_Partition_Coefficient_Koc_param2"]
["Contaminants_Organic_Carbon_Water_Partition_Coefficient_Koc_param3"]
[]
[]
["Contaminants_Free_Water_Diffusion_Coefficient","m2/s",null,{"$f":"Free_Water_Diffusion_Coefficient","v":2.0000000000000001E-9},2.0000000000000001E-9,2.0000000000000001E-9,2.0000000000000001E-9,2.0000000000000001E-9,2.0000000000000001E-9,2.0000000000000001E-9,2.0000000000000001E-9]
["Distribution",null,null,"constant","constant","constant","constant","constant","constant","constant","constant"]
["Contaminants_Free_Water_Diffusion_Coefficient_param1"]
["Contaminants_Free_Water_Diffusion_Coefficient_param2"]
["Contaminants_Free_Water_Diffusion_Coefficient_param3"]

{"sheet":"Hydrogeology","index":3,"n_rows":58,"n_cols":18,"rows_kept":58,"cut":false,"hidden":false,"merged":[]}
["HYDROGEOLOGICAL UNITS"]
[]
["Hydrogeological Units",null,"Attenution Laye","Beenham Grange "]
[]
["Hydrogeology_Unit_Thickness","m",1,{"$f":"thick_b","v":6.2800000000000011}]
["Distribution",null,"constant","constant","constant","constant","constant","constant","constant","constant","constant","constant","constant","constant","constant","constant","constant","constant"]
["Hydrogeology_Unit_Thickness_param1"]
["Hydrogeology_Unit_Thickness_param2"]
["Hydrogeology_Unit_Thickness_param3"]
[]
[]
["Hydrogeology_Log_Hydraulic_Conductivity","log(m/s)"]
["Distribution",null,"constant","constant","constant","constant","constant","constant","constant","constant","constant","constant","constant","constant","constant","constant","constant","constant"]
["Hydrogeology_Log_Hydraulic_Conductivity_param1"]
["Hydrogeology_Log_Hydraulic_Conductivity_param2"]
["Hydrogeology_Log_Hydraulic_Conductivity_param3"]
[]
[]
["Hydrogeology_Hydraulic_Conductivity","m/s",{"$f":"AL_K","v":9.9999999999999995E-8},{"$f":"BGF_K","v":1.4120000000000001E-3},{"$f":" POWER(10, (Hydrogeology_Log_Hydraulic_Conductivity))","v":1},1,1,1,1,1,1,1,1,1,1,1,1,1]
["Distribution",null,"constant","constant","constant","constant","constant","constant","constant","constant","constant","constant","constant","constant","constant","constant","constant","constant"]
["Hydrogeology_Hydraulic_Conductivity_param1"]
["Hydrogeology_Hydraulic_Conductivity_param2"]
["Hydrogeology_Hydraulic_Conductivity_param3"]
[]
[]
["Hydrogeology_Head","m"]
["Distribution",null,"constant","constant","constant","constant","constant","constant","constant","constant","constant","constant","constant","constant","constant","constant","constant","constant"]
["Hydrogeology_Head_param1"]
["Hydrogeology_Head_param2"]
["Hydrogeology_Head_param3"]
[]
[]
["Hydrogeology_Hydraulic_Gradient","[-]",{"$f":"(maxele_b-gwele_b)/distancetoedge_b","v":1.8866666666666657E-2},{"$f":"BGF_hydraulic_gradient","v":3.0000000000000001E-3}]
["Distribution",null,"constant","constant","constant","constant","constant","constant","constant","constant","constant","constant","constant","constant","constant","constant","constant","constant"]
["Hydrogeology_Hydraulic_Gradient_param1"]
["Hydrogeology_Hydraulic_Gradient_param2"]
["Hydrogeology_Hydraulic_Gradient_param3"]
[]
[]
["Hydrogeology_Porosity","[-]",{"$f":"AL_porosity","v":0.05},{"$f":"BGF_porosity","v":0.2}]
["Distribution",null,"constant","constant","constant","constant","constant","constant","constant","constant","constant","constant","constant","constant","constant","constant","constant","constant"]
["Hydrogeology_Porosity_param1"]
["Hydrogeology_Porosity_param2"]
["Hydrogeology_Porosity_param3"]
[]
[]
["Hydrogeology_Velocity","m/s",{"$f":" (Hydrogeology_Hydraulic_Conductivity) * (Hydrogeology_Hydraulic_Gradient) / (Hydrogeology_Porosity)","v":3.7733333333333307E-8},2.1180000000000001E-5,{"$error":"#DIV/0!"},{"$error":"#DIV/0!"},{"$error":"#DIV/0!"},{"$error":"#DIV/0!"},{"$error":"#DIV/0!"},{"$error":"#DIV/0!"},{"$error":"#DIV/0!"},{"$error":"#DIV/0!"},{"$error":"#DIV/0!"},{"$error":"#DIV/0!"},{"$error":"#DIV/0!"},{"$error":"#DIV/0!"},{"$error":"#DIV/0!"},{"$error":"#DIV/0!"}]
["Distribution",null,"constant","constant","constant","constant","constant","constant","constant","constant","constant","constant","constant","constant","constant","constant","constant","constant"]
["Hydrogeology_Velocity_param1"]
["Hydrogeology_Velocity_param2"]
["Hydrogeology_Velocity_param3"]
[]
[]
["Hydrogeology_Tortuosity","[-]",{"$f":"Tortuosity","v":5},5,5,5,5,5,5,5,5,5,5,5,5,5,5,5]
["Distribution",null,"constant","constant","constant","constant","constant","constant","constant","constant","constant","constant","constant","constant","constant","constant","constant","constant"]
["Hydrogeology_Tortuosity_param1"]
["Hydrogeology_Tortuosity_param2"]
["Hydrogeology_Tortuosity_param3"]

{"sheet":"Attenuation","index":4,"n_rows":261,"n_cols":18,"rows_kept":261,"cut":false,"hidden":false,"merged":[]}
["ATTENUATION PARAMETERS"]
[]
["Hydrogeological Units",null,"Attenution Laye","Beenham Grange "]
[]
["General properties"]
[]
["Attenuation_Dry_bulk_density","kg/m3",{"$f":"Attenuation_Layer_Bulk_Density","v":2000},{"$f":"Beenham_Grange_Formation_Bulk_Density","v":1600}]
["Distribution",null,"constant","constant","constant","constant","constant","constant","constant","constant","constant","constant","constant","constant","constant","constant","constant","constant"]
["Attenuation_Dry_bulk_density_param1"]
["Attenuation_Dry_bulk_density_param2"]
["Attenuation_Dry_bulk_density_param3"]
[]
[]
["Attenuation_Fraction_organic_carbon","[-]"]
["Distribution",null,"constant","constant","constant","constant","constant","constant","constant","constant","constant","constant","constant","constant","constant","constant","constant","constant"]
["Attenuation_Fraction_organic_carbon_param1"]
["Attenuation_Fraction_organic_carbon_param2"]
["Attenuation_Fraction_organic_carbon_param3"]
[]
[]
[]
["Contaminant specific parameters"]
[]
[{"$f":" IF((Contaminants_Source_determinand_names   Contaminants_Species1)=0,\"Undefined\",(Contaminants_Source_determinand_names   Contaminants_Species1))","v":"Barium"}]
[]
["Attenuation_Partition_Coefficient_Kd_Species_1","L/kg",{"$f":"AL_Kd_Ba","v":17},{"$f":"BGF_Kd_Ba","v":17},{"$f":" (Attenuation_Fraction_organic_carbon) * (Contaminants_Organic_Carbon_Water_Partition_Coefficient_Koc  Contaminants_Species1)","v":0},{"$f":" (Attenuation_Fraction_organic_carbon) * (Contaminants_Organic_Carbon_Water_Partition_Coefficient_Koc  Contaminants_Species1)","v":0},{"$f":" (Attenuation_Fraction_organic_carbon) * (Contaminants_Organic_Carbon_Water_Partition_Coefficient_Koc  Contaminants_Species1)","v":0},{"$f":" (Attenuation_Fraction_organic_carbon) * (Contaminants_Organic_Carbon_Water_Partition_Coefficient_Koc  Contaminants_Species1)","v":0},{"$f":" (Attenuation_Fraction_organic_carbon) * (Contaminants_Organic_Carbon_Water_Partition_Coefficient_Koc  Contaminants_Species1)","v":0},{"$f":" (Attenuation_Fraction_organic_carbon) * (Contaminants_Organic_Carbon_Water_Partition_Coefficient_Koc  Contaminants_Species1)","v":0},{"$f":" (Attenuation_Fraction_organic_carbon) * (Contaminants_Organic_Carbon_Water_Partition_Coefficient_Koc  Contaminants_Species1)","v":0},{"$f":" (Attenuation_Fraction_organic_carbon) * (Contaminants_Organic_Carbon_Water_Partition_Coefficient_Koc  Contaminants_Species1)","v":0},{"$f":" (Attenuation_Fraction_organic_carbon) * (Contaminants_Organic_Carbon_Water_Partition_Coefficient_Koc  Contaminants_Species1)","v":0},{"$f":" (Attenuation_Fraction_organic_carbon) * (Contaminants_Organic_Carbon_Water_Partition_Coefficient_Koc  Contaminants_Species1)","v":0},{"$f":" (Attenuation_Fraction_organic_carbon) * (Contaminants_Organic_Carbon_Water_Partition_Coefficient_Koc  Contaminants_Species1)","v":0},{"$f":" (Attenuation_Fraction_organic_carbon) * (Contaminants_Organic_Carbon_Water_Partition_Coefficient_Koc  Contaminants_Species1)","v":0},{"$f":" (Attenuation_Fraction_organic_carbon) * (Contaminants_Organic_Carbon_Water_Partition_Coefficient_Koc  Contaminants_Species1)","v":0},{"$f":" (Attenuation_Fraction_organic_carbon) * (Contaminants_Organic_Carbon_Water_Partition_Coefficient_Koc  Contaminants_Species1)","v":0}]
["Distribution",null,"constant","constant","constant","constant","constant","constant","constant","constant","constant","constant","constant","constant","constant","constant","constant","constant"]
["Attenuation_Partition_Coefficient_Kd_Species_1_param1"]
["Attenuation_Partition_Coefficient_Kd_Species_1_param2"]
["Attenuation_Partition_Coefficient_Kd_Species_1_param3"]
[]
[]
["Attenuation_Retardation_Species_1","[-]",{"$f":" 1 + 0.001 * (Attenuation_Partition_Coefficient_Kd_Species_1) * (Attenuation_Dry_bulk_density) / (Hydrogeology_Porosity    Hydrogeology!$C:$C)","v":681},{"$f":" 1 + 0.001 * (Attenuation_Partition_Coefficient_Kd_Species_1) * (Attenuation_Dry_bulk_density) / (Hydrogeology_Porosity    Hydrogeology!$D:$D)","v":137},{"$f":" 1 + 0.001 * (Attenuation_Partition_Coefficient_Kd_Species_1) * (Attenuation_Dry_bulk_density) / (Hydrogeology_Porosity    Hydrogeology!$E:$E)","v":{"$error":"#DIV/0!"}},{"$f":" 1 + 0.001 * (Attenuation_Partition_Coefficient_Kd_Species_1) * (Attenuation_Dry_bulk_density) / (Hydrogeology_Porosity    Hydrogeology!$F:$F)","v":{"$error":"#DIV/0!"}},{"$f":" 1 + 0.001 * (Attenuation_Partition_Coefficient_Kd_Species_1) * (Attenuation_Dry_bulk_density) / (Hydrogeology_Porosity    Hydrogeology!$G:$G)","v":{"$error":"#DIV/0!"}},{"$f":" 1 + 0.001 * (Attenuation_Partition_Coefficient_Kd_Species_1) * (Attenuation_Dry_bulk_density) / (Hydrogeology_Porosity    Hydrogeology!$H:$H)","v":{"$error":"#DIV/0!"}},{"$f":" 1 + 0.001 * (Attenuation_Partition_Coefficient_Kd_Species_1) * (Attenuation_Dry_bulk_density) / (Hydrogeology_Porosity    Hydrogeology!$I:$I)","v":{"$error":"#DIV/0!"}},{"$f":" 1 + 0.001 * (Attenuation_Partition_Coefficient_Kd_Species_1) * (Attenuation_Dry_bulk_density) / (Hydrogeology_Porosity    Hydrogeology!$J:$J)","v":{"$error":"#DIV/0!"}},{"$f":" 1 + 0.001 * (Attenuation_Partition_Coefficient_Kd_Species_1) * (Attenuation_Dry_bulk_density) / (Hydrogeology_Porosity    Hydrogeology!$K:$K)","v":{"$error":"#DIV/0!"}},{"$f":" 1 + 0.001 * (Attenuation_Partition_Coefficient_Kd_Species_1) * (Attenuation_Dry_bulk_density) / (Hydrogeology_Porosity    Hydrogeology!$L:$L)","v":{"$error":"#DIV/0!"}},{"$f":" 1 + 0.001 * (Attenuation_Partition_Coefficient_Kd_Species_1) * (Attenuation_Dry_bulk_density) / (Hydrogeology_Porosity    Hydrogeology!$M:$M)","v":{"$error":"#DIV/0!"}},{"$f":" 1 + 0.001 * (Attenuation_Partition_Coefficient_Kd_Species_1) * (Attenuation_Dry_bulk_density) / (Hydrogeology_Porosity    Hydrogeology!$N:$N)","v":{"$error":"#DIV/0!"}},{"$f":" 1 + 0.001 * (Attenuation_Partition_Coefficient_Kd_Species_1) * (Attenuation_Dry_bulk_density) / (Hydrogeology_Porosity    Hydrogeology!$O:$O)","v":{"$error":"#DIV/0!"}},{"$f":" 1 + 0.001 * (Attenuation_Partition_Coefficient_Kd_Species_1) * (Attenuation_Dry_bulk_density) / (Hydrogeology_Porosity    Hydrogeology!$P:$P)","v":{"$error":"#DIV/0!"}},{"$f":" 1 + 0.001 * (Attenuation_Partition_Coefficient_Kd_Species_1) * (Attenuation_Dry_bulk_density) / (Hydrogeology_Porosity    Hydrogeology!$Q:$Q)","v":{"$error":"#DIV/0!"}},{"$f":" 1 + 0.001 * (Attenuation_Partition_Coefficient_Kd_Species_1) * (Attenuation_Dry_bulk_density) / (Hydrogeology_Porosity    Hydrogeology!$R:$R)","v":{"$error":"#DIV/0!"}}]
["Distribution",null,"constant","constant","constant","constant","constant","constant","constant","constant","constant","constant","constant","constant","constant","constant","constant","constant"]
["Attenuation_Retardation_Species_1_param1"]
["Attenuation_Retardation_Species_1_param2"]
["Attenuation_Retardation_Species_1_param3"]
[]
[]
["Attenuation_Half_Life_Species_1","days","No Decay","No Decay","No Decay","No Decay","No Decay","No Decay","No Decay","No Decay","No Decay","No Decay","No Decay","No Decay","No Decay","No Decay","No Decay","No Decay"]
["Distribution",null,"constant","constant","constant","constant","constant","constant","constant","constant","constant","constant","constant","constant","constant","constant","constant","constant"]
["Attenuation_Half_Life_Species_1_param1"]
["Attenuation_Half_Life_Species_1_param2"]
["Attenuation_Half_Life_Species_1_param3"]
[]
[]
["Attenuation_Decay_Coefficient_Species_1","1/s",{"$f":" IF((_xlfn.SINGLE(Attenuation_Half_Life_Species_1))<>\"No Decay\", LN(2) / ((_xlfn.SINGLE(Attenuation_Half_Life_Species_1)) *_xlfn.SINGLE( s_per_day)),0)","v":0},0,0,0,0,0,0,0,0,0,0,0,0,0,0,0]
["Distribution",null,"constant","constant","constant","constant","constant","constant","constant","constant","constant","constant","constant","constant","constant","constant","constant","constant"]
["Attenuation_Decay_Coefficient_Species_1_param1"]
["Attenuation_Decay_Coefficient_Species_1_param2"]
["Attenuation_Decay_Coefficient_Species_1_param3"]
[]
[]
[{"$f":" IF((Contaminants_Source_determinand_names   Contaminants_Species2)=0,\"Undefined\",(Contaminants_Source_determinand_names   Contaminants_Species2))","v":"Copper"}]
[]
["Attenuation_Partition_Coefficient_Kd_Species_2","L/kg",{"$f":"AL_Kd_Cu","v":126.8},{"$f":"BGF_Kd_Cu","v":295},{"$f":" (Attenuation_Fraction_organic_carbon) * (Contaminants_Organic_Carbon_Water_Partition_Coefficient_Koc  Contaminants_Species2)","v":0},{"$f":" (Attenuation_Fraction_organic_carbon) * (Contaminants_Organic_Carbon_Water_Partition_Coefficient_Koc  Contaminants_Species2)","v":0},{"$f":" (Attenuation_Fraction_organic_carbon) * (Contaminants_Organic_Carbon_Water_Partition_Coefficient_Koc  Contaminants_Species2)","v":0},{"$f":" (Attenuation_Fraction_organic_carbon) * (Contaminants_Organic_Carbon_Water_Partition_Coefficient_Koc  Contaminants_Species2)","v":0},{"$f":" (Attenuation_Fraction_organic_carbon) * (Contaminants_Organic_Carbon_Water_Partition_Coefficient_Koc  Contaminants_Species2)","v":0},{"$f":" (Attenuation_Fraction_organic_carbon) * (Contaminants_Organic_Carbon_Water_Partition_Coefficient_Koc  Contaminants_Species2)","v":0},{"$f":" (Attenuation_Fraction_organic_carbon) * (Contaminants_Organic_Carbon_Water_Partition_Coefficient_Koc  Contaminants_Species2)","v":0},{"$f":" (Attenuation_Fraction_organic_carbon) * (Contaminants_Organic_Carbon_Water_Partition_Coefficient_Koc  Contaminants_Species2)","v":0},{"$f":" (Attenuation_Fraction_organic_carbon) * (Contaminants_Organic_Carbon_Water_Partition_Coefficient_Koc  Contaminants_Species2)","v":0},{"$f":" (Attenuation_Fraction_organic_carbon) * (Contaminants_Organic_Carbon_Water_Partition_Coefficient_Koc  Contaminants_Species2)","v":0},{"$f":" (Attenuation_Fraction_organic_carbon) * (Contaminants_Organic_Carbon_Water_Partition_Coefficient_Koc  Contaminants_Species2)","v":0},{"$f":" (Attenuation_Fraction_organic_carbon) * (Contaminants_Organic_Carbon_Water_Partition_Coefficient_Koc  Contaminants_Species2)","v":0},{"$f":" (Attenuation_Fraction_organic_carbon) * (Contaminants_Organic_Carbon_Water_Partition_Coefficient_Koc  Contaminants_Species2)","v":0},{"$f":" (Attenuation_Fraction_organic_carbon) * (Contaminants_Organic_Carbon_Water_Partition_Coefficient_Koc  Contaminants_Species2)","v":0}]
["Distribution",null,"constant","constant","constant","constant","constant","constant","constant","constant","constant","constant","constant","constant","constant","constant","constant","constant"]
["Attenuation_Partition_Coefficient_Kd_Species_2_param1"]
["Attenuation_Partition_Coefficient_Kd_Species_2_param2"]
["Attenuation_Partition_Coefficient_Kd_Species_2_param3"]
[]
[]
["Attenuation_Retardation_Species_2","[-]",{"$f":" 1 + 0.001 * (Attenuation_Partition_Coefficient_Kd_Species_2) * (Attenuation_Dry_bulk_density) / (Hydrogeology_Porosity    Hydrogeology!$C:$C)","v":5073},{"$f":" 1 + 0.001 * (Attenuation_Partition_Coefficient_Kd_Species_2) * (Attenuation_Dry_bulk_density) / (Hydrogeology_Porosity    Hydrogeology!$D:$D)","v":2361},{"$f":" 1 + 0.001 * (Attenuation_Partition_Coefficient_Kd_Species_2) * (Attenuation_Dry_bulk_density) / (Hydrogeology_Porosity    Hydrogeology!$E:$E)","v":{"$error":"#DIV/0!"}},{"$f":" 1 + 0.001 * (Attenuation_Partition_Coefficient_Kd_Species_2) * (Attenuation_Dry_bulk_density) / (Hydrogeology_Porosity    Hydrogeology!$F:$F)","v":{"$error":"#DIV/0!"}},{"$f":" 1 + 0.001 * (Attenuation_Partition_Coefficient_Kd_Species_2) * (Attenuation_Dry_bulk_density) / (Hydrogeology_Porosity    Hydrogeology!$G:$G)","v":{"$error":"#DIV/0!"}},{"$f":" 1 + 0.001 * (Attenuation_Partition_Coefficient_Kd_Species_2) * (Attenuation_Dry_bulk_density) / (Hydrogeology_Porosity    Hydrogeology!$H:$H)","v":{"$error":"#DIV/0!"}},{"$f":" 1 + 0.001 * (Attenuation_Partition_Coefficient_Kd_Species_2) * (Attenuation_Dry_bulk_density) / (Hydrogeology_Porosity    Hydrogeology!$I:$I)","v":{"$error":"#DIV/0!"}},{"$f":" 1 + 0.001 * (Attenuation_Partition_Coefficient_Kd_Species_2) * (Attenuation_Dry_bulk_density) / (Hydrogeology_Porosity    Hydrogeology!$J:$J)","v":{"$error":"#DIV/0!"}},{"$f":" 1 + 0.001 * (Attenuation_Partition_Coefficient_Kd_Species_2) * (Attenuation_Dry_bulk_density) / (Hydrogeology_Porosity    Hydrogeology!$K:$K)","v":{"$error":"#DIV/0!"}},{"$f":" 1 + 0.001 * (Attenuation_Partition_Coefficient_Kd_Species_2) * (Attenuation_Dry_bulk_density) / (Hydrogeology_Porosity    Hydrogeology!$L:$L)","v":{"$error":"#DIV/0!"}},{"$f":" 1 + 0.001 * (Attenuation_Partition_Coefficient_Kd_Species_2) * (Attenuation_Dry_bulk_density) / (Hydrogeology_Porosity    Hydrogeology!$M:$M)","v":{"$error":"#DIV/0!"}},{"$f":" 1 + 0.001 * (Attenuation_Partition_Coefficient_Kd_Species_2) * (Attenuation_Dry_bulk_density) / (Hydrogeology_Porosity    Hydrogeology!$N:$N)","v":{"$error":"#DIV/0!"}},{"$f":" 1 + 0.001 * (Attenuation_Partition_Coefficient_Kd_Species_2) * (Attenuation_Dry_bulk_density) / (Hydrogeology_Porosity    Hydrogeology!$O:$O)","v":{"$error":"#DIV/0!"}},{"$f":" 1 + 0.001 * (Attenuation_Partition_Coefficient_Kd_Species_2) * (Attenuation_Dry_bulk_density) / (Hydrogeology_Porosity    Hydrogeology!$P:$P)","v":{"$error":"#DIV/0!"}},{"$f":" 1 + 0.001 * (Attenuation_Partition_Coefficient_Kd_Species_2) * (Attenuation_Dry_bulk_density) / (Hydrogeology_Porosity    Hydrogeology!$Q:$Q)","v":{"$error":"#DIV/0!"}},{"$f":" 1 + 0.001 * (Attenuation_Partition_Coefficient_Kd_Species_2) * (Attenuation_Dry_bulk_density) / (Hydrogeology_Porosity    Hydrogeology!$R:$R)","v":{"$error":"#DIV/0!"}}]
["Distribution",null,"constant","constant","constant","constant","constant","constant","constant","constant","constant","constant","constant","constant","constant","constant","constant","constant"]
["Attenuation_Retardation_Species_2_param1"]
["Attenuation_Retardation_Species_2_param2"]
["Attenuation_Retardation_Species_2_param3"]
[]
[]
["Attenuation_Half_Life_Species_2","days","No Decay","No Decay","No Decay","No Decay","No Decay","No Decay","No Decay","No Decay","No Decay","No Decay","No Decay","No Decay","No Decay","No Decay","No Decay","No Decay"]
["Distribution",null,"constant","constant","constant","constant","constant","constant","constant","constant","constant","constant","constant","constant","constant","constant","constant","constant"]
["Attenuation_Half_Life_Species_2_param1"]
["Attenuation_Half_Life_Species_2_param2"]
["Attenuation_Half_Life_Species_2_param3"]
[]
[]
["Attenuation_Decay_Coefficient_Species_2","1/s",{"$f":" IF((_xlfn.SINGLE(Attenuation_Half_Life_Species_2))<>\"No Decay\", LN(2) / ((_xlfn.SINGLE(Attenuation_Half_Life_Species_2)) *_xlfn.SINGLE( s_per_day)),0)","v":0},0,0,0,0,0,0,0,0,0,0,0,0,0,0,0]
["Distribution",null,"constant","constant","constant","constant","constant","constant","constant","constant","constant","constant","constant","constant","constant","constant","constant","constant"]
["Attenuation_Decay_Coefficient_Species_2_param1"]
["Attenuation_Decay_Coefficient_Species_2_param2"]
["Attenuation_Decay_Coefficient_Species_2_param3"]
[]
[]
[{"$f":" IF((Contaminants_Source_determinand_names   Contaminants_Species3)=0,\"Undefined\",(Contaminants_Source_determinand_names   Contaminants_Species3))","v":"Lead"}]
[]
["Attenuation_Partition_Coefficient_Kd_Species_3","L/kg",{"$f":"AL_Kd_Pb","v":434.6},{"$f":"BGF_Kd_Pb","v":270},{"$f":" (Attenuation_Fraction_organic_carbon) * (Contaminants_Organic_Carbon_Water_Partition_Coefficient_Koc  Contaminants_Species3)","v":0},{"$f":" (Attenuation_Fraction_organic_carbon) * (Contaminants_Organic_Carbon_Water_Partition_Coefficient_Koc  Contaminants_Species3)","v":0},{"$f":" (Attenuation_Fraction_organic_carbon) * (Contaminants_Organic_Carbon_Water_Partition_Coefficient_Koc  Contaminants_Species3)","v":0},{"$f":" (Attenuation_Fraction_organic_carbon) * (Contaminants_Organic_Carbon_Water_Partition_Coefficient_Koc  Contaminants_Species3)","v":0},{"$f":" (Attenuation_Fraction_organic_carbon) * (Contaminants_Organic_Carbon_Water_Partition_Coefficient_Koc  Contaminants_Species3)","v":0},{"$f":" (Attenuation_Fraction_organic_carbon) * (Contaminants_Organic_Carbon_Water_Partition_Coefficient_Koc  Contaminants_Species3)","v":0},{"$f":" (Attenuation_Fraction_organic_carbon) * (Contaminants_Organic_Carbon_Water_Partition_Coefficient_Koc  Contaminants_Species3)","v":0},{"$f":" (Attenuation_Fraction_organic_carbon) * (Contaminants_Organic_Carbon_Water_Partition_Coefficient_Koc  Contaminants_Species3)","v":0},{"$f":" (Attenuation_Fraction_organic_carbon) * (Contaminants_Organic_Carbon_Water_Partition_Coefficient_Koc  Contaminants_Species3)","v":0},{"$f":" (Attenuation_Fraction_organic_carbon) * (Contaminants_Organic_Carbon_Water_Partition_Coefficient_Koc  Contaminants_Species3)","v":0},{"$f":" (Attenuation_Fraction_organic_carbon) * (Contaminants_Organic_Carbon_Water_Partition_Coefficient_Koc  Contaminants_Species3)","v":0},{"$f":" (Attenuation_Fraction_organic_carbon) * (Contaminants_Organic_Carbon_Water_Partition_Coefficient_Koc  Contaminants_Species3)","v":0},{"$f":" (Attenuation_Fraction_organic_carbon) * (Contaminants_Organic_Carbon_Water_Partition_Coefficient_Koc  Contaminants_Species3)","v":0},{"$f":" (Attenuation_Fraction_organic_carbon) * (Contaminants_Organic_Carbon_Water_Partition_Coefficient_Koc  Contaminants_Species3)","v":0}]
["Distribution",null,"constant","constant","constant","constant","constant","constant","constant","constant","constant","constant","constant","constant","constant","constant","constant","constant"]
["Attenuation_Partition_Coefficient_Kd_Species_3_param1"]
["Attenuation_Partition_Coefficient_Kd_Species_3_param2"]
["Attenuation_Partition_Coefficient_Kd_Species_3_param3"]
[]
[]
["Attenuation_Retardation_Species_3","[-]",{"$f":" 1 + 0.001 * (Attenuation_Partition_Coefficient_Kd_Species_3) * (Attenuation_Dry_bulk_density) / (Hydrogeology_Porosity    Hydrogeology!$C:$C)","v":17385},{"$f":" 1 + 0.001 * (Attenuation_Partition_Coefficient_Kd_Species_3) * (Attenuation_Dry_bulk_density) / (Hydrogeology_Porosity    Hydrogeology!$D:$D)","v":2161},{"$f":" 1 + 0.001 * (Attenuation_Partition_Coefficient_Kd_Species_3) * (Attenuation_Dry_bulk_density) / (Hydrogeology_Porosity    Hydrogeology!$E:$E)","v":{"$error":"#DIV/0!"}},{"$f":" 1 + 0.001 * (Attenuation_Partition_Coefficient_Kd_Species_3) * (Attenuation_Dry_bulk_density) / (Hydrogeology_Porosity    Hydrogeology!$F:$F)","v":{"$error":"#DIV/0!"}},{"$f":" 1 + 0.001 * (Attenuation_Partition_Coefficient_Kd_Species_3) * (Attenuation_Dry_bulk_density) / (Hydrogeology_Porosity    Hydrogeology!$G:$G)","v":{"$error":"#DIV/0!"}},{"$f":" 1 + 0.001 * (Attenuation_Partition_Coefficient_Kd_Species_3) * (Attenuation_Dry_bulk_density) / (Hydrogeology_Porosity    Hydrogeology!$H:$H)","v":{"$error":"#DIV/0!"}},{"$f":" 1 + 0.001 * (Attenuation_Partition_Coefficient_Kd_Species_3) * (Attenuation_Dry_bulk_density) / (Hydrogeology_Porosity    Hydrogeology!$I:$I)","v":{"$error":"#DIV/0!"}},{"$f":" 1 + 0.001 * (Attenuation_Partition_Coefficient_Kd_Species_3) * (Attenuation_Dry_bulk_density) / (Hydrogeology_Porosity    Hydrogeology!$J:$J)","v":{"$error":"#DIV/0!"}},{"$f":" 1 + 0.001 * (Attenuation_Partition_Coefficient_Kd_Species_3) * (Attenuation_Dry_bulk_density) / (Hydrogeology_Porosity    Hydrogeology!$K:$K)","v":{"$error":"#DIV/0!"}},{"$f":" 1 + 0.001 * (Attenuation_Partition_Coefficient_Kd_Species_3) * (Attenuation_Dry_bulk_density) / (Hydrogeology_Porosity    Hydrogeology!$L:$L)","v":{"$error":"#DIV/0!"}},{"$f":" 1 + 0.001 * (Attenuation_Partition_Coefficient_Kd_Species_3) * (Attenuation_Dry_bulk_density) / (Hydrogeology_Porosity    Hydrogeology!$M:$M)","v":{"$error":"#DIV/0!"}},{"$f":" 1 + 0.001 * (Attenuation_Partition_Coefficient_Kd_Species_3) * (Attenuation_Dry_bulk_density) / (Hydrogeology_Porosity    Hydrogeology!$N:$N)","v":{"$error":"#DIV/0!"}},{"$f":" 1 + 0.001 * (Attenuation_Partition_Coefficient_Kd_Species_3) * (Attenuation_Dry_bulk_density) / (Hydrogeology_Porosity    Hydrogeology!$O:$O)","v":{"$error":"#DIV/0!"}},{"$f":" 1 + 0.001 * (Attenuation_Partition_Coefficient_Kd_Species_3) * (Attenuation_Dry_bulk_density) / (Hydrogeology_Porosity    Hydrogeology!$P:$P)","v":{"$error":"#DIV/0!"}},{"$f":" 1 + 0.001 * (Attenuation_Partition_Coefficient_Kd_Species_3) * (Attenuation_Dry_bulk_density) / (Hydrogeology_Porosity    Hydrogeology!$Q:$Q)","v":{"$error":"#DIV/0!"}},{"$f":" 1 + 0.001 * (Attenuation_Partition_Coefficient_Kd_Species_3) * (Attenuation_Dry_bulk_density) / (Hydrogeology_Porosity    Hydrogeology!$R:$R)","v":{"$error":"#DIV/0!"}}]
["Distribution",null,"constant","constant","constant","constant","constant","constant","constant","constant","constant","constant","constant","constant","constant","constant","constant","constant"]
["Attenuation_Retardation_Species_3_param1"]
["Attenuation_Retardation_Species_3_param2"]
["Attenuation_Retardation_Species_3_param3"]
[]
[]
["Attenuation_Half_Life_Species_3","days","No Decay","No Decay","No Decay","No Decay","No Decay","No Decay","No Decay","No Decay","No Decay","No Decay","No Decay","No Decay","No Decay","No Decay","No Decay","No Decay"]
["Distribution",null,"constant","constant","constant","constant","constant","constant","constant","constant","constant","constant","constant","constant","constant","constant","constant","constant"]
["Attenuation_Half_Life_Species_3_param1"]
["Attenuation_Half_Life_Species_3_param2"]
["Attenuation_Half_Life_Species_3_param3"]
[]
[]
["Attenuation_Decay_Coefficient_Species_3","1/s",{"$f":" IF((_xlfn.SINGLE(Attenuation_Half_Life_Species_3))<>\"No Decay\", LN(2) / ((_xlfn.SINGLE(Attenuation_Half_Life_Species_3)) *_xlfn.SINGLE( s_per_day)),0)","v":0},0,0,0,0,0,0,0,0,0,0,0,0,0,0,0]
["Distribution",null,"constant","constant","constant","constant","constant","constant","constant","constant","constant","constant","constant","constant","constant","constant","constant","constant"]
["Attenuation_Decay_Coefficient_Species_3_param1"]
["Attenuation_Decay_Coefficient_Species_3_param2"]
["Attenuation_Decay_Coefficient_Species_3_param3"]
[]
[]
[{"$f":" IF((Contaminants_Source_determinand_names   Contaminants_Species4)=0,\"Undefined\",(Contaminants_Source_determinand_names   Contaminants_Species4))","v":"Total Chromium"}]
[]
["Attenuation_Partition_Coefficient_Kd_Species_4","L/kg",{"$f":"AL_Kd_Cr","v":966},{"$f":"BGF_Kd_Cr","v":67},{"$f":" (Attenuation_Fraction_organic_carbon) * (Contaminants_Organic_Carbon_Water_Partition_Coefficient_Koc  Contaminants_Species4)","v":0},{"$f":" (Attenuation_Fraction_organic_carbon) * (Contaminants_Organic_Carbon_Water_Partition_Coefficient_Koc  Contaminants_Species4)","v":0},{"$f":" (Attenuation_Fraction_organic_carbon) * (Contaminants_Organic_Carbon_Water_Partition_Coefficient_Koc  Contaminants_Species4)","v":0},{"$f":" (Attenuation_Fraction_organic_carbon) * (Contaminants_Organic_Carbon_Water_Partition_Coefficient_Koc  Contaminants_Species4)","v":0},{"$f":" (Attenuation_Fraction_organic_carbon) * (Contaminants_Organic_Carbon_Water_Partition_Coefficient_Koc  Contaminants_Species4)","v":0},{"$f":" (Attenuation_Fraction_organic_carbon) * (Contaminants_Organic_Carbon_Water_Partition_Coefficient_Koc  Contaminants_Species4)","v":0},{"$f":" (Attenuation_Fraction_organic_carbon) * (Contaminants_Organic_Carbon_Water_Partition_Coefficient_Koc  Contaminants_Species4)","v":0},{"$f":" (Attenuation_Fraction_organic_carbon) * (Contaminants_Organic_Carbon_Water_Partition_Coefficient_Koc  Contaminants_Species4)","v":0},{"$f":" (Attenuation_Fraction_organic_carbon) * (Contaminants_Organic_Carbon_Water_Partition_Coefficient_Koc  Contaminants_Species4)","v":0},{"$f":" (Attenuation_Fraction_organic_carbon) * (Contaminants_Organic_Carbon_Water_Partition_Coefficient_Koc  Contaminants_Species4)","v":0},{"$f":" (Attenuation_Fraction_organic_carbon) * (Contaminants_Organic_Carbon_Water_Partition_Coefficient_Koc  Contaminants_Species4)","v":0},{"$f":" (Attenuation_Fraction_organic_carbon) * (Contaminants_Organic_Carbon_Water_Partition_Coefficient_Koc  Contaminants_Species4)","v":0},{"$f":" (Attenuation_Fraction_organic_carbon) * (Contaminants_Organic_Carbon_Water_Partition_Coefficient_Koc  Contaminants_Species4)","v":0},{"$f":" (Attenuation_Fraction_organic_carbon) * (Contaminants_Organic_Carbon_Water_Partition_Coefficient_Koc  Contaminants_Species4)","v":0}]
["Distribution",null,"constant","constant","constant","constant","constant","constant","constant","constant","constant","constant","constant","constant","constant","constant","constant","constant"]
["Attenuation_Partition_Coefficient_Kd_Species_4_param1"]
["Attenuation_Partition_Coefficient_Kd_Species_4_param2"]
["Attenuation_Partition_Coefficient_Kd_Species_4_param3"]
[]
[]
["Attenuation_Retardation_Species_4","[-]",{"$f":" 1 + 0.001 * (Attenuation_Partition_Coefficient_Kd_Species_4) * (Attenuation_Dry_bulk_density) / (Hydrogeology_Porosity    Hydrogeology!$C:$C)","v":38641},{"$f":" 1 + 0.001 * (Attenuation_Partition_Coefficient_Kd_Species_4) * (Attenuation_Dry_bulk_density) / (Hydrogeology_Porosity    Hydrogeology!$D:$D)","v":537},{"$f":" 1 + 0.001 * (Attenuation_Partition_Coefficient_Kd_Species_4) * (Attenuation_Dry_bulk_density) / (Hydrogeology_Porosity    Hydrogeology!$E:$E)","v":{"$error":"#DIV/0!"}},{"$f":" 1 + 0.001 * (Attenuation_Partition_Coefficient_Kd_Species_4) * (Attenuation_Dry_bulk_density) / (Hydrogeology_Porosity    Hydrogeology!$F:$F)","v":{"$error":"#DIV/0!"}},{"$f":" 1 + 0.001 * (Attenuation_Partition_Coefficient_Kd_Species_4) * (Attenuation_Dry_bulk_density) / (Hydrogeology_Porosity    Hydrogeology!$G:$G)","v":{"$error":"#DIV/0!"}},{"$f":" 1 + 0.001 * (Attenuation_Partition_Coefficient_Kd_Species_4) * (Attenuation_Dry_bulk_density) / (Hydrogeology_Porosity    Hydrogeology!$H:$H)","v":{"$error":"#DIV/0!"}},{"$f":" 1 + 0.001 * (Attenuation_Partition_Coefficient_Kd_Species_4) * (Attenuation_Dry_bulk_density) / (Hydrogeology_Porosity    Hydrogeology!$I:$I)","v":{"$error":"#DIV/0!"}},{"$f":" 1 + 0.001 * (Attenuation_Partition_Coefficient_Kd_Species_4) * (Attenuation_Dry_bulk_density) / (Hydrogeology_Porosity    Hydrogeology!$J:$J)","v":{"$error":"#DIV/0!"}},{"$f":" 1 + 0.001 * (Attenuation_Partition_Coefficient_Kd_Species_4) * (Attenuation_Dry_bulk_density) / (Hydrogeology_Porosity    Hydrogeology!$K:$K)","v":{"$error":"#DIV/0!"}},{"$f":" 1 + 0.001 * (Attenuation_Partition_Coefficient_Kd_Species_4) * (Attenuation_Dry_bulk_density) / (Hydrogeology_Porosity    Hydrogeology!$L:$L)","v":{"$error":"#DIV/0!"}},{"$f":" 1 + 0.001 * (Attenuation_Partition_Coefficient_Kd_Species_4) * (Attenuation_Dry_bulk_density) / (Hydrogeology_Porosity    Hydrogeology!$M:$M)","v":{"$error":"#DIV/0!"}},{"$f":" 1 + 0.001 * (Attenuation_Partition_Coefficient_Kd_Species_4) * (Attenuation_Dry_bulk_density) / (Hydrogeology_Porosity    Hydrogeology!$N:$N)","v":{"$error":"#DIV/0!"}},{"$f":" 1 + 0.001 * (Attenuation_Partition_Coefficient_Kd_Species_4) * (Attenuation_Dry_bulk_density) / (Hydrogeology_Porosity    Hydrogeology!$O:$O)","v":{"$error":"#DIV/0!"}},{"$f":" 1 + 0.001 * (Attenuation_Partition_Coefficient_Kd_Species_4) * (Attenuation_Dry_bulk_density) / (Hydrogeology_Porosity    Hydrogeology!$P:$P)","v":{"$error":"#DIV/0!"}},{"$f":" 1 + 0.001 * (Attenuation_Partition_Coefficient_Kd_Species_4) * (Attenuation_Dry_bulk_density) / (Hydrogeology_Porosity    Hydrogeology!$Q:$Q)","v":{"$error":"#DIV/0!"}},{"$f":" 1 + 0.001 * (Attenuation_Partition_Coefficient_Kd_Species_4) * (Attenuation_Dry_bulk_density) / (Hydrogeology_Porosity    Hydrogeology!$R:$R)","v":{"$error":"#DIV/0!"}}]
["Distribution",null,"constant","constant","constant","constant","constant","constant","constant","constant","constant","constant","constant","constant","constant","constant","constant","constant"]
["Attenuation_Retardation_Species_4_param1"]
["Attenuation_Retardation_Species_4_param2"]
["Attenuation_Retardation_Species_4_param3"]
[]
[]
["Attenuation_Half_Life_Species_4","days","No Decay","No Decay","No Decay","No Decay","No Decay","No Decay","No Decay","No Decay","No Decay","No Decay","No Decay","No Decay","No Decay","No Decay","No Decay","No Decay"]
["Distribution",null,"constant","constant","constant","constant","constant","constant","constant","constant","constant","constant","constant","constant","constant","constant","constant","constant"]
["Attenuation_Half_Life_Species_4_param1"]
["Attenuation_Half_Life_Species_4_param2"]
["Attenuation_Half_Life_Species_4_param3"]
[]
[]
["Attenuation_Decay_Coefficient_Species_4","1/s",{"$f":" IF((_xlfn.SINGLE(Attenuation_Half_Life_Species_4))<>\"No Decay\", LN(2) / ((_xlfn.SINGLE(Attenuation_Half_Life_Species_4)) *_xlfn.SINGLE( s_per_day)),0)","v":0},0,0,0,0,0,0,0,0,0,0,0,0,0,0,0]
["Distribution",null,"constant","constant","constant","constant","constant","constant","constant","constant","constant","constant","constant","constant","constant","constant","constant","constant"]
["Attenuation_Decay_Coefficient_Species_4_param1"]
["Attenuation_Decay_Coefficient_Species_4_param2"]
["Attenuation_Decay_Coefficient_Species_4_param3"]
[]
[]
[{"$f":" IF((Contaminants_Source_determinand_names   Contaminants_Species5)=0,\"Undefined\",(Contaminants_Source_determinand_names   Contaminants_Species5))","v":"Cadmium"}]
[]
["Attenuation_Partition_Coefficient_Kd_Species_5","L/kg",{"$f":"AL_Kd_Cd","v":222},{"$f":"BGF_Kd_Cd","v":74},{"$f":" (Attenuation_Fraction_organic_carbon) * (Contaminants_Organic_Carbon_Water_Partition_Coefficient_Koc  Contaminants_Species5)","v":0},{"$f":" (Attenuation_Fraction_organic_carbon) * (Contaminants_Organic_Carbon_Water_Partition_Coefficient_Koc  Contaminants_Species5)","v":0},{"$f":" (Attenuation_Fraction_organic_carbon) * (Contaminants_Organic_Carbon_Water_Partition_Coefficient_Koc  Contaminants_Species5)","v":0},{"$f":" (Attenuation_Fraction_organic_carbon) * (Contaminants_Organic_Carbon_Water_Partition_Coefficient_Koc  Contaminants_Species5)","v":0},{"$f":" (Attenuation_Fraction_organic_carbon) * (Contaminants_Organic_Carbon_Water_Partition_Coefficient_Koc  Contaminants_Species5)","v":0},{"$f":" (Attenuation_Fraction_organic_carbon) * (Contaminants_Organic_Carbon_Water_Partition_Coefficient_Koc  Contaminants_Species5)","v":0},{"$f":" (Attenuation_Fraction_organic_carbon) * (Contaminants_Organic_Carbon_Water_Partition_Coefficient_Koc  Contaminants_Species5)","v":0},{"$f":" (Attenuation_Fraction_organic_carbon) * (Contaminants_Organic_Carbon_Water_Partition_Coefficient_Koc  Contaminants_Species5)","v":0},{"$f":" (Attenuation_Fraction_organic_carbon) * (Contaminants_Organic_Carbon_Water_Partition_Coefficient_Koc  Contaminants_Species5)","v":0},{"$f":" (Attenuation_Fraction_organic_carbon) * (Contaminants_Organic_Carbon_Water_Partition_Coefficient_Koc  Contaminants_Species5)","v":0},{"$f":" (Attenuation_Fraction_organic_carbon) * (Contaminants_Organic_Carbon_Water_Partition_Coefficient_Koc  Contaminants_Species5)","v":0},{"$f":" (Attenuation_Fraction_organic_carbon) * (Contaminants_Organic_Carbon_Water_Partition_Coefficient_Koc  Contaminants_Species5)","v":0},{"$f":" (Attenuation_Fraction_organic_carbon) * (Contaminants_Organic_Carbon_Water_Partition_Coefficient_Koc  Contaminants_Species5)","v":0},{"$f":" (Attenuation_Fraction_organic_carbon) * (Contaminants_Organic_Carbon_Water_Partition_Coefficient_Koc  Contaminants_Species5)","v":0}]
["Distribution",null,"constant","constant","constant","constant","constant","constant","constant","constant","constant","constant","constant","constant","constant","constant","constant","constant"]
["Attenuation_Partition_Coefficient_Kd_Species_5_param1"]
["Attenuation_Partition_Coefficient_Kd_Species_5_param2"]
["Attenuation_Partition_Coefficient_Kd_Species_5_param3"]
[]
[]
["Attenuation_Retardation_Species_5","[-]",{"$f":" 1 + 0.001 * (Attenuation_Partition_Coefficient_Kd_Species_5) * (Attenuation_Dry_bulk_density) / (Hydrogeology_Porosity    Hydrogeology!$C:$C)","v":8881},{"$f":" 1 + 0.001 * (Attenuation_Partition_Coefficient_Kd_Species_5) * (Attenuation_Dry_bulk_density) / (Hydrogeology_Porosity    Hydrogeology!$D:$D)","v":592.99999999999989},{"$f":" 1 + 0.001 * (Attenuation_Partition_Coefficient_Kd_Species_5) * (Attenuation_Dry_bulk_density) / (Hydrogeology_Porosity    Hydrogeology!$E:$E)","v":{"$error":"#DIV/0!"}},{"$f":" 1 + 0.001 * (Attenuation_Partition_Coefficient_Kd_Species_5) * (Attenuation_Dry_bulk_density) / (Hydrogeology_Porosity    Hydrogeology!$F:$F)","v":{"$error":"#DIV/0!"}},{"$f":" 1 + 0.001 * (Attenuation_Partition_Coefficient_Kd_Species_5) * (Attenuation_Dry_bulk_density) / (Hydrogeology_Porosity    Hydrogeology!$G:$G)","v":{"$error":"#DIV/0!"}},{"$f":" 1 + 0.001 * (Attenuation_Partition_Coefficient_Kd_Species_5) * (Attenuation_Dry_bulk_density) / (Hydrogeology_Porosity    Hydrogeology!$H:$H)","v":{"$error":"#DIV/0!"}},{"$f":" 1 + 0.001 * (Attenuation_Partition_Coefficient_Kd_Species_5) * (Attenuation_Dry_bulk_density) / (Hydrogeology_Porosity    Hydrogeology!$I:$I)","v":{"$error":"#DIV/0!"}},{"$f":" 1 + 0.001 * (Attenuation_Partition_Coefficient_Kd_Species_5) * (Attenuation_Dry_bulk_density) / (Hydrogeology_Porosity    Hydrogeology!$J:$J)","v":{"$error":"#DIV/0!"}},{"$f":" 1 + 0.001 * (Attenuation_Partition_Coefficient_Kd_Species_5) * (Attenuation_Dry_bulk_density) / (Hydrogeology_Porosity    Hydrogeology!$K:$K)","v":{"$error":"#DIV/0!"}},{"$f":" 1 + 0.001 * (Attenuation_Partition_Coefficient_Kd_Species_5) * (Attenuation_Dry_bulk_density) / (Hydrogeology_Porosity    Hydrogeology!$L:$L)","v":{"$error":"#DIV/0!"}},{"$f":" 1 + 0.001 * (Attenuation_Partition_Coefficient_Kd_Species_5) * (Attenuation_Dry_bulk_density) / (Hydrogeology_Porosity    Hydrogeology!$M:$M)","v":{"$error":"#DIV/0!"}},{"$f":" 1 + 0.001 * (Attenuation_Partition_Coefficient_Kd_Species_5) * (Attenuation_Dry_bulk_density) / (Hydrogeology_Porosity    Hydrogeology!$N:$N)","v":{"$error":"#DIV/0!"}},{"$f":" 1 + 0.001 * (Attenuation_Partition_Coefficient_Kd_Species_5) * (Attenuation_Dry_bulk_density) / (Hydrogeology_Porosity    Hydrogeology!$O:$O)","v":{"$error":"#DIV/0!"}},{"$f":" 1 + 0.001 * (Attenuation_Partition_Coefficient_Kd_Species_5) * (Attenuation_Dry_bulk_density) / (Hydrogeology_Porosity    Hydrogeology!$P:$P)","v":{"$error":"#DIV/0!"}},{"$f":" 1 + 0.001 * (Attenuation_Partition_Coefficient_Kd_Species_5) * (Attenuation_Dry_bulk_density) / (Hydrogeology_Porosity    Hydrogeology!$Q:$Q)","v":{"$error":"#DIV/0!"}},{"$f":" 1 + 0.001 * (Attenuation_Partition_Coefficient_Kd_Species_5) * (Attenuation_Dry_bulk_density) / (Hydrogeology_Porosity    Hydrogeology!$R:$R)","v":{"$error":"#DIV/0!"}}]
["Distribution",null,"constant","constant","constant","constant","constant","constant","constant","constant","constant","constant","constant","constant","constant","constant","constant","constant"]
["Attenuation_Retardation_Species_5_param1"]
["Attenuation_Retardation_Species_5_param2"]
["Attenuation_Retardation_Species_5_param3"]
[]
[]
["Attenuation_Half_Life_Species_5","days","No Decay","No Decay","No Decay","No Decay","No Decay","No Decay","No Decay","No Decay","No Decay","No Decay","No Decay","No Decay","No Decay","No Decay","No Decay","No Decay"]
["Distribution",null,"constant","constant","constant","constant","constant","constant","constant","constant","constant","constant","constant","constant","constant","constant","constant","constant"]
["Attenuation_Half_Life_Species_5_param1"]
["Attenuation_Half_Life_Species_5_param2"]
["Attenuation_Half_Life_Species_5_param3"]
[]
[]
["Attenuation_Decay_Coefficient_Species_5","1/s",{"$f":" IF((_xlfn.SINGLE(Attenuation_Half_Life_Species_5))<>\"No Decay\", LN(2) / ((_xlfn.SINGLE(Attenuation_Half_Life_Species_5)) *_xlfn.SINGLE( s_per_day)),0)","v":0},0,0,0,0,0,0,0,0,0,0,0,0,0,0,0]
["Distribution",null,"constant","constant","constant","constant","constant","constant","constant","constant","constant","constant","constant","constant","constant","constant","constant","constant"]
["Attenuation_Decay_Coefficient_Species_5_param1"]
["Attenuation_Decay_Coefficient_Species_5_param2"]
["Attenuation_Decay_Coefficient_Species_5_param3"]
[]
[]
[{"$f":" IF((Contaminants_Source_determinand_names   Contaminants_Species6)=0,\"Undefined\",(Contaminants_Source_determinand_names   Contaminants_Species6))","v":"Mercury"}]
[]
["Attenuation_Partition_Coefficient_Kd_Species_6","L/kg",{"$f":"AL_Kd_Hg","v":2142},{"$f":"BGF_Kd_Hg","v":450},{"$f":" (Attenuation_Fraction_organic_carbon) * (Contaminants_Organic_Carbon_Water_Partition_Coefficient_Koc  Contaminants_Species6)","v":0},{"$f":" (Attenuation_Fraction_organic_carbon) * (Contaminants_Organic_Carbon_Water_Partition_Coefficient_Koc  Contaminants_Species6)","v":0},{"$f":" (Attenuation_Fraction_organic_carbon) * (Contaminants_Organic_Carbon_Water_Partition_Coefficient_Koc  Contaminants_Species6)","v":0},{"$f":" (Attenuation_Fraction_organic_carbon) * (Contaminants_Organic_Carbon_Water_Partition_Coefficient_Koc  Contaminants_Species6)","v":0},{"$f":" (Attenuation_Fraction_organic_carbon) * (Contaminants_Organic_Carbon_Water_Partition_Coefficient_Koc  Contaminants_Species6)","v":0},{"$f":" (Attenuation_Fraction_organic_carbon) * (Contaminants_Organic_Carbon_Water_Partition_Coefficient_Koc  Contaminants_Species6)","v":0},{"$f":" (Attenuation_Fraction_organic_carbon) * (Contaminants_Organic_Carbon_Water_Partition_Coefficient_Koc  Contaminants_Species6)","v":0},{"$f":" (Attenuation_Fraction_organic_carbon) * (Contaminants_Organic_Carbon_Water_Partition_Coefficient_Koc  Contaminants_Species6)","v":0},{"$f":" (Attenuation_Fraction_organic_carbon) * (Contaminants_Organic_Carbon_Water_Partition_Coefficient_Koc  Contaminants_Species6)","v":0},{"$f":" (Attenuation_Fraction_organic_carbon) * (Contaminants_Organic_Carbon_Water_Partition_Coefficient_Koc  Contaminants_Species6)","v":0},{"$f":" (Attenuation_Fraction_organic_carbon) * (Contaminants_Organic_Carbon_Water_Partition_Coefficient_Koc  Contaminants_Species6)","v":0},{"$f":" (Attenuation_Fraction_organic_carbon) * (Contaminants_Organic_Carbon_Water_Partition_Coefficient_Koc  Contaminants_Species6)","v":0},{"$f":" (Attenuation_Fraction_organic_carbon) * (Contaminants_Organic_Carbon_Water_Partition_Coefficient_Koc  Contaminants_Species6)","v":0},{"$f":" (Attenuation_Fraction_organic_carbon) * (Contaminants_Organic_Carbon_Water_Partition_Coefficient_Koc  Contaminants_Species6)","v":0}]
["Distribution",null,"constant","constant","constant","constant","constant","constant","constant","constant","constant","constant","constant","constant","constant","constant","constant","constant"]
["Attenuation_Partition_Coefficient_Kd_Species_6_param1"]
["Attenuation_Partition_Coefficient_Kd_Species_6_param2"]
["Attenuation_Partition_Coefficient_Kd_Species_6_param3"]
[]
[]
["Attenuation_Retardation_Species_6","[-]",{"$f":" 1 + 0.001 * (Attenuation_Partition_Coefficient_Kd_Species_6) * (Attenuation_Dry_bulk_density) / (Hydrogeology_Porosity    Hydrogeology!$C:$C)","v":85681},{"$f":" 1 + 0.001 * (Attenuation_Partition_Coefficient_Kd_Species_6) * (Attenuation_Dry_bulk_density) / (Hydrogeology_Porosity    Hydrogeology!$D:$D)","v":3601},{"$f":" 1 + 0.001 * (Attenuation_Partition_Coefficient_Kd_Species_6) * (Attenuation_Dry_bulk_density) / (Hydrogeology_Porosity    Hydrogeology!$E:$E)","v":{"$error":"#DIV/0!"}},{"$f":" 1 + 0.001 * (Attenuation_Partition_Coefficient_Kd_Species_6) * (Attenuation_Dry_bulk_density) / (Hydrogeology_Porosity    Hydrogeology!$F:$F)","v":{"$error":"#DIV/0!"}},{"$f":" 1 + 0.001 * (Attenuation_Partition_Coefficient_Kd_Species_6) * (Attenuation_Dry_bulk_density) / (Hydrogeology_Porosity    Hydrogeology!$G:$G)","v":{"$error":"#DIV/0!"}},{"$f":" 1 + 0.001 * (Attenuation_Partition_Coefficient_Kd_Species_6) * (Attenuation_Dry_bulk_density) / (Hydrogeology_Porosity    Hydrogeology!$H:$H)","v":{"$error":"#DIV/0!"}},{"$f":" 1 + 0.001 * (Attenuation_Partition_Coefficient_Kd_Species_6) * (Attenuation_Dry_bulk_density) / (Hydrogeology_Porosity    Hydrogeology!$I:$I)","v":{"$error":"#DIV/0!"}},{"$f":" 1 + 0.001 * (Attenuation_Partition_Coefficient_Kd_Species_6) * (Attenuation_Dry_bulk_density) / (Hydrogeology_Porosity    Hydrogeology!$J:$J)","v":{"$error":"#DIV/0!"}},{"$f":" 1 + 0.001 * (Attenuation_Partition_Coefficient_Kd_Species_6) * (Attenuation_Dry_bulk_density) / (Hydrogeology_Porosity    Hydrogeology!$K:$K)","v":{"$error":"#DIV/0!"}},{"$f":" 1 + 0.001 * (Attenuation_Partition_Coefficient_Kd_Species_6) * (Attenuation_Dry_bulk_density) / (Hydrogeology_Porosity    Hydrogeology!$L:$L)","v":{"$error":"#DIV/0!"}},{"$f":" 1 + 0.001 * (Attenuation_Partition_Coefficient_Kd_Species_6) * (Attenuation_Dry_bulk_density) / (Hydrogeology_Porosity    Hydrogeology!$M:$M)","v":{"$error":"#DIV/0!"}},{"$f":" 1 + 0.001 * (Attenuation_Partition_Coefficient_Kd_Species_6) * (Attenuation_Dry_bulk_density) / (Hydrogeology_Porosity    Hydrogeology!$N:$N)","v":{"$error":"#DIV/0!"}},{"$f":" 1 + 0.001 * (Attenuation_Partition_Coefficient_Kd_Species_6) * (Attenuation_Dry_bulk_density) / (Hydrogeology_Porosity    Hydrogeology!$O:$O)","v":{"$error":"#DIV/0!"}},{"$f":" 1 + 0.001 * (Attenuation_Partition_Coefficient_Kd_Species_6) * (Attenuation_Dry_bulk_density) / (Hydrogeology_Porosity    Hydrogeology!$P:$P)","v":{"$error":"#DIV/0!"}},{"$f":" 1 + 0.001 * (Attenuation_Partition_Coefficient_Kd_Species_6) * (Attenuation_Dry_bulk_density) / (Hydrogeology_Porosity    Hydrogeology!$Q:$Q)","v":{"$error":"#DIV/0!"}},{"$f":" 1 + 0.001 * (Attenuation_Partition_Coefficient_Kd_Species_6) * (Attenuation_Dry_bulk_density) / (Hydrogeology_Porosity    Hydrogeology!$R:$R)","v":{"$error":"#DIV/0!"}}]
["Distribution",null,"constant","constant","constant","constant","constant","constant","constant","constant","constant","constant","constant","constant","constant","constant","constant","constant"]
["Attenuation_Retardation_Species_6_param1"]
["Attenuation_Retardation_Species_6_param2"]
["Attenuation_Retardation_Species_6_param3"]
[]
[]
["Attenuation_Half_Life_Species_6","days","No Decay","No Decay","No Decay","No Decay","No Decay","No Decay","No Decay","No Decay","No Decay","No Decay","No Decay","No Decay","No Decay","No Decay","No Decay","No Decay"]
["Distribution",null,"constant","constant","constant","constant","constant","constant","constant","constant","constant","constant","constant","constant","constant","constant","constant","constant"]
["Attenuation_Half_Life_Species_6_param1"]
["Attenuation_Half_Life_Species_6_param2"]
["Attenuation_Half_Life_Species_6_param3"]
[]
[]
["Attenuation_Decay_Coefficient_Species_6","1/s",{"$f":" IF((_xlfn.SINGLE(Attenuation_Half_Life_Species_6))<>\"No Decay\", LN(2) / ((_xlfn.SINGLE(Attenuation_Half_Life_Species_6)) *_xlfn.SINGLE( s_per_day)),0)","v":0},0,0,0,0,0,0,0,0,0,0,0,0,0,0,0]
["Distribution",null,"constant","constant","constant","constant","constant","constant","constant","constant","constant","constant","constant","constant","constant","constant","constant","constant"]
["Attenuation_Decay_Coefficient_Species_6_param1"]
["Attenuation_Decay_Coefficient_Species_6_param2"]
["Attenuation_Decay_Coefficient_Species_6_param3"]
[]
[]
[{"$f":" IF((Contaminants_Source_determinand_names   Contaminants_Species7)=0,\"Undefined\",(Contaminants_Source_determinand_names   Contaminants_Species7))","v":"Molybdenum"}]
[]
["Attenuation_Partition_Coefficient_Kd_Species_7","L/kg",{"$f":"AL_Kd_Mo","v":110},{"$f":"BGF_Kd_Mo","v":110},{"$f":" (Attenuation_Fraction_organic_carbon) * (Contaminants_Organic_Carbon_Water_Partition_Coefficient_Koc  Contaminants_Species7)","v":0},{"$f":" (Attenuation_Fraction_organic_carbon) * (Contaminants_Organic_Carbon_Water_Partition_Coefficient_Koc  Contaminants_Species7)","v":0},{"$f":" (Attenuation_Fraction_organic_carbon) * (Contaminants_Organic_Carbon_Water_Partition_Coefficient_Koc  Contaminants_Species7)","v":0},{"$f":" (Attenuation_Fraction_organic_carbon) * (Contaminants_Organic_Carbon_Water_Partition_Coefficient_Koc  Contaminants_Species7)","v":0},{"$f":" (Attenuation_Fraction_organic_carbon) * (Contaminants_Organic_Carbon_Water_Partition_Coefficient_Koc  Contaminants_Species7)","v":0},{"$f":" (Attenuation_Fraction_organic_carbon) * (Contaminants_Organic_Carbon_Water_Partition_Coefficient_Koc  Contaminants_Species7)","v":0},{"$f":" (Attenuation_Fraction_organic_carbon) * (Contaminants_Organic_Carbon_Water_Partition_Coefficient_Koc  Contaminants_Species7)","v":0},{"$f":" (Attenuation_Fraction_organic_carbon) * (Contaminants_Organic_Carbon_Water_Partition_Coefficient_Koc  Contaminants_Species7)","v":0},{"$f":" (Attenuation_Fraction_organic_carbon) * (Contaminants_Organic_Carbon_Water_Partition_Coefficient_Koc  Contaminants_Species7)","v":0},{"$f":" (Attenuation_Fraction_organic_carbon) * (Contaminants_Organic_Carbon_Water_Partition_Coefficient_Koc  Contaminants_Species7)","v":0},{"$f":" (Attenuation_Fraction_organic_carbon) * (Contaminants_Organic_Carbon_Water_Partition_Coefficient_Koc  Contaminants_Species7)","v":0},{"$f":" (Attenuation_Fraction_organic_carbon) * (Contaminants_Organic_Carbon_Water_Partition_Coefficient_Koc  Contaminants_Species7)","v":0},{"$f":" (Attenuation_Fraction_organic_carbon) * (Contaminants_Organic_Carbon_Water_Partition_Coefficient_Koc  Contaminants_Species7)","v":0},{"$f":" (Attenuation_Fraction_organic_carbon) * (Contaminants_Organic_Carbon_Water_Partition_Coefficient_Koc  Contaminants_Species7)","v":0}]
["Distribution",null,"constant","constant","constant","constant","constant","constant","constant","constant","constant","constant","constant","constant","constant","constant","constant","constant"]
["Attenuation_Partition_Coefficient_Kd_Species_7_param1"]
["Attenuation_Partition_Coefficient_Kd_Species_7_param2"]
["Attenuation_Partition_Coefficient_Kd_Species_7_param3"]
[]
[]
["Attenuation_Retardation_Species_7","[-]",{"$f":" 1 + 0.001 * (Attenuation_Partition_Coefficient_Kd_Species_7) * (Attenuation_Dry_bulk_density) / (Hydrogeology_Porosity    Hydrogeology!$C:$C)","v":4401},{"$f":" 1 + 0.001 * (Attenuation_Partition_Coefficient_Kd_Species_7) * (Attenuation_Dry_bulk_density) / (Hydrogeology_Porosity    Hydrogeology!$D:$D)","v":881},{"$f":" 1 + 0.001 * (Attenuation_Partition_Coefficient_Kd_Species_7) * (Attenuation_Dry_bulk_density) / (Hydrogeology_Porosity    Hydrogeology!$E:$E)","v":{"$error":"#DIV/0!"}},{"$f":" 1 + 0.001 * (Attenuation_Partition_Coefficient_Kd_Species_7) * (Attenuation_Dry_bulk_density) / (Hydrogeology_Porosity    Hydrogeology!$F:$F)","v":{"$error":"#DIV/0!"}},{"$f":" 1 + 0.001 * (Attenuation_Partition_Coefficient_Kd_Species_7) * (Attenuation_Dry_bulk_density) / (Hydrogeology_Porosity    Hydrogeology!$G:$G)","v":{"$error":"#DIV/0!"}},{"$f":" 1 + 0.001 * (Attenuation_Partition_Coefficient_Kd_Species_7) * (Attenuation_Dry_bulk_density) / (Hydrogeology_Porosity    Hydrogeology!$H:$H)","v":{"$error":"#DIV/0!"}},{"$f":" 1 + 0.001 * (Attenuation_Partition_Coefficient_Kd_Species_7) * (Attenuation_Dry_bulk_density) / (Hydrogeology_Porosity    Hydrogeology!$I:$I)","v":{"$error":"#DIV/0!"}},{"$f":" 1 + 0.001 * (Attenuation_Partition_Coefficient_Kd_Species_7) * (Attenuation_Dry_bulk_density) / (Hydrogeology_Porosity    Hydrogeology!$J:$J)","v":{"$error":"#DIV/0!"}},{"$f":" 1 + 0.001 * (Attenuation_Partition_Coefficient_Kd_Species_7) * (Attenuation_Dry_bulk_density) / (Hydrogeology_Porosity    Hydrogeology!$K:$K)","v":{"$error":"#DIV/0!"}},{"$f":" 1 + 0.001 * (Attenuation_Partition_Coefficient_Kd_Species_7) * (Attenuation_Dry_bulk_density) / (Hydrogeology_Porosity    Hydrogeology!$L:$L)","v":{"$error":"#DIV/0!"}},{"$f":" 1 + 0.001 * (Attenuation_Partition_Coefficient_Kd_Species_7) * (Attenuation_Dry_bulk_density) / (Hydrogeology_Porosity    Hydrogeology!$M:$M)","v":{"$error":"#DIV/0!"}},{"$f":" 1 + 0.001 * (Attenuation_Partition_Coefficient_Kd_Species_7) * (Attenuation_Dry_bulk_density) / (Hydrogeology_Porosity    Hydrogeology!$N:$N)","v":{"$error":"#DIV/0!"}},{"$f":" 1 + 0.001 * (Attenuation_Partition_Coefficient_Kd_Species_7) * (Attenuation_Dry_bulk_density) / (Hydrogeology_Porosity    Hydrogeology!$O:$O)","v":{"$error":"#DIV/0!"}},{"$f":" 1 + 0.001 * (Attenuation_Partition_Coefficient_Kd_Species_7) * (Attenuation_Dry_bulk_density) / (Hydrogeology_Porosity    Hydrogeology!$P:$P)","v":{"$error":"#DIV/0!"}},{"$f":" 1 + 0.001 * (Attenuation_Partition_Coefficient_Kd_Species_7) * (Attenuation_Dry_bulk_density) / (Hydrogeology_Porosity    Hydrogeology!$Q:$Q)","v":{"$error":"#DIV/0!"}},{"$f":" 1 + 0.001 * (Attenuation_Partition_Coefficient_Kd_Species_7) * (Attenuation_Dry_bulk_density) / (Hydrogeology_Porosity    Hydrogeology!$R:$R)","v":{"$error":"#DIV/0!"}}]
["Distribution",null,"constant","constant","constant","constant","constant","constant","constant","constant","constant","constant","constant","constant","constant","constant","constant","constant"]
["Attenuation_Retardation_Species_7_param1"]
["Attenuation_Retardation_Species_7_param2"]
["Attenuation_Retardation_Species_7_param3"]
[]
[]
["Attenuation_Half_Life_Species_7","days","No Decay","No Decay","No Decay","No Decay","No Decay","No Decay","No Decay","No Decay","No Decay","No Decay","No Decay","No Decay","No Decay","No Decay","No Decay","No Decay"]
["Distribution",null,"constant","constant","constant","constant","constant","constant","constant","constant","constant","constant","constant","constant","constant","constant","constant","constant"]
["Attenuation_Half_Life_Species_7_param1"]
["Attenuation_Half_Life_Species_7_param2"]
["Attenuation_Half_Life_Species_7_param3"]
[]
[]
["Attenuation_Decay_Coefficient_Species_7","1/s",{"$f":" IF((_xlfn.SINGLE(Attenuation_Half_Life_Species_7))<>\"No Decay\", LN(2) / ((_xlfn.SINGLE(Attenuation_Half_Life_Species_7)) *_xlfn.SINGLE( s_per_day)),0)","v":0},0,0,0,0,0,0,0,0,0,0,0,0,0,0,0]
["Distribution",null,"constant","constant","constant","constant","constant","constant","constant","constant","constant","constant","constant","constant","constant","constant","constant","constant"]
["Attenuation_Decay_Coefficient_Species_7_param1"]
["Attenuation_Decay_Coefficient_Species_7_param2"]
["Attenuation_Decay_Coefficient_Species_7_param3"]
[]
[]
[{"$f":" IF((Contaminants_Source_determinand_names   Contaminants_Species8)=0,\"Undefined\",(Contaminants_Source_determinand_names   Contaminants_Species8))","v":"Antimony"}]
[]
["Attenuation_Partition_Coefficient_Kd_Species_8","L/kg",{"$f":"AL_Kd_Sb","v":140},{"$f":"BGF_Kd_Sb","v":17},{"$f":" (Attenuation_Fraction_organic_carbon) * (Contaminants_Organic_Carbon_Water_Partition_Coefficient_Koc  Contaminants_Species8)","v":0},{"$f":" (Attenuation_Fraction_organic_carbon) * (Contaminants_Organic_Carbon_Water_Partition_Coefficient_Koc  Contaminants_Species8)","v":0},{"$f":" (Attenuation_Fraction_organic_carbon) * (Contaminants_Organic_Carbon_Water_Partition_Coefficient_Koc  Contaminants_Species8)","v":0},{"$f":" (Attenuation_Fraction_organic_carbon) * (Contaminants_Organic_Carbon_Water_Partition_Coefficient_Koc  Contaminants_Species8)","v":0},{"$f":" (Attenuation_Fraction_organic_carbon) * (Contaminants_Organic_Carbon_Water_Partition_Coefficient_Koc  Contaminants_Species8)","v":0},{"$f":" (Attenuation_Fraction_organic_carbon) * (Contaminants_Organic_Carbon_Water_Partition_Coefficient_Koc  Contaminants_Species8)","v":0},{"$f":" (Attenuation_Fraction_organic_carbon) * (Contaminants_Organic_Carbon_Water_Partition_Coefficient_Koc  Contaminants_Species8)","v":0},{"$f":" (Attenuation_Fraction_organic_carbon) * (Contaminants_Organic_Carbon_Water_Partition_Coefficient_Koc  Contaminants_Species8)","v":0},{"$f":" (Attenuation_Fraction_organic_carbon) * (Contaminants_Organic_Carbon_Water_Partition_Coefficient_Koc  Contaminants_Species8)","v":0},{"$f":" (Attenuation_Fraction_organic_carbon) * (Contaminants_Organic_Carbon_Water_Partition_Coefficient_Koc  Contaminants_Species8)","v":0},{"$f":" (Attenuation_Fraction_organic_carbon) * (Contaminants_Organic_Carbon_Water_Partition_Coefficient_Koc  Contaminants_Species8)","v":0},{"$f":" (Attenuation_Fraction_organic_carbon) * (Contaminants_Organic_Carbon_Water_Partition_Coefficient_Koc  Contaminants_Species8)","v":0},{"$f":" (Attenuation_Fraction_organic_carbon) * (Contaminants_Organic_Carbon_Water_Partition_Coefficient_Koc  Contaminants_Species8)","v":0},{"$f":" (Attenuation_Fraction_organic_carbon) * (Contaminants_Organic_Carbon_Water_Partition_Coefficient_Koc  Contaminants_Species8)","v":0}]
["Distribution",null,"constant","constant","constant","constant","constant","constant","constant","constant","constant","constant","constant","constant","constant","constant","constant","constant"]
["Attenuation_Partition_Coefficient_Kd_Species_8_param1"]
["Attenuation_Partition_Coefficient_Kd_Species_8_param2"]
["Attenuation_Partition_Coefficient_Kd_Species_8_param3"]
[]
[]
["Attenuation_Retardation_Species_8","[-]",{"$f":" 1 + 0.001 * (Attenuation_Partition_Coefficient_Kd_Species_8) * (Attenuation_Dry_bulk_density) / (Hydrogeology_Porosity    Hydrogeology!$C:$C)","v":5601},{"$f":" 1 + 0.001 * (Attenuation_Partition_Coefficient_Kd_Species_8) * (Attenuation_Dry_bulk_density) / (Hydrogeology_Porosity    Hydrogeology!$D:$D)","v":137},{"$f":" 1 + 0.001 * (Attenuation_Partition_Coefficient_Kd_Species_8) * (Attenuation_Dry_bulk_density) / (Hydrogeology_Porosity    Hydrogeology!$E:$E)","v":{"$error":"#DIV/0!"}},{"$f":" 1 + 0.001 * (Attenuation_Partition_Coefficient_Kd_Species_8) * (Attenuation_Dry_bulk_density) / (Hydrogeology_Porosity    Hydrogeology!$F:$F)","v":{"$error":"#DIV/0!"}},{"$f":" 1 + 0.001 * (Attenuation_Partition_Coefficient_Kd_Species_8) * (Attenuation_Dry_bulk_density) / (Hydrogeology_Porosity    Hydrogeology!$G:$G)","v":{"$error":"#DIV/0!"}},{"$f":" 1 + 0.001 * (Attenuation_Partition_Coefficient_Kd_Species_8) * (Attenuation_Dry_bulk_density) / (Hydrogeology_Porosity    Hydrogeology!$H:$H)","v":{"$error":"#DIV/0!"}},{"$f":" 1 + 0.001 * (Attenuation_Partition_Coefficient_Kd_Species_8) * (Attenuation_Dry_bulk_density) / (Hydrogeology_Porosity    Hydrogeology!$I:$I)","v":{"$error":"#DIV/0!"}},{"$f":" 1 + 0.001 * (Attenuation_Partition_Coefficient_Kd_Species_8) * (Attenuation_Dry_bulk_density) / (Hydrogeology_Porosity    Hydrogeology!$J:$J)","v":{"$error":"#DIV/0!"}},{"$f":" 1 + 0.001 * (Attenuation_Partition_Coefficient_Kd_Species_8) * (Attenuation_Dry_bulk_density) / (Hydrogeology_Porosity    Hydrogeology!$K:$K)","v":{"$error":"#DIV/0!"}},{"$f":" 1 + 0.001 * (Attenuation_Partition_Coefficient_Kd_Species_8) * (Attenuation_Dry_bulk_density) / (Hydrogeology_Porosity    Hydrogeology!$L:$L)","v":{"$error":"#DIV/0!"}},{"$f":" 1 + 0.001 * (Attenuation_Partition_Coefficient_Kd_Species_8) * (Attenuation_Dry_bulk_density) / (Hydrogeology_Porosity    Hydrogeology!$M:$M)","v":{"$error":"#DIV/0!"}},{"$f":" 1 + 0.001 * (Attenuation_Partition_Coefficient_Kd_Species_8) * (Attenuation_Dry_bulk_density) / (Hydrogeology_Porosity    Hydrogeology!$N:$N)","v":{"$error":"#DIV/0!"}},{"$f":" 1 + 0.001 * (Attenuation_Partition_Coefficient_Kd_Species_8) * (Attenuation_Dry_bulk_density) / (Hydrogeology_Porosity    Hydrogeology!$O:$O)","v":{"$error":"#DIV/0!"}},{"$f":" 1 + 0.001 * (Attenuation_Partition_Coefficient_Kd_Species_8) * (Attenuation_Dry_bulk_density) / (Hydrogeology_Porosity    Hydrogeology!$P:$P)","v":{"$error":"#DIV/0!"}},{"$f":" 1 + 0.001 * (Attenuation_Partition_Coefficient_Kd_Species_8) * (Attenuation_Dry_bulk_density) / (Hydrogeology_Porosity    Hydrogeology!$Q:$Q)","v":{"$error":"#DIV/0!"}},{"$f":" 1 + 0.001 * (Attenuation_Partition_Coefficient_Kd_Species_8) * (Attenuation_Dry_bulk_density) / (Hydrogeology_Porosity    Hydrogeology!$R:$R)","v":{"$error":"#DIV/0!"}}]
["Distribution",null,"constant","constant","constant","constant","constant","constant","constant","constant","constant","constant","constant","constant","constant","constant","constant","constant"]
["Attenuation_Retardation_Species_8_param1"]
["Attenuation_Retardation_Species_8_param2"]
["Attenuation_Retardation_Species_8_param3"]
[]
[]
["Attenuation_Half_Life_Species_8","days","No Decay","No Decay","No Decay","No Decay","No Decay","No Decay","No Decay","No Decay","No Decay","No Decay","No Decay","No Decay","No Decay","No Decay","No Decay","No Decay"]
["Distribution",null,"constant","constant","constant","constant","constant","constant","constant","constant","constant","constant","constant","constant","constant","constant","constant","constant"]
["Attenuation_Half_Life_Species_8_param1"]
["Attenuation_Half_Life_Species_8_param2"]
["Attenuation_Half_Life_Species_8_param3"]
[]
[]
["Attenuation_Decay_Coefficient_Species_8","1/s",{"$f":" IF((_xlfn.SINGLE(Attenuation_Half_Life_Species_8))<>\"No Decay\", LN(2) / ((_xlfn.SINGLE(Attenuation_Half_Life_Species_8)) *_xlfn.SINGLE( s_per_day)),0)","v":0},0,0,0,0,0,0,0,0,0,0,0,0,0,0,0]
["Distribution",null,"constant","constant","constant","constant","constant","constant","constant","constant","constant","constant","constant","constant","constant","constant","constant","constant"]
["Attenuation_Decay_Coefficient_Species_8_param1"]
["Attenuation_Decay_Coefficient_Species_8_param2"]
["Attenuation_Decay_Coefficient_Species_8_param3"]

{"sheet":"WaterBalance","index":5,"n_rows":6,"n_cols":1,"rows_kept":6,"cut":false,"hidden":false,"merged":[]}
["WATER BALANCE"]
[]
["User defined"]
[]
["Enter your own calculations for the water balance"]
["Carry fluxes and velocities over onto the Pathway sheet"]

{"sheet":"Pathways","index":6,"n_rows":26,"n_cols":9,"rows_kept":26,"cut":false,"hidden":false,"merged":[]}
["PATHWAY SUMMARY"]
[]
["Path 1",null,"Section 1",null,"Section 2",null,"Section 3"]
["Path 1  Type",null,"Source",null,"Unit",null,"Unit"]
["Path 1  Name",null,"Inert Restoration Material",null,"Attenution Layer: Node 1",null,"Beenham Grange Formation: Node 1"]
["Path 1  Process",null,"Declining source",null,"ADRD (1D) + Dilution",null,"No Processes"]
["Path 1  Standards",null,null,null,null,"Target Standard","EAL (GW)"]
["Path 1  Parameter1","Q_managed [m3/s]",0,"Velocity [m/s]",{"$f":" (Attenution_Laye   Hydrogeology_Velocity)","v":3.7733333333333307E-8}]
["Path 1  Parameter2","Managed time [years]",0,"Dispersivity [m]",{"$f":"E10/10","v":0.1}]
["Path 1  Parameter3","Q_path [m3/s]",{"$f":"QSide_B","v":2.7630157866666653E-5},"Travel Distance [m]",{"$f":"AL_traveldis","v":1}]
["Path 1  Parameter4","Q_decline [m3/s]",{"$f":"QSide_B","v":2.7630157866666653E-5},"Mixing Depth [m]"]
["Path 1  Parameter5",null,null,"Mixing Width [m]"]
["Path 1  Parameter6",null,null,"Q_Dilute [m3/s]",{"$f":"QRO_b","v":1.2702375507043272E-3},"Q_Dilute [m3/s]",0]
[]
[]
["Path 2",null,"Section 1",null,"Section 2",null,"Section 3",null,"Section 4"]
["Path 2  Type",null,"Source",null,"Unit",null,"Unit",null,"Receptor"]
["Path 2  Name",null,"Inert Restoration Material",null,"Attenution Layer: Node 2",null,"Beenham Grange Formation: Node 2",null,"Groundwater "]
["Path 2  Process",null,"Declining source",null,"ADRD (1D) + Dilution",null,"ADRD (1D) + Dilution",null,"User defined"]
["Path 2  Standards",null,null,null,null,null,null,"Target Standard","EAL (GW)"]
["Path 2  Parameter1","Q_managed [m3/s]",0,"Velocity [m/s]",{"$f":" (Attenution_Laye   Hydrogeology_Velocity)","v":3.7733333333333307E-8},"Velocity [m/s]",{"$f":" (Beenham_Grange_   Hydrogeology_Velocity)","v":2.1180000000000001E-5}]
["Path 2  Parameter2","Managed time [years]",0,"Dispersivity [m]",{"$f":"E23/10","v":0.1},"Dispersivity [m]",{"$f":"G23/10","v":1}]
["Path 2  Parameter3","Q_path [m3/s]",{"$f":"QSide_B","v":2.7630157866666653E-5},"Travel Distance [m]",{"$f":"AL_traveldis","v":1},"Travel Distance [m]",{"$f":"dis_gw_b","v":10}]
["Path 2  Parameter4","Q_decline [m3/s]",{"$f":"QSide_B","v":2.7630157866666653E-5},"Mixing Depth [m]",null,"Mixing Depth [m]"]
["Path 2  Parameter5",null,null,"Mixing Width [m]",null,"Mixing Width [m]"]
["Path 2  Parameter6",null,null,"Q_Dilute [m3/s]",{"$f":"QRO_b","v":1.2702375507043272E-3},"Q_Dilute [m3/s]",{"$f":" Path2_Param5*Path2_Param4*(Beenham_Grange_   Hydrogeology_Hydraulic_Conductivity)*(Beenham_Grange_   Hydrogeology_Hydraulic_Gradient)","v":0},"Q_dilute [m3/s]",{"$f":" Groundwater__Q_dilute","v":0}]

{"sheet":"Groundwater ","index":7,"n_rows":7,"n_cols":8,"rows_kept":7,"cut":false,"hidden":true,"merged":[]}
["RECEPTOR: Groundwater "]
[]
["Receptor Options"]
[]
[null,null,null,null,null,"Enter data and equations for User defined Receptor"]
[]
[null,null,null,null,null,"Q_dilute",null,"m3/s"]

{"sheet":"Simulation","index":8,"n_rows":126,"n_cols":12,"rows_kept":126,"cut":false,"hidden":false,"merged":[]}
["SIMULATION PARAMETERS"]
[]
[null,"Monte Carlo Analysis with Crystal Ball",null,null,null,null,null,null,null,"Named Constants"]
[]
[null,null,"Reported Percentile",null,null,95,null,null,null,null,"s_per_year",{"$f":"365.25*60*60*24","v":31557600}]
[null,null,"Number of simulations",null,null,10000,null,null,null,null,"s_per_day",{"$f":"60*60*24","v":86400}]
[]
[]
[null,null,null,null,null,null,null,null,null,"Laplace Transform Solution Parameters"]
[]
[null,null,"Minimise while running:",null,null,null,null,null,null,null,"sigma",0]
[null,null,null,null,null,null,null,null,null,null,"nu",1]
[null,null,null,null,null,null,null,null,null,null,"nsum",16]
[null,null,null,null,null,null,null,null,null,null,"omega",11]
[]
[]
[null,"Reporting Options"]
[]
[]
[]
[]
[null,null,"Number of timeslices for breakthrough curves",null,null,null,100]
[]
[null," The timeslices specified on the results sheets are saved below."]
[null,null,"Path1 timeslices in years",null,"Path2 timeslices in years"]
[null,null,"TS_Path1",null,"TS_Path2"]
[null,null,10,null,10]
[null,null,20,null,20]
[null,null,30,null,30]
[null,null,40,null,40]
[null,null,50,null,50]
[null,null,60,null,60]
[null,null,70,null,70]
[null,null,80,null,80]
[null,null,90,null,90]
[null,null,100,null,100]
[null,null,110,null,110]
[null,null,120,null,120]
[null,null,130,null,130]
[null,null,140,null,140]
[null,null,150,null,150]
[null,null,160,null,160]
[null,null,170,null,170]
[null,null,180,null,180]
[null,null,190,null,190]
[null,null,200,null,200]
[null,null,210,null,210]
[null,null,220,null,220]
[null,null,230,null,230]
[null,null,240,null,240]
[null,null,250,null,250]
[null,null,260,null,260]
[null,null,270,null,270]
[null,null,280,null,280]
[null,null,290,null,290]
[null,null,300,null,300]
[null,null,310,null,310]
[null,null,320,null,320]
[null,null,330,null,330]
[null,null,340,null,340]
[null,null,350,null,350]
[null,null,360,null,360]
[null,null,370,null,370]
[null,null,380,null,380]
[null,null,390,null,390]
[null,null,400,null,400]
[null,null,410,null,410]
[null,null,420,null,420]
[null,null,430,null,430]
[null,null,440,null,440]
[null,null,450,null,450]
[null,null,460,null,460]
[null,null,470,null,470]
[null,null,480,null,480]
[null,null,490,null,490]
[null,null,500,null,500]
[null,null,510,null,510]
[null,null,520,null,520]
[null,null,530,null,530]
[null,null,540,null,540]
[null,null,550,null,550]
[null,null,560,null,560]
[null,null,570,null,570]
[null,null,580,null,580]
[null,null,590,null,590]
[null,null,600,null,600]
[null,null,610,null,610]
[null,null,620,null,620]
[null,null,630,null,630]
[null,null,640,null,640]
[null,null,650,null,650]
[null,null,660,null,660]
[null,null,670,null,670]
[null,null,680,null,680]
[null,null,690,null,690]
[null,null,700,null,700]
[null,null,710,null,710]
[null,null,720,null,720]
[null,null,730,null,730]
[null,null,740,null,740]
[null,null,750,null,750]
[null,null,760,null,760]
[null,null,770,null,770]
[null,null,780,null,780]
[null,null,790,null,790]
[null,null,800,null,800]
[null,null,810,null,810]
[null,null,820,null,820]
[null,null,830,null,830]
[null,null,840,null,840]
[null,null,850,null,850]
[null,null,860,null,860]
[null,null,870,null,870]
[null,null,880,null,880]
[null,null,890,null,890]
[null,null,900,null,900]
[null,null,910,null,910]
[null,null,920,null,920]
[null,null,930,null,930]
[null,null,940,null,940]
[null,null,950,null,950]
[null,null,960,null,960]
[null,null,970,null,970]
[null,null,980,null,980]
[null,null,990,null,990]
[null,null,1000,null,1000]

{"sheet":"Audit","index":9,"n_rows":1383,"n_cols":39,"rows_kept":1383,"cut":false,"hidden":false,"merged":[]}
["AUDIT TRAIL SHEET"]
[]
["Author","Date","Time",null,"Cell Address",null,"New Value","Old Value","Cell Name"]
[]
[]
["Saved  27/02/2023: 12:38:52  Level Number: 5"]
[]
["BREAKTHROUGH RESULTS"]
[]
["Advanced"]
["Pollutant Linkage: Inert Restorati, Attenution Layer, Beenham Grange Formation",null,null,null,null,null,null,null,null,null,"Pollutant Linkage: Inert Restorati, Attenution Layer, Beenham Grange Formation, Groundwater ",null,null,null,null,null,null,null,null,null,"Pollutant Linkage: Inert Restorati, Attenution Layer, Beenham Grange Formation, River Enborne",null,null,null,null,null,null,null,null,null,"Pollutant Linkage: Inert Restorati, Attenution Layer, Beenham Grange Formation, Spring Ditch"]
["Concentrations in mg/L in Beenham Grange Formation",null,null,null,null,null,null,null,null,null,"Concentrations in mg/L in Groundwater ",null,null,null,null,null,null,null,null,null,"Concentrations in mg/L in River Enborne",null,null,null,null,null,null,null,null,null,"Concentrations in mg/L in Spring Ditch"]
[]
["Compared with EAL (GW) target concentration in mg/L",null,null,null,null,null,null,null,null,null,"No target concentrations specified for comparison",null,null,null,null,null,null,null,null,null,"Compared with EAL (River Enborne) target concentration in mg/L",null,null,null,null,null,null,null,null,null,"Compared with EAL (Spring Ditch) target concentration in mg/L"]
[null,0.26600000000000001,4.8199999999999993E-2,1E-3,4.3649999999999991E-3,2.0000000000000002E-5,2E-3,2.0000000000000001E-4,1E-3,null,null,null,null,null,null,null,null,null,null,null,null,0.26600000000000001,2.76E-2,4.7000000000000002E-3,2.8000000000000001E-2,5.0000000000000001E-4,1.75E-3,1.1999999999999999E-3,1E-3,null,null,0.26600000000000001,0.03,4.7000000000000002E-3,2.8000000000000001E-2,5.0000000000000001E-4,1.5E-3,1.1999999999999999E-3,5.0000000000000001E-3]
[]
["Time(years)","Species1","Species2","Species3","Species4","Species5","Species6","Species7","Species8",null,"Time(years)","Species1","Species2","Species3","Species4","Species5","Species6","Species7","Species8",null,"Time(years)","Species1","Species2","Species3","Species4","Species5","Species6","Species7","Species8",null,"Time(years)","Species1","Species2","Species3","Species4","Species5","Species6","Species7","Species8"]
[null,"Ammoniacal Nitrogen","Barium","Total Chromiun","Copper","Mercury","Molybdenum","Lead","Antimony",null,null,"Ammoniacal Nitrogen","Barium","Total Chromiun","Copper","Mercury","Molybdenum","Lead","Antimony",null,null,"Ammoniacal Nitrogen","Barium","Total Chromiun","Copper","Mercury","Molybdenum","Lead","Antimony",null,null,"Ammoniacal Nitrogen","Barium","Total Chromiun","Copper","Mercury","Molybdenum","Lead","Antimony"]
[10,1.5971076978511836E-12,1.9592882057883589E-22,0,0,0,0,0,0,null,10,1.5421941182368864E-12,0,0,0,0,0,0,0,null,10,1.1322049814174945E-15,4.2947608655767881E-26,0,0,0,0,0,0,null,10,1.7140472199286931E-13,2.1454872483302177E-24,0,0,0,0,0,0]
[20,2.0793731263382399E-7,1.514522300131767E-15,0,0,0,0,0,0,null,20,2.0609962470733467E-7,9.8414838193386251E-17,0,0,0,0,0,0,null,20,1.5731678858711293E-10,2.7141082008489792E-21,0,0,0,0,0,0,null,20,2.3509779450370226E-8,1.3469212170529802E-18,0,0,0,0,0,0]
[30,1.1034568439612781E-5,5.9553996920910681E-11,0,0,0,0,0,0,null,30,1.0990737887735778E-5,1.527668104815454E-11,0,0,0,0,0,0,null,30,8.4511053228842374E-9,2.026682266119852E-15,0,0,0,0,0,0,null,30,1.2598656687105035E-6,5.2655529996755895E-13,0,0,0,0,0,0]
[40,8.1508033502182914E-5,1.2168553082699859E-8,0,0,0,0,0,0,null,40,8.1324882738976312E-5,5.46517401321152E-9,0,0,0,0,0,0,null,40,6.2695714147434928E-8,1.3796354840328518E-12,0,0,0,0,0,0,null,40,9.3384028957929163E-6,2.9495339401679764E-10,0,0,0,0,0,0]
[50,2.7162932263881373E-4,3.0073506393203505E-7,0,0,0,0,0,0,null,50,2.7123795568040441E-4,1.7812487323242394E-7,0,0,0,0,0,0,null,50,2.0935886099683981E-7,6.4165196876408821E-11,0,0,0,0,0,0,null,50,3.1170987982515597E-5,1.2273490793952907E-8,0,0,0,0,0,0]
[60,6.0607604392679492E-4,2.5744265005620261E-6,0,0,0,0,0,0,null,60,6.0547037699042823E-4,1.7813760213223917E-6,0,0,0,0,0,0,null,60,4.6765105130272194E-7,7.949137692768193E-10,0,0,0,0,0,0,null,60,6.9612153445574915E-5,1.4196169178064071E-7,0,0,0,0,0,0]
[70,1.0735228512342055E-3,1.1997461551384742E-5,0,0,0,0,0,0,null,70,1.072737812573826E-3,9.1347891314368461E-6,0,0,0,0,0,0,null,70,8.28891106413946E-7,4.6766456535406571E-9,0,0,0,0,0,0,null,70,1.2336794426748613E-4,7.9859471336750478E-7,0,0,0,0,0,0]
[80,1.644514474433492E-3,3.8181386145270564E-5,0,0,0,0,0,0,null,80,1.6435996995420427E-3,3.0957200636097182E-5,0,0,0,0,0,0,null,80,1.2703228040342083E-6,1.7388821510174244E-8,0,0,0,0,0,0,null,80,1.890518291135969E-4,2.879919858584127E-6,0,0,0,0,0,0]
[90,2.285589878777609E-3,9.4145427487976849E-5,0,0,0,0,0,0,null,90,2.284594143083212E-3,7.9724599668805387E-5,0,0,0,0,0,0,null,90,1.7660611846068298E-6,4.7799610427254138E-8,0,0,0,0,0,0,null,90,2.6281267945855552E-4,7.7468252997320072E-6,0,0,0,0,0,0]
[100,2.966449207171787E-3,1.9405069265059766E-4,0,0,0,0,0,0,null,100,2.9654138374854478E-3,1.6955262841302751E-4,0,0,0,0,0,0,null,100,2.2926538150182738E-6,1.0659795050562322E-7,0,0,0,0,0,0,null,100,3.411616595440455E-4,1.700456894023787E-5,0,0,0,0,0,0]
[110,3.6624976411763679E-3,3.5094715392666764E-4,0,0,0,0,0,0,null,110,3.6614548984028115E-3,3.1386528648373266E-4,0,0,0,0,0,0,null,110,2.8310581800580097E-6,2.0446744653597021E-7,0,0,0,0,0,0,null,110,4.2126613688801227E-4,3.2230685590616716E-5,0,0,0,0,0,0]
[120,4.3550678147952805E-3,5.7523016667495295E-4,0,0,0,0,0,0,null,120,4.35404150734692E-3,5.2368210566945456E-4,0,0,0,0,0,0,null,120,3.3668180466249283E-6,3.5058476589622754E-7,0,0,0,0,0,0,null,120,5.0097579310463792E-4,5.4759778034065995E-5,0,0,0,0,0,0]
[130,5.0306954130721095E-3,8.7392574503471925E-4,0,0,0,0,0,0,null,130,5.0297022870654127E-3,8.0674176012729502E-4,0,0,0,0,0,0,null,130,3.8895046177182178E-6,5.5174517273653338E-7,0,0,0,0,0,0,null,130,5.7873943366228034E-4,8.5563259478592198E-5,0,0,0,0,0,0]
[140,5.6801313262911076E-3,1.2506281536280228E-3,0,0,0,0,0,0,null,140,5.6791825616559185E-3,1.167324930827452E-3,0,0,0,0,0,0,null,140,4.3919526038196922E-6,8.1207426869929596E-7,0,0,0,0,0,0,null,140,6.5349132406287709E-4,1.2521431057861343E-4,0,0,0,0,0,0]
[150,6.2973874622400967E-3,1.705843454469344E-3,0,0,0,0,0,0,null,150,6.2964900079692547E-3,1.6065327371765992E-3,0,0,0,0,0,0,null,150,4.8695218133954017E-6,1.1331509591399841E-6,0,0,0,0,0,0,null,150,7.2454133816840115E-4,1.7391110456695656E-4,0,0,0,0,0,0]
[160,6.8789227074419774E-3,2.23752960938336E-3,0,0,0,0,0,0,null,160,6.8780803786296805E-3,2.1227997772582568E-3,0,0,0,0,0,0,null,160,5.3194670038013248E-6,1.5143607368313742E-6,0,0,0,0,0,0,null,160,7.9148121803295239E-4,2.315317907214146E-4,0,0,0,0,0,0]
[170,7.4229896580184857E-3,2.8416893241840517E-3,0,0,0,0,0,0,null,170,7.4222039979847379E-3,2.7124843632590403E-3,0,0,0,0,0,0,null,170,5.7404320995778592E-6,1.9533417492790903E-6,0,0,0,0,0,0,null,170,8.5410933699093259E-4,2.9770154645884713E-4,0,0,0,0,0,0]
[180,7.9291282953363549E-3,3.5129310837011024E-3,0,0,0,0,0,0,null,180,7.9283992352803343E-3,3.3704404146876268E-3,0,0,0,0,0,0,null,180,6.1320581405635042E-6,2.4464358717580697E-6,0,0,0,0,0,0,null,180,9.1237238165561992E-4,3.7185934660440424E-4,0,0,0,0,0,0]
[190,8.3977820217945483E-3,4.2449567699462832E-3,0,0,0,0,0,0,null,190,8.3971083767324928E-3,4.0905219044039655E-3,0,0,0,0,0,0,null,190,6.4946859549560015E-6,2.9890968789830667E-6,0,0,0,0,0,0,null,190,9.6632112490865798E-4,4.5331783897254938E-4,0,0,0,0,0,0]
[200,8.8300108250256477E-3,5.0309615673169638E-3,0,0,0,0,0,0,null,200,8.8293906619043884E-3,4.8660010065052937E-3,0,0,0,0,0,0,null,200,6.8291340341475641E-6,3.5762348826855117E-6,0,0,0,0,0,0,null,200,1.0160773853777742E-3,5.4131355709316519E-4,0,0,0,0,0,0]
[210,9.2272794590234752E-3,5.863947413886122E-3,0,0,0,0,0,0,null,210,9.2267103670920329E-3,5.689898735305959E-3,0,0,0,0,0,0,null,210,7.1365344940607358E-6,4.2024925723125617E-6,0,0,0,0,0,0,null,210,1.0618096273183866E-3,6.3504699522300135E-4,0,0,0,0,0,0]
[220,9.5913026016943067E-3,6.7369590025418598E-3,0,0,0,0,0,0,null,220,9.5907818891126876E-3,6.555235941587639E-3,0,0,0,0,0,0,null,220,7.4182131561982924E-6,4.86245761239563E-6,0,0,0,0,0,0,null,220,1.1037151232661242E-3,7.3371328824357754E-4,0,0,0,0,0,0]
[230,9.9239328208002801E-3,7.643254328664844E-3,0,0,0,3.3538597087754569E-40,0,0,null,230,9.9234576560632507E-3,7.4552163089550661E-3,0,0,0,2.1657358324548515E-40,0,0,null,230,7.6756027784825559E-6,5.5508195560983927E-6,0,0,0,0,0,0,null,230,1.1420070476590271E-3,8.3652477751232888E-4,0,0,0,0,0,0]
[240,1.0227080464544196E-2,8.5764221136639777E-3,0,0,0,0,0,0,null,240,1.0226647976883569E-2,8.3833537479100495E-3,0,0,0,8.5438057240627883E-40,0,0,null,240,7.91018100835089E-6,6.2624808209937222E-6,0,0,0,0,0,0,null,240,1.1769052478343243E-3,9.4272688792138178E-4,0,0,0,1.86092568670234E-40,0,0]
[250,1.050265722687071E-2,9.530457427231312E-3,0,0,0,0,0,0,null,250,1.0502264576308408E-2,9.3335557787034909E-3,0,0,0,0,0,0,null,250,8.1234266697668648E-6,6.9926309492532096E-6,0,0,0,0,0,0,null,250,1.2086297421369573E-3,1.051608676853026E-3,0,0,0,0,0,0]
[260,1.0752537185553183E-2,1.049980526861718E-2,0,3.4671294311057285E-40,0,7.4443487305188611E-38,0,0,null,260,1.0752181610620299E-2,1.0300173003035514E-2,0,0,0,2.4450822834869729E-38,0,0,null,260,8.316789581544554E-6,7.7367923426975161E-6,0,0,0,0,0,0,null,260,1.2373962307638132E-3,1.1625092553270088E-3,0,0,0,0,0,0]
[270,1.097853067496495E-2,1.1479380183162129E-2,0,1.1632390343237601E-39,0,4.8494213259654691E-37,0,0,null,270,1.0978209524048283E-2,1.1278023083153014E-2,0,4.8602831826397746E-40,0,3.1447937242498113E-37,0,0,null,270,8.4916703153267255E-6,8.4908443855976669E-6,0,0,0,1.0653149078468338E-40,0,0,null,270,1.2634130850883755E-3,1.2748210899509464E-3,0,0,0,2.3883003245970862E-38,0,0]
[280,1.1182367536708711E-2,1.246456840584521E-2,0,0,0,3.2695430609387298E-36,0,0,null,280,1.1182078287479037E-2,1.2262396031545783E-2,0,6.7185012084461575E-39,0,1.404313357070496E-36,0,0,null,280,8.6494072162770387E-6,9.2510315921123914E-6,0,0,0,6.7989923676299578E-40,0,0,null,280,1.2868794172799507E-3,1.3879910055339044E-3,0,1.480821629783114E-40,0,1.0925778143004936E-37,0,0]
[290,1.136568717775863E-2,1.3451217635285543E-2,0,4.3437733982535121E-39,0,2.3603513075191038E-35,0,1.126965080953565E-40,null,290,1.1365427447976438E-2,1.3249046182168456E-2,0,0,0,1.0697022130402569E-35,0,1.0942237159128122E-40,null,290,8.7912686960150831E-6,1.0013960259582078E-5,0,0,0,2.5269549230299603E-39,0,0,null,290,1.3079839341407459E-3,1.5015195385678511E-3,0,1.6314161028064564E-39,0,5.3206947690543895E-37,0,0]
[300,1.153003352852134E-2,1.4435618377137003E-2,0,2.3706295919597702E-37,0,1.2950723588234238E-34,0,1.3375785558203552E-40,null,300,1.1529801080679157E-2,1.4234175003558966E-2,0,0,0,7.2742884135274906E-35,0,1.8470783423161291E-40,null,300,8.9184493205584871E-6,1.0776587119066783E-5,0,0,0,2.071335288919922E-38,0,0,null,300,1.3269043554217476E-3,1.6149591471533269E-3,0,0,0,4.3919017813326912E-36,0,0]
[310,1.1676853487562359E-2,1.5414479847400516E-2,0,1.2092053065617258E-36,0,5.4960931568909076E-34,0,0,null,310,1.1676646229163617E-2,1.5214407923035302E-2,0,3.5487568272378072E-37,0,3.5013681721971731E-34,0,0,null,310,9.0320685988328478E-6,1.1536202656666433E-5,0,0,0,1.324725411801999E-37,0,0,null,310,1.3438072338291314E-3,1.7279116638267648E-3,0,0,0,2.5245232280045601E-35,0,0]
[320,1.1807497808292758E-2,1.6384902670068854E-2,0,6.0366374525951906E-36,0,1.9111121408443181E-33,0,5.432495265624217E-40,null,320,1.1807313789114019E-2,1.6186767537816758E-2,0,2.0274820795228709E-36,0,1.333706203583494E-33,0,0,null,320,9.1331716627088691E-6,1.2290411120203164E-5,0,0,0,5.8159443002576403E-37,0,0,null,320,1.3588480563736507E-3,1.8400252819929025E-3,0,6.0822440578624524E-38,0,1.0481168908281819E-34,0,0]
[330,1.1923223657251009E-2,1.734435001050507E-2,0,3.4812342702036755E-35,0,5.4047082182091037E-33,0,3.1475614361246003E-38,null,330,1.1923061064570967E-2,1.7148644964763603E-2,0,5.7862842421412405E-36,0,4.254229840777919E-33,0,2.857913752257053E-38,null,330,9.2227312419978098E-6,1.3037108704744586E-5,0,1.8311729017714393E-39,0,2.0505610917899646E-36,0,0,null,330,1.3721715383286646E-3,1.950991291078102E-3,0,4.2102065611053629E-37,0,3.5917538182978315E-34,0,2.9645656068241789E-39]
[340,1.202519827809284E-2,1.8290618327098718E-2,0,1.7076080014367429E-34,0,1.1379483036970457E-32,0,1.4835592805707973E-37,null,340,1.2025055430599684E-2,1.8097770596210344E-2,0,3.111877634499488E-35,0,1.0925274864629809E-32,0,1.3890139432487151E-37,null,340,9.3016504961290838E-6,1.3774461004456273E-5,0,6.0505400897285474E-39,0,6.172915493626907E-36,0,0,null,340,1.3839120446050893E-3,2.0605407167168083E-3,0,1.0775339952628541E-36,0,1.0397721674125642E-33,0,1.5065374467074959E-38]
[350,1.2114503347578838E-2,1.9221808572804432E-2,0,6.7329782069280863E-34,0,1.2247581712918256E-32,0,6.03065935370926E-37,null,350,1.2114378688506816E-2,1.9032185158168492E-2,0,1.8559036414539414E-34,0,1.9546412823461936E-32,0,5.438458630641315E-37,null,350,9.3707663821536547E-6,1.4500880505886153E-5,0,1.7026198880842065E-38,0,1.5008599618708775E-35,0,3.6434539282923162E-40,null,350,1.3941940908878529E-3,2.1684409770934498E-3,0,4.5730427042289597E-36,0,2.3433421027162201E-33,0,5.6773153720814555E-38]
[360,1.2192139723142936E-2,2.0136298412682819E-2,0,2.2326889177780984E-33,0,0,0,2.9289770080601176E-36,null,360,1.2192031812987976E-2,1.9950211685727887E-2,0,8.0542690079241108E-34,0,9.380569996996195E-33,0,2.6235131008521705E-36,null,360,9.4308533263605236E-6,1.5215004660101687E-5,0,9.6460393392822891E-38,0,2.461106685357558E-35,0,1.7180391765794059E-39,null,360,1.4031328899263042E-3,2.2744926322211148E-3,0,2.7885900353444777E-35,0,3.18236178225258E-33,0,2.7023552482532191E-37]
[370,1.2259032365974257E-2,2.103271582496043E-2,0,6.4027734770385643E-33,0,0,0,1.3467364132619845E-35,null,370,1.225893987507827E-2,2.0850428819456292E-2,0,2.7455273136446111E-33,0,0,0,1.2317074084746383E-35,null,370,9.4826270322105811E-6,1.5915674892248873E-5,0,5.0571118636945681E-37,0,4.368036291989274E-36,0,8.3122394191485624E-39,null,370,1.4108349180871065E-3,2.3785262771270333E-3,0,1.2586957658991764E-34,0,0,0,1.2947166482095936E-36]
[380,1.2316035286138834E-2,2.1909914306216256E-2,0,1.5677073697935498E-32,0,0,0,5.1668607627623314E-35,null,380,1.2315956987335945E-2,2.1731645670096916E-2,0,8.0784747404596175E-33,0,0,0,4.8137830996801893E-35,null,380,9.5267483056682641E-6,1.6601916773974504E-5,0,1.9380157590859459E-36,0,0,0,3.3446413243940771E-38,null,380,1.4173984844845545E-3,2.480399610725958E-3,0,4.309513913863675E-34,0,0,0,5.1582840693695898E-36]
[390,1.2363936402736154E-2,2.2766949794174873E-2,0,3.0921424418724311E-32,0,0,0,1.6797451787691608E-34,null,390,1.2363871164183509E-2,2.2592878384398021E-2,0,2.1109135913040662E-32,0,0,0,1.584393025393367E-34,null,390,9.5638268150774461E-6,1.727292148634481E-5,0,5.965582859069711E-36,0,0,0,1.1219581118300375E-37,null,390,1.4229142903679449E-3,2.5799946980868665E-3,0,1.2474964958032596E-33,0,0,0,1.7192794977834758E-35]
[400,1.2403462246524033E-2,2.3603059344707508E-2,0,4.1011645666857537E-32,0,0,0,4.7908295393380001E-34,null,400,1.2403409024810972E-2,2.3433328462460233E-2,0,4.7218283902584895E-32,0,0,0,4.5635485112035353E-34,null,400,9.5944247293487525E-6,1.7928028630060679E-5,0,1.6092420920812691E-35,0,0,0,3.2777411587547792E-37,null,400,1.4274659703952409E-3,2.677215433620643E-3,0,3.2314302699467386E-33,0,0,0,4.9994299796366654E-35]
[410,1.2435282457614119E-2,2.4417641545594383E-2,0,0,0,0,0,1.2141938389789679E-33,null,410,1.2435240291202387E-2,2.4252362818745505E-2,0,8.2098244665930141E-32,0,0,0,1.1694355317910606E-33,null,410,9.619060197721752E-6,1.8566710389391465E-5,0,3.9009450822786637E-35,0,0,0,8.5299254339132678E-37,null,410,1.4311306103356642E-3,2.7719852054953163E-3,0,7.3851770229334265E-33,0,0,0,1.294564646576477E-34]
[420,1.2460014049595292E-2,2.5210238612783882E-2,0,0,0,2.113733481167809E-31,0,2.6933955903785601E-33,null,420,1.245998205261882E-2,2.5049495538914154E-2,0,7.9327913424929673E-32,0,0,0,2.6326635904970768E-33,null,420,9.6382106489360281E-6,1.9188557021346616E-5,0,8.1687531247192099E-35,0,0,0,1.9603873804667916E-36,null,420,1.4339792378995394E-3,2.8642447565981255E-3,0,1.3815241103748331E-32,0,0,0,2.9553619038064647E-34]
[430,1.2478225424669828E-2,2.5980520090740075E-2,0,0,0,1.4745764929840462E-29,0,4.9923997387291105E-33,null,430,1.2478202781119958E-2,2.5824371258222834E-2,0,0,0,4.7008490459485971E-30,0,4.9879834475905823E-33,null,430,9.6523158978049645E-6,1.9793263618155898E-5,0,1.328462654717179E-34,0,0,0,3.8289490484890228E-36,null,430,1.4360772849165301E-3,2.9539502340276045E-3,0,1.7301254280742987E-32,0,0,0,5.7158335894239185E-34]
[440,1.2490440134330824E-2,2.672826806380885E-2,0,0,0,4.9225685159135941E-29,0,6.8160111389556302E-33,null,440,1.2490426092619586E-2,2.6576750070805458E-2,0,0,0,3.2463660786135186E-29,0,7.1145635974967137E-33,null,440,9.6617810549858206E-6,2.0380618076297968E-5,0,1.123833336828728E-34,0,6.705737940754138E-33,0,5.7834315630003452E-36,null,440,1.4374850202261405E-3,3.0410714170041489E-3,0,0,0,1.827845612632203E-30,0,8.4784016294382927E-34]
[450,1.2497140386756098E-2,2.7453363777622725E-2,0,0,0,1.100597138122953E-28,0,2.959280775336841E-33,null,450,1.2497134254657637E-2,2.7306493870058273E-2,0,0,0,9.1326687937265044E-29,0,4.148256192104675E-33,null,450,9.6669792407809212E-6,2.095049019663704E-5,0,0,0,4.0519705383649646E-32,0,4.4500567841124639E-36,null,450,1.4382579534230415E-3,3.1255901118801177E-3,0,0,0,7.5570019836579128E-30,0,6.0322772342818324E-34]
[460,1.2498770307043654E-2,2.8155775566659227E-2,0,0,0,1.8884804395416656E-28,0,0,null,460,1.249877144699193E-2,2.8013554016517235E-2,0,0,0,1.8538278979905251E-28,0,0,null,460,9.6682541077874881E-6,2.1502821836179109E-5,0,0,0,1.1042816429766312E-31,0,0,null,460,1.4384472101494283E-3,3.2074987023837324E-3,0,0,0,1.8445249940175871E-29,0,0]
[470,1.2495738959466119E-2,2.8835547984505917E-2,0,0,0,2.4310457362458185E-28,0,0,null,470,1.2495746784211744E-2,2.8697960229497478E-2,0,0,0,2.9093372080216079E-28,0,0,null,470,9.6659221793477326E-6,2.2037618031005773E-5,0,0,0,2.1989653376590484E-31,0,0,null,470,1.4380998799991831E-3,3.2867988431359908E-3,0,0,0,3.4008154445219886E-29,0,0]
[480,1.2488423143038111E-2,2.9492792036290901E-2,0,0,0,1.7528598347265102E-28,0,0,null,480,1.2488437111620999E-2,2.9359810601194355E-2,0,0,0,3.2904241054528098E-28,0,0,null,480,9.6602750126914076E-6,2.2554939011352749E-5,0,0,0,3.3993591492752739E-31,0,0,null,480,1.4372593383259968E-3,3.3635002847106892E-3,0,0,0,4.8262663999425764E-29,0,0]
[490,1.2477169972877112E-2,3.0127676417128303E-2,0,1.7286350819448549E-29,0,0,0,0,null,490,1.2477189586928058E-2,2.9999262636121408E-2,0,0,0,1.4117286273049804E-28,0,0,null,490,9.651581196315502E-6,2.3054893032591425E-5,0,0,0,3.7887278328913564E-31,0,0,null,490,1.43596554339686E-3,3.4376198189491128E-3,0,0,0,4.5618952617503767E-29,0,0]
[500,1.246229926046801E-2,3.0740419665823724E-2,0,7.4872623192454208E-29,0,0,0,0,null,500,1.246232406077828E-2,3.0616525223966934E-2,0,0,0,0,0,0,null,500,9.6400881917448269E-6,2.3537629949749552E-5,0,0,0,1.5668567903748376E-31,0,0,null,500,1.4342553103969052E-3,3.5091803338236022E-3,0,0,0,0,0,0]
[510,1.2444105705919988E-2,3.1331283148966528E-2,0,1.8488045345261604E-28,0,0,0,0,null,510,1.2444135269308397E-2,3.1211851459753727E-2,0,5.6925456387010161E-29,0,0,0,0,null,510,9.6260240298666355E-6,2.4003335467523556E-5,0,0,0,0,0,0,null,510,1.4321625637931613E-3,3.5782099677972982E-3,0,0,0,0,0,0]
[520,1.2422860915446161E-2,3.1900564796733401E-2,0,3.5485159230152142E-28,0,0,0,0,null,520,1.2422894851857956E-2,3.178553223137498E-2,0,1.9460023182534681E-28,0,0,0,0,null,520,9.6095988719964073E-6,2.4452226002501729E-5,0,0,0,0,0,0,null,520,1.4297185695752513E-3,3.6447413543365483E-3,0,3.6031466517506753E-30,0,0,0,0]
[530,1.2398815256497716E-2,3.2448593517762137E-2,0,5.6058027694443626E-28,0,0,0,0,null,530,1.2398853206344278E-2,3.2337890500604712E-2,0,4.4012047090391754E-28,0,0,0,0,null,530,9.5910064453669335E-6,2.4884544098988565E-5,0,6.3043353800298591E-32,0,0,0,0,null,530,1.4269521488164761E-3,3.7088109479271182E-3,0,2.0964938508996535E-29,0,0,0,0]
[540,1.2372199562852145E-2,3.2975724226579003E-2,0,7.1589507507102541E-28,0,0,0,2.3627106088836065E-30,null,540,1.2372241194562001E-2,3.2869276209851202E-2,0,7.9555133588685793E-28,0,0,0,1.9182405627380605E-30,null,540,9.5704253624628054E-6,2.530055434458702E-5,0,2.4101580349273492E-31,0,0,0,9.8323535789124628E-34,null,540,1.423889873949598E-3,3.7704584236578158E-3,0,5.5255325040110056E-29,0,0,0,1.7078750805149881E-31]
[550,1.2343226701099178E-2,3.3482333422659986E-2,0,6.4104569829843577E-28,0,0,0,1.0151191851117226E-29,null,550,1.2343271708883871E-2,3.3380061752606001E-2,0,1.1898807899503945E-27,0,0,0,9.4307510937753698E-30,null,550,9.5480203331642539E-6,2.5700539736208768E-5,0,5.6772385022410864E-31,0,0,0,6.4595741249176172E-33,null,550,1.4205562491039425E-3,3.8297261430950981E-3,0,1.1040399868676846E-28,0,0,0,1.0024310211597036E-30]
[560,1.2312093009333003E-2,3.3968815265718079E-2,0,4.5567565717340728E-29,0,6.6315418852824602E-28,0,2.4700757361148235E-29,null,560,1.2312141111114767E-2,3.3870637951056881E-2,0,1.4222712034971465E-27,0,0,0,2.3747471687420696E-29,null,560,9.5239432779714339E-6,2.608479845148443E-5,0,1.060933708109661E-30,0,0,0,1.7224691213488631E-32,null,560,1.4169738757165156E-3,3.8866586798187576E-3,0,1.8211137594066743E-28,0,0,0,2.6201607711761902E-30]
[570,1.2278979618296375E-2,3.4435578096921708E-2,0,0,0,1.5553196263390204E-26,0,4.7470863893688437E-29,null,570,1.2279030553818064E-2,3.4341410489585389E-2,0,1.1101517953229955E-27,0,5.6255132121390461E-27,0,4.65465734383779E-29,null,570,9.4983343502776714E-6,2.6453640984703966E-5,0,1.6553946885966604E-30,0,0,0,3.4820005922951487E-32,null,570,1.4131636046155072E-3,3.9413023985945227E-3,0,2.4902661981762134E-28,0,0,0,5.2414656377345703E-30]
[580,1.2244053664363362E-2,3.488304136035094E-2,0,0,0,4.0080961387217412E-26,0,7.7174104996237238E-29,null,580,1.2244107193454378E-2,3.4792796757494499E-2,0,0,0,2.879461494628268E-26,0,7.6904775755394593E-29,null,580,9.4713228749706405E-6,2.6807387610095675E-5,0,2.1293776620787405E-30,0,5.6925700085373555E-30,0,5.8950440312911852E-32,null,580,1.4091446756620384E-3,3.9937050827069821E-3,0,2.6279678425617726E-28,0,1.6973505407939193E-27,0,8.8017506777009166E-30]
[590,1.2207469403191507E-2,3.5311632883472957E-2,0,0,0,7.3644016874261382E-26,0,1.0693582709343307E-28,null,590,1.2207525304164106E-2,3.5225223058910841E-2,0,0,0,6.4524725559634256E-26,0,1.0843775650026401E-28,null,590,9.4430282101388208E-6,2.7146366138856363E-5,0,2.029091064196972E-30,0,3.0925023188529778E-29,0,8.5260152320647451E-32,null,590,1.4049348459448448E-3,4.0439156045085998E-3,0,1.4095871585668516E-28,0,5.6678418591053743E-27,0,1.2623818484767589E-29]
[600,1.216936923218203E-2,3.572178647934425E-2,0,0,0,1.11679488261669E-25,0,1.2095959484716209E-28,null,600,1.2169427300366185E-2,3.5639122151733447E-2,0,0,0,1.1056771008350989E-25,0,1.2586338817958905E-28,null,600,9.4135605382674114E-6,2.7470909939531228E-5,0,6.2665428496869368E-31,0,6.9837823985532996E-29,0,1.0256718052708204E-31,null,600,1.4005505074812475E-3,4.0919836347069524E-3,0,0,0,1.1429627788533481E-26,0,1.5011499714479723E-29]
[610,1.2129884629241501E-2,3.6113939836983605E-2,0,0,0,1.4422589399754858E-25,0,9.170667025895632E-29,null,610,1.2129944675651249E-2,3.6034931081413202E-2,0,0,0,1.5896569941483109E-25,0,1.0196361844035582E-28,null,610,9.3830215925810334E-6,2.7781356194353703E-5,0,0,0,1.2004219393540863E-28,0,9.0270413712972048E-32,null,610,1.3960067952880047E-3,4.1379593863614074E-3,0,0,0,1.8418869269972626E-26,0,1.2875703870138982E-29]
[620,1.2089137014849628E-2,3.6488532669538332E-2,0,0,0,1.5528214942736532E-25,0,0,null,620,1.2089198864919371E-2,3.6413089278435479E-2,0,0,0,1.945144851314548E-25,0,0,null,620,9.3515053241589572E-6,2.8078044366766088E-5,0,0,0,1.730523782229354E-28,0,1.7208228885656403E-32,null,620,1.3913176866174248E-3,4.1818933899384538E-3,0,0,0,2.5166690407319844E-26,0,1.5842525814758166E-30]
[630,1.2047238543722518E-2,3.6846005093101909E-2,0,0,0,1.2361724836990094E-25,0,0,null,630,1.2047302036212541E-2,3.6774036891863385E-2,0,0,0,1.9452803482835695E-25,0,0,null,630,9.3190985144758976E-6,2.8361314857936315E-5,0,0,0,2.1266926129086912E-28,0,0,null,630,1.3864960920906095E-3,4.2238362961639821E-3,0,0,0,2.9130743286306317E-26,0,0]
[640,1.200429283194991E-2,3.718679621160826E-2,0,0,0,2.5587112177761223E-26,0,0,null,640,1.2004357817873998E-2,3.7118213333778918E-2,0,0,0,1.3069776999874646E-25,0,0,null,640,9.2858813380378371E-6,2.8631507832200707E-5,0,0,0,2.1474938413123884E-28,0,0,null,640,1.3815539394028251E-3,4.2638387037156351E-3,0,0,0,2.6752020577010604E-26,0,0]
[650,1.196039562503381E-2,3.7511342885784935E-2,0,1.6514956032010479E-26,0,0,0,0,null,650,1.1960461966705414E-2,3.744605601207332E-2,0,0,0,0,0,0,null,650,9.2519278793345072E-6,2.8888962193419177E-5,0,0,0,1.4918717617209353E-28,0,0,null,650,1.3765022502264348E-3,4.3019510091121052E-3,0,0,0,1.3842220427610641E-26,0,0]
[660,1.1915635411721861E-2,3.7820078666412918E-2,0,6.3143199026851348E-26,0,0,0,0,null,660,1.1915702981886541E-2,3.7757999231495976E-2,0,0,0,0,0,0,null,660,9.2173066077774142E-6,2.9134014696129434E-5,0,0,0,0,0,0,null,660,1.3713512108725812E-3,4.3382232764148541E-3,0,0,0,0,0,0]
[670,1.1870093988195496E-2,3.8113432874128252E-2,0,1.3189720141087514E-25,0,0,0,0,null,670,1.1870162669205144E-2,3.8054473244683744E-2,0,4.0209050657487478E-26,0,0,0,0,null,670,9.1820808142657386E-6,2.9366999176932503E-5,0,0,0,0,0,0,null,670,1.366110237237304E-3,4.3727051246158334E-3,0,0,0,0,0,0]
[680,1.1823846976666335E-2,3.8391829809774486E-2,0,2.2041352666513778E-25,0,0,0,0,null,680,1.1823916659749054E-2,3.8335903436915876E-2,0,1.297140729837588E-25,0,0,0,0,null,680,9.1463090124863943E-6,2.9588245893058955E-5,0,0,0,0,0,0,null,680,1.3607880345020431E-3,4.405445630776059E-3,0,0,0,0,0,0]
[690,1.1776964302329555E-2,3.8655688081132594E-2,0,3.1922676689141883E-25,0,0,0,0,null,690,1.1777034886900555E-2,3.8602709630027744E-2,0,2.5771853255047428E-25,0,0,0,0,null,690,9.1100453079414527E-6,2.9798080956477191E-5,0,6.1733416280403076E-30,0,0,0,0,null,690,1.355392652038328E-3,4.4364932472159705E-3,0,1.0519803264668604E-26,0,0,0,0]
[700,1.1729510631953009E-2,3.8905420033067115E-2,0,4.0965487708875682E-25,0,0,0,0,null,700,1.172958202498571E-2,3.8855305492289618E-2,0,4.1791607779616228E-25,0,0,0,0,null,700,9.0733397373462125E-6,2.9996825853029756E-5,0,1.0538850080845365E-28,0,0,0,0,null,700,1.349931533894343E-3,4.4658957311945486E-3,0,2.839820705750957E-26,0,0,0,0]
[710,1.1681545777434205E-2,3.9141431269697373E-2,0,4.6269786911872436E-25,0,0,0,0,null,710,1.1681617892875673E-2,3.9094098042532534E-2,0,5.9110892657743831E-25,0,0,0,0,null,710,9.0362385808561832E-6,3.0184797037144768E-5,0,2.5918715896181607E-28,0,0,0,0,null,710,1.3444115652542681E-3,4.4937000857071668E-3,0,5.3100591465248728E-26,0,0,0,0]
[720,1.1633125067221124E-2,3.9364120258285555E-2,0,4.3968786193667937E-25,0,0,0,4.152107214134872E-27,null,720,1.1633197825466884E-2,3.9319487238052217E-2,0,7.4201805515111236E-25,0,0,0,3.6333555452255807E-27,null,720,8.9987846495058098E-6,3.036230559380645E-5,0,4.671116139512741E-28,0,0,0,2.1979666155322756E-30,null,720,1.3388391151897255E-3,4.5199525101614884E-3,0,8.3069874759827606E-26,0,0,0,3.5758253519091131E-28]
[730,1.1584299688153015E-2,3.9573878005563584E-2,0,2.9536127168719448E-25,0,0,0,1.17402874525793E-26,null,730,1.1584373015558152E-2,3.9531865636741645E-2,0,8.1809817989169622E-25,0,0,0,1.1148949071231491E-26,null,730,8.9610175496884458E-6,3.0529656960109481E-5,0,7.1429388140138577E-28,0,0,0,7.9103001171194057E-30,null,730,1.3332200760166814E-3,4.5446983598082342E-3,0,1.1435606696122391E-25,0,0,0,1.2128246386827479E-27]
[740,1.1535117000195858E-2,3.9771087798313849E-2,0,0,0,6.4481554933086584E-25,0,2.2358367913127194E-26,null,740,1.1535190828607969E-2,3.9731618125102931E-2,0,7.5155298911838579E-25,0,0,0,2.179102248702093E-26,null,740,8.9229739266922068E-6,3.0687150699731509E-5,0,9.6619258440103701E-28,0,0,0,1.6148102664808047E-29,null,740,1.3275598995195895E-3,4.5679821129534304E-3,0,1.4012217763478843E-25,0,0,0,2.4386050336656512E-27]
[750,1.1485620826468953E-2,3.9956125000710371E-2,0,0,0,2.8916260807536962E-24,0,3.5662529321138504E-26,null,750,1.1485695092836179E-2,3.9919121704496574E-2,0,4.655557835029306E-25,0,1.5542644134530459E-24,0,3.527507418356856E-26,null,750,8.8846876891276872E-6,3.0835080324186944E-5,0,1.1649943263931528E-27,0,0,0,2.6762206762173452E-29,null,750,1.3218636303463907E-3,4.5898473450352159E-3,0,1.5053742164221199E-25,0,0,0,4.0091750130684528E-27]
[760,1.1435851720235366E-2,4.0129356901880374E-2,0,0,0,5.8263357301783574E-24,0,5.0503780401469938E-26,null,760,1.1435926366198687E-2,4.0094745328875456E-2,0,0,0,4.6085025262719234E-24,0,5.0512448268805671E-26,null,760,8.8461902155113393E-6,3.097373315549852E-5,0,1.2292547732875686E-27,0,1.4345817076713697E-27,0,3.8984416915136245E-29,null,760,1.3161359367366583E-3,4.6103367087889594E-3,0,1.3325759545657623E-25,0,3.318062289418439E-25,0,5.8065001042973628E-27]
[770,1.1385847211193068E-2,4.0291142607713194E-2,0,0,0,9.290099547717314E-24,0,6.4709724467387765E-26,null,770,1.1385922182740005E-2,4.025884978796445E-2,0,0,0,8.4582296100843939E-24,0,6.5380115816889043E-26,null,770,8.8075105448439304E-6,3.1103390225374038E-5,0,1.0583220888241226E-27,0,4.5765783027050041E-27,0,5.1235599926607527E-29,null,770,1.3103811388725502E-3,4.6294919197741565E-3,0,7.4651409919293184E-26,0,7.9809529859890581E-25,0,7.5923912003350598E-27]
[780,1.1335642032334654E-2,4.044183297162824E-2,0,0,0,1.297878580906872E-23,0,7.4955011647847004E-26,null,780,1.1335717279483983E-2,4.0411787630425654E-2,0,0,0,1.2849583852310174E-23,0,7.6575752373846078E-26,null,780,8.7686755521181381E-6,3.1224326206619447E-5,0,5.4272966902862853E-28,0,8.5494773736672845E-27,0,6.0995471989158969E-29,null,780,1.3046032350003058E-3,4.6473537466290866E-3,0,0,0,1.3672725202770591E-24,0,8.9900343315316536E-27]
[790,1.1285268329213496E-2,4.058177055952631E-2,0,0,0,1.6436470522716628E-23,0,7.6782416875104921E-26,null,790,1.1285343805709294E-2,4.0553903122138454E-2,0,0,0,1.7347353007713768E-23,0,7.9621569066296093E-26,null,790,8.7297101103075992E-6,3.1336809372789357E-5,0,0,0,1.3095646836267587E-26,0,6.4784851612564537E-29,null,790,1.2988059255145733E-3,4.6639620054763596E-3,0,0,0,1.9958885874957573E-24,0,9.4823907478527455E-27]
[800,1.1234755852936427E-2,4.0711289644726339E-2,0,0,0,1.9067889602891494E-23,0,6.4833329352882708E-26,null,800,1.1234831515962579E-2,4.0685532235302142E-2,0,0,0,2.1335398836425686E-23,0,6.9078058863980308E-26,null,800,8.6906372396185335E-6,3.1441101582715173E-5,0,0,0,1.7772064254821352E-26,0,5.8310422561605306E-29,null,800,1.2929926351758175E-3,4.6793555579758058E-3,0,0,0,2.61500369514997E-24,0,8.434777935955745E-27]
[810,1.1184132138307575E-2,4.0830716229051829E-2,0,0,0,2.017278701164861E-23,0,3.3332395353275196E-26,null,810,1.1184207948238319E-2,4.0807002664431997E-2,0,0,0,2.4041619510221446E-23,0,3.9015470697864341E-26,null,810,8.6514782454090092E-6,3.1537458286699706E-5,0,0,0,2.195115555013211E-26,0,3.6812605004939559E-29,null,810,1.2871665336205743E-3,4.6935723125578433E-3,0,0,0,3.1313849172870335E-24,0,5.14749171631359E-27]
[820,1.1133422668109861E-2,4.0940368086729614E-2,0,0,0,1.9002862823166587E-23,0,0,null,820,1.1133498588275623E-2,4.0918633865838869E-2,0,0,0,2.4589946222367696E-23,0,0,null,820,8.6122528452318952E-6,3.1626128551708224E-5,0,0,0,2.4846670124339271E-26,0,0,null,820,1.2813305542648283E-3,4.7066492284395071E-3,0,0,0,3.4322599296044731E-24,0,0]
[830,1.1082651024858977E-2,4.1040554828006219E-2,0,0,0,1.4839367685334677E-23,0,0,null,830,1.1082727021335372E-2,4.102073711742369E-2,0,0,0,2.2078927744767883E-23,0,0,null,830,8.5729792863047662E-6,3.1707355102941721E-5,0,0,0,2.5566982695787648E-26,0,0,null,830,1.2754874117840817E-3,4.7186223220500824E-3,0,0,0,3.3938267712454335E-24,0,0]
[840,1.1031839030906284E-2,4.1131577979830525E-2,0,0,0,7.086592395596212E-24,0,0,null,840,1.1031915072277651E-2,4.1113615596014307E-2,0,0,0,1.5683147585366222E-23,0,0,null,840,8.5336744539260625E-6,3.1781374379701047E-5,0,0,0,2.3195195311556838E-26,0,0,null,840,1.2696396182298301E-3,4.7295266755392213E-3,0,0,0,2.8932882831844485E-24,0,0]
[850,1.0981006877850601E-2,4.1213731081201153E-2,0,6.1794171276735993E-25,0,0,0,0,null,850,1.0981082935073437E-2,4.1197564469956351E-2,0,0,0,4.7704090412099832E-24,0,0,null,850,8.4943539715573218E-6,3.1848416603495879E-5,0,0,0,1.6892052340100264E-26,0,0,null,850,1.2637894979373988E-3,4.739396447086406E-3,0,0,0,1.8237176057426869E-24,0,0]
[860,1.09301732461106E-2,4.128729979099497E-2,0,5.868119032338632E-24,0,0,0,0,null,860,1.0930249292299099E-2,4.1272871004462391E-2,0,0,0,0,0,0,null,860,8.4550322933923741E-6,3.1908705856674427E-5,0,0,0,6.0143531637097031E-27,0,0,null,860,1.2579392012803206E-3,4.7482648827504954E-3,0,0,0,1.10620388568305E-25,0,0]
[870,1.0879355415416707E-2,4.1352562006365931E-2,0,1.2734132087440057E-23,0,0,0,0,null,870,1.087943142572609E-2,4.1339814678033625E-2,0,1.7813984230013551E-24,0,0,0,0,null,870,8.415722789833683E-6,3.1962460169920157E-5,0,0,0,0,0,0,null,870,1.2520907173964621E-3,4.7561643296103913E-3,0,0,0,0,0,0]
[880,1.0828569366969047E-2,4.1409787990038208E-2,0,2.1021163759587433E-23,0,0,0,0,null,880,1.0828645318394815E-2,4.139866730803686E-2,0,1.0639039250130565E-23,0,0,0,0,null,880,8.376437826538556E-6,3.2009891617345207E-5,0,0,0,0,0,0,null,880,1.2462458859474961E-3,4.7631262500206122E-3,0,0,0,0,0,0]
[890,1.0777829877850661E-2,4.1459240504979941E-2,0,3.0302339062858345E-23,0,0,0,0,null,890,1.0777905749159492E-2,4.1449693183958532E-2,0,2.2036293197704797E-23,0,0,0,0,null,890,8.3371888374701038E-6,3.2051206417851794E-5,0,0,0,0,0,0,null,890,1.240406407982182E-3,4.7691812367773442E-3,0,3.7355055833476731E-25,0,0,0,0]
[900,1.0727150608519864E-2,4.1501174955127181E-2,0,3.9895509058648138E-23,0,0,1.6863645436818073E-40,0,null,900,1.072722638004592E-2,4.1493149207023634E-2,0,3.5591436170178038E-23,0,0,1.1070012037946351E-40,0,null,900,8.297986392588686E-6,3.2086605041672495E-5,0,3.3186559017137829E-27,0,0,0,0,null,900,1.2345738560145757E-3,4.774359029048143E-3,0,1.961499267893482E-24,0,0,0,0]
[910,1.0676544183495038E-2,4.1535839530817589E-2,0,4.8860824508425034E-23,0,0,2.6334400815927357E-40,0,null,910,1.0676619837106405E-2,4.1529285034692949E-2,0,5.0549829433149245E-23,0,0,2.6012877747105704E-40,0,null,910,8.258840260309197E-6,3.211628232106563E-5,0,1.6283426305847185E-26,0,0,0,0,null,910,1.2287496833083553E-3,4.778688528887666E-3,0,3.9889790796819691E-24,0,0,0,0]
[920,1.0626022266224514E-2,4.1563475358125455E-2,0,5.6023771380737637E-23,0,0,3.0858203584930539E-40,0,null,920,1.0626097785138117E-2,4.155834322933305E-2,0,6.5756654643893429E-23,0,0,4.3678212028557525E-40,0,null,920,8.2197594654138962E-6,3.214042756440478E-5,0,3.2782412332865386E-26,0,0,0,0,null,920,1.2229352324910181E-3,4.7821978182668E-3,0,6.3847151606640057E-24,0,0,0,0]
[930,1.0575595628312572E-2,4.1584316651043104E-2,0,6.0026638554068687E-23,0,0,2.1419483332387517E-40,0,null,930,1.0575670997054087E-2,4.1580559409855992E-2,0,7.9664188010786528E-23,0,0,5.5345412050222116E-40,0,null,930,8.1807523426125706E-6,3.2159224672830784E-5,0,5.2231501782072402E-26,0,0,0,0,null,930,1.2171317435333002E-3,4.7849141764579467E-3,0,9.0129034707797936E-24,0,0,0,0]
[940,1.0525274213589361E-2,4.1598590865512368E-2,0,5.9409169647480348E-23,0,0,0,2.1832877220822649E-25,null,940,1.0525349417867057E-2,4.1596162405415214E-2,0,9.0379929807977444E-23,0,0,4.5691833793160232E-40,1.4816590139741109E-25,null,940,8.1418265861275193E-6,3.2172852258650862E-5,0,7.3529836449992988E-26,0,0,0,3.0876851559280835E-29,null,940,1.211340361115656E-3,4.7868640976771269E-3,0,1.1669196710314045E-23,0,0,1.0239285186803034E-40,8.7915117990383681E-27]
[950,1.0475067197540855E-2,4.1606518854964657E-2,0,5.271657745057689E-23,0,0,0,1.035856612910357E-24,null,950,1.0475142224181428E-2,4.160537441071134E-2,0,9.575896396261307E-23,0,0,0,9.6326983327909452E-25,null,950,8.1029892956664353E-6,3.2181483765235589E-5,0,9.5028803670066001E-26,0,0,0,6.5737331751899049E-28,null,950,1.2055621414724536E-3,4.7880733089341061E-3,0,1.4082701607231979E-23,0,0,0,1.0222540540576932E-25]
[960,1.0424983042226344E-2,4.1608315026323679E-2,0,3.8630377025320084E-23,0,0,0,2.073766374488044E-24,null,960,1.042505787905597E-2,4.1608411141940596E-2,0,9.3540283639553955E-23,0,0,0,2.0055714058707571E-24,null,960,8.0642470189321046E-6,3.2185287587443454E-5,0,1.1454892431030223E-25,0,0,0,1.4674785694223952E-27,null,960,1.1997980587153071E-3,4.7885667879588312E-3,0,1.5924994417136694E-23,0,0,0,2.2258785172809112E-25]
[970,1.0375029547251946E-2,4.160418749619442E-2,0,1.6114854668004329E-23,0,0,0,3.3077870748356665E-24,null,970,1.0375104183086733E-2,4.1605481992976451E-2,0,8.1522764817590736E-23,0,0,0,3.2526233732747513E-24,null,970,8.0256057910628331E-6,3.2184427192450036E-5,0,1.2945256131050076E-25,0,0,0,2.4460582080517007E-27,null,970,1.194049010696944E-3,4.7883687811845219E-3,0,1.682664535752433E-23,0,0,0,3.6751433547137757E-25]
[980,1.0325213896965566E-2,4.1594338246607528E-2,0,0,0,2.7491604926202645E-23,0,4.6877038084258979E-24,null,980,1.032528832148402E-2,4.1596790191251676E-2,0,5.7772339079839026E-23,0,0,0,4.6557383375386208E-24,null,980,7.9870711711024112E-6,3.2179061240446543E-5,0,1.3677628570304065E-25,0,0,0,3.5573599043014695E-27,null,980,1.1883158244464611E-3,4.7875028216918438E-3,0,1.6401115107815162E-23,0,0,0,5.3158818869063552E-25]
[990,1.0275542704333266E-2,4.1578963279997438E-2,0,0,0,1.1376533048646007E-22,0,6.1348209829752209E-24,null,990,1.0275616908060127E-2,4.1582532952915974E-2,0,2.0848072877275236E-23,0,6.2300720202111062E-23,0,6.1372393099949492E-24,null,990,7.94864827601779E-6,3.2169343704838946E-5,0,1.3342177054471585E-25,0,0,0,4.7426323505511898E-27,null,990,1.1825992612218622E-3,4.785991747089928E-3,0,1.4275196925522015E-23,0,0,0,7.0599909335226303E-25]
[1000,1.022602205129532E-2,4.1558252772788927E-2,0,0,0,2.151882837409538E-22,5.1534878555429912E-39,7.5412780537294944E-24,null,1000,1.0226096025508571E-2,4.1562901636730723E-2,0,0,0,1.7021272714351509E-22,0,7.5895631692584515E-24,null,1000,7.9103418119033315E-6,3.2155423991598375E-5,0,1.1639862598761391E-25,0,5.4303256269118501E-26,0,5.9191750977343488E-27,null,1000,1.1769000211513852E-3,4.783857717257132E-3,0,1.0124484607689557E-23,0,1.2444976275736123E-23,0,8.7841464928520378E-25]
[]
[]
["Saved  27/02/2023: 14:41:25  Level Number: 5"]
[]
["BREAKTHROUGH RESULTS"]
[]
["Advanced"]
["Pollutant Linkage: Inert Restorati, Attenution Layer, Beenham Grange Formation",null,null,null,null,null,null,null,null,null,"Pollutant Linkage: Inert Restorati, Attenution Layer, Beenham Grange Formation, Groundwater ",null,null,null,null,null,null,null,null,null,"Pollutant Linkage: Inert Restorati, Attenution Layer, Beenham Grange Formation, River Enborne",null,null,null,null,null,null,null,null,null,"Pollutant Linkage: Inert Restorati, Attenution Layer, Beenham Grange Formation, Spring Ditch"]
["Concentrations in mg/L in Beenham Grange Formation",null,null,null,null,null,null,null,null,null,"Concentrations in mg/L in Groundwater ",null,null,null,null,null,null,null,null,null,"Concentrations in mg/L in River Enborne",null,null,null,null,null,null,null,null,null,"Concentrations in mg/L in Spring Ditch"]
[]
["Compared with EAL (GW) target concentration in mg/L",null,null,null,null,null,null,null,null,null,"No target concentrations specified for comparison",null,null,null,null,null,null,null,null,null,"Compared with EAL (River Enborne) target concentration in mg/L",null,null,null,null,null,null,null,null,null,"Compared with EAL (Spring Ditch) target concentration in mg/L"]
[null,0.26600000000000001,4.8199999999999993E-2,1E-3,4.3649999999999991E-3,2.0000000000000002E-5,2E-3,2.0000000000000001E-4,1E-3,null,null,null,null,null,null,null,null,null,null,null,null,0.26600000000000001,2.76E-2,4.7000000000000002E-3,2.8000000000000001E-2,5.0000000000000001E-4,1.75E-3,1.1999999999999999E-3,1E-3,null,null,0.26600000000000001,0.03,4.7000000000000002E-3,2.8000000000000001E-2,5.0000000000000001E-4,1.5E-3,1.1999999999999999E-3,5.0000000000000001E-3]
[]
["Time(years)","Species1","Species2","Species3","Species4","Species5","Species6","Species7","Species8",null,"Time(years)","Species1","Species2","Species3","Species4","Species5","Species6","Species7","Species8",null,"Time(years)","Species1","Species2","Species3","Species4","Species5","Species6","Species7","Species8",null,"Time(years)","Species1","Species2","Species3","Species4","Species5","Species6","Species7","Species8"]
[null,"Ammoniacal Nitrogen","Barium","Total Chromiun","Copper","Mercury","Molybdenum","Lead","Antimony",null,null,"Ammoniacal Nitrogen","Barium","Total Chromiun","Copper","Mercury","Molybdenum","Lead","Antimony",null,null,"Ammoniacal Nitrogen","Barium","Total Chromiun","Copper","Mercury","Molybdenum","Lead","Antimony",null,null,"Ammoniacal Nitrogen","Barium","Total Chromiun","Copper","Mercury","Molybdenum","Lead","Antimony"]
[10,1.5971076978511836E-12,1.9592882057883589E-22,0,0,0,0,0,0,null,10,1.5421941182368864E-12,0,0,0,0,0,0,0,null,10,1.1322049814174945E-15,4.2947608655767881E-26,0,0,0,0,0,0,null,10,1.7140472199286931E-13,2.1454872483302177E-24,0,0,0,0,0,0]
[20,2.0793731263382399E-7,1.514522300131767E-15,0,0,0,0,0,0,null,20,2.0609962470733467E-7,9.8414838193386251E-17,0,0,0,0,0,0,null,20,1.5731678858711293E-10,2.7141082008489792E-21,0,0,0,0,0,0,null,20,2.3509779450370226E-8,1.3469212170529802E-18,0,0,0,0,0,0]
[30,1.1034568439612781E-5,5.9553996920910681E-11,0,0,0,0,0,0,null,30,1.0990737887735778E-5,1.527668104815454E-11,0,0,0,0,0,0,null,30,8.4511053228842374E-9,2.026682266119852E-15,0,0,0,0,0,0,null,30,1.2598656687105035E-6,5.2655529996755895E-13,0,0,0,0,0,0]
[40,8.1508033502182914E-5,1.2168553082699859E-8,0,0,0,0,0,0,null,40,8.1324882738976312E-5,5.46517401321152E-9,0,0,0,0,0,0,null,40,6.2695714147434928E-8,1.3796354840328518E-12,0,0,0,0,0,0,null,40,9.3384028957929163E-6,2.9495339401679764E-10,0,0,0,0,0,0]
[50,2.7162932263881373E-4,3.0073506393203505E-7,0,0,0,0,0,0,null,50,2.7123795568040441E-4,1.7812487323242394E-7,0,0,0,0,0,0,null,50,2.0935886099683981E-7,6.4165196876408821E-11,0,0,0,0,0,0,null,50,3.1170987982515597E-5,1.2273490793952907E-8,0,0,0,0,0,0]
[60,6.0607604392679492E-4,2.5744265005620261E-6,0,0,0,0,0,0,null,60,6.0547037699042823E-4,1.7813760213223917E-6,0,0,0,0,0,0,null,60,4.6765105130272194E-7,7.949137692768193E-10,0,0,0,0,0,0,null,60,6.9612153445574915E-5,1.4196169178064071E-7,0,0,0,0,0,0]
[70,1.0735228512342055E-3,1.1997461551384742E-5,0,0,0,0,0,0,null,70,1.072737812573826E-3,9.1347891314368461E-6,0,0,0,0,0,0,null,70,8.28891106413946E-7,4.6766456535406571E-9,0,0,0,0,0,0,null,70,1.2336794426748613E-4,7.9859471336750478E-7,0,0,0,0,0,0]
[80,1.644514474433492E-3,3.8181386145270564E-5,0,0,0,0,0,0,null,80,1.6435996995420427E-3,3.0957200636097182E-5,0,0,0,0,0,0,null,80,1.2703228040342083E-6,1.7388821510174244E-8,0,0,0,0,0,0,null,80,1.890518291135969E-4,2.879919858584127E-6,0,0,0,0,0,0]
[90,2.285589878777609E-3,9.4145427487976849E-5,0,0,0,0,0,0,null,90,2.284594143083212E-3,7.9724599668805387E-5,0,0,0,0,0,0,null,90,1.7660611846068298E-6,4.7799610427254138E-8,0,0,0,0,0,0,null,90,2.6281267945855552E-4,7.7468252997320072E-6,0,0,0,0,0,0]
[100,2.966449207171787E-3,1.9405069265059766E-4,0,0,0,0,0,0,null,100,2.9654138374854478E-3,1.6955262841302751E-4,0,0,0,0,0,0,null,100,2.2926538150182738E-6,1.0659795050562322E-7,0,0,0,0,0,0,null,100,3.411616595440455E-4,1.700456894023787E-5,0,0,0,0,0,0]
[110,3.6624976411763679E-3,3.5094715392666764E-4,0,0,0,0,0,0,null,110,3.6614548984028115E-3,3.1386528648373266E-4,0,0,0,0,0,0,null,110,2.8310581800580097E-6,2.0446744653597021E-7,0,0,0,0,0,0,null,110,4.2126613688801227E-4,3.2230685590616716E-5,0,0,0,0,0,0]
[120,4.3550678147952805E-3,5.7523016667495295E-4,0,0,0,0,0,0,null,120,4.35404150734692E-3,5.2368210566945456E-4,0,0,0,0,0,0,null,120,3.3668180466249283E-6,3.5058476589622754E-7,0,0,0,0,0,0,null,120,5.0097579310463792E-4,5.4759778034065995E-5,0,0,0,0,0,0]
[130,5.0306954130721095E-3,8.7392574503471925E-4,0,0,0,0,0,0,null,130,5.0297022870654127E-3,8.0674176012729502E-4,0,0,0,0,0,0,null,130,3.8895046177182178E-6,5.5174517273653338E-7,0,0,0,0,0,0,null,130,5.7873943366228034E-4,8.5563259478592198E-5,0,0,0,0,0,0]
[140,5.6801313262911076E-3,1.2506281536280228E-3,0,0,0,0,0,0,null,140,5.6791825616559185E-3,1.167324930827452E-3,0,0,0,0,0,0,null,140,4.3919526038196922E-6,8.1207426869929596E-7,0,0,0,0,0,0,null,140,6.5349132406287709E-4,1.2521431057861343E-4,0,0,0,0,0,0]
[150,6.2973874622400967E-3,1.705843454469344E-3,0,0,0,0,0,0,null,150,6.2964900079692547E-3,1.6065327371765992E-3,0,0,0,0,0,0,null,150,4.8695218133954017E-6,1.1331509591399841E-6,0,0,0,0,0,0,null,150,7.2454133816840115E-4,1.7391110456695656E-4,0,0,0,0,0,0]
[160,6.8789227074419774E-3,2.23752960938336E-3,0,0,0,0,0,0,null,160,6.8780803786296805E-3,2.1227997772582568E-3,0,0,0,0,0,0,null,160,5.3194670038013248E-6,1.5143607368313742E-6,0,0,0,0,0,0,null,160,7.9148121803295239E-4,2.315317907214146E-4,0,0,0,0,0,0]
[170,7.4229896580184857E-3,2.8416893241840517E-3,0,0,0,0,0,0,null,170,7.4222039979847379E-3,2.7124843632590403E-3,0,0,0,0,0,0,null,170,5.7404320995778592E-6,1.9533417492790903E-6,0,0,0,0,0,0,null,170,8.5410933699093259E-4,2.9770154645884713E-4,0,0,0,0,0,0]
[180,7.9291282953363549E-3,3.5129310837011024E-3,0,0,0,0,0,0,null,180,7.9283992352803343E-3,3.3704404146876268E-3,0,0,0,0,0,0,null,180,6.1320581405635042E-6,2.4464358717580697E-6,0,0,0,0,0,0,null,180,9.1237238165561992E-4,3.7185934660440424E-4,0,0,0,0,0,0]
[190,8.3977820217945483E-3,4.2449567699462832E-3,0,0,0,0,0,0,null,190,8.3971083767324928E-3,4.0905219044039655E-3,0,0,0,0,0,0,null,190,6.4946859549560015E-6,2.9890968789830667E-6,0,0,0,0,0,0,null,190,9.6632112490865798E-4,4.5331783897254938E-4,0,0,0,0,0,0]
[200,8.8300108250256477E-3,5.0309615673169638E-3,0,0,0,0,0,0,null,200,8.8293906619043884E-3,4.8660010065052937E-3,0,0,0,0,0,0,null,200,6.8291340341475641E-6,3.5762348826855117E-6,0,0,0,0,0,0,null,200,1.0160773853777742E-3,5.4131355709316519E-4,0,0,0,0,0,0]
[210,9.2272794590234752E-3,5.863947413886122E-3,0,0,0,0,0,0,null,210,9.2267103670920329E-3,5.689898735305959E-3,0,0,0,0,0,0,null,210,7.1365344940607358E-6,4.2024925723125617E-6,0,0,0,0,0,0,null,210,1.0618096273183866E-3,6.3504699522300135E-4,0,0,0,0,0,0]
[220,9.5913026016943067E-3,6.7369590025418598E-3,0,0,0,0,0,0,null,220,9.5907818891126876E-3,6.555235941587639E-3,0,0,0,0,0,0,null,220,7.4182131561982924E-6,4.86245761239563E-6,0,0,0,0,0,0,null,220,1.1037151232661242E-3,7.3371328824357754E-4,0,0,0,0,0,0]
[230,9.9239328208002801E-3,7.643254328664844E-3,0,0,0,3.3538597087754569E-40,0,0,null,230,9.9234576560632507E-3,7.4552163089550661E-3,0,0,0,2.1657358324548515E-40,0,0,null,230,7.6756027784825559E-6,5.5508195560983927E-6,0,0,0,0,0,0,null,230,1.1420070476590271E-3,8.3652477751232888E-4,0,0,0,0,0,0]
[240,1.0227080464544196E-2,8.5764221136639777E-3,0,0,0,0,0,0,null,240,1.0226647976883569E-2,8.3833537479100495E-3,0,0,0,8.5438057240627883E-40,0,0,null,240,7.91018100835089E-6,6.2624808209937222E-6,0,0,0,0,0,0,null,240,1.1769052478343243E-3,9.4272688792138178E-4,0,0,0,1.86092568670234E-40,0,0]
[250,1.050265722687071E-2,9.530457427231312E-3,0,0,0,0,0,0,null,250,1.0502264576308408E-2,9.3335557787034909E-3,0,0,0,0,0,0,null,250,8.1234266697668648E-6,6.9926309492532096E-6,0,0,0,0,0,0,null,250,1.2086297421369573E-3,1.051608676853026E-3,0,0,0,0,0,0]
[260,1.0752537185553183E-2,1.049980526861718E-2,0,3.4671294311057285E-40,0,7.4443487305188611E-38,0,0,null,260,1.0752181610620299E-2,1.0300173003035514E-2,0,0,0,2.4450822834869729E-38,0,0,null,260,8.316789581544554E-6,7.7367923426975161E-6,0,0,0,0,0,0,null,260,1.2373962307638132E-3,1.1625092553270088E-3,0,0,0,0,0,0]
[270,1.097853067496495E-2,1.1479380183162129E-2,0,1.1632390343237601E-39,0,4.8494213259654691E-37,0,0,null,270,1.0978209524048283E-2,1.1278023083153014E-2,0,4.8602831826397746E-40,0,3.1447937242498113E-37,0,0,null,270,8.4916703153267255E-6,8.4908443855976669E-6,0,0,0,1.0653149078468338E-40,0,0,null,270,1.2634130850883755E-3,1.2748210899509464E-3,0,0,0,2.3883003245970862E-38,0,0]
[280,1.1182367536708711E-2,1.246456840584521E-2,0,0,0,3.2695430609387298E-36,0,0,null,280,1.1182078287479037E-2,1.2262396031545783E-2,0,6.7185012084461575E-39,0,1.404313357070496E-36,0,0,null,280,8.6494072162770387E-6,9.2510315921123914E-6,0,0,0,6.7989923676299578E-40,0,0,null,280,1.2868794172799507E-3,1.3879910055339044E-3,0,1.480821629783114E-40,0,1.0925778143004936E-37,0,0]
[290,1.136568717775863E-2,1.3451217635285543E-2,0,4.3437733982535121E-39,0,2.3603513075191038E-35,0,1.126965080953565E-40,null,290,1.1365427447976438E-2,1.3249046182168456E-2,0,0,0,1.0697022130402569E-35,0,1.0942237159128122E-40,null,290,8.7912686960150831E-6,1.0013960259582078E-5,0,0,0,2.5269549230299603E-39,0,0,null,290,1.3079839341407459E-3,1.5015195385678511E-3,0,1.6314161028064564E-39,0,5.3206947690543895E-37,0,0]
[300,1.153003352852134E-2,1.4435618377137003E-2,0,2.3706295919597702E-37,0,1.2950723588234238E-34,0,1.3375785558203552E-40,null,300,1.1529801080679157E-2,1.4234175003558966E-2,0,0,0,7.2742884135274906E-35,0,1.8470783423161291E-40,null,300,8.9184493205584871E-6,1.0776587119066783E-5,0,0,0,2.071335288919922E-38,0,0,null,300,1.3269043554217476E-3,1.6149591471533269E-3,0,0,0,4.3919017813326912E-36,0,0]
[310,1.1676853487562359E-2,1.5414479847400516E-2,0,1.2092053065617258E-36,0,5.4960931568909076E-34,0,0,null,310,1.1676646229163617E-2,1.5214407923035302E-2,0,3.5487568272378072E-37,0,3.5013681721971731E-34,0,0,null,310,9.0320685988328478E-6,1.1536202656666433E-5,0,0,0,1.324725411801999E-37,0,0,null,310,1.3438072338291314E-3,1.7279116638267648E-3,0,0,0,2.5245232280045601E-35,0,0]
[320,1.1807497808292758E-2,1.6384902670068854E-2,0,6.0366374525951906E-36,0,1.9111121408443181E-33,0,5.432495265624217E-40,null,320,1.1807313789114019E-2,1.6186767537816758E-2,0,2.0274820795228709E-36,0,1.333706203583494E-33,0,0,null,320,9.1331716627088691E-6,1.2290411120203164E-5,0,0,0,5.8159443002576403E-37,0,0,null,320,1.3588480563736507E-3,1.8400252819929025E-3,0,6.0822440578624524E-38,0,1.0481168908281819E-34,0,0]
[330,1.1923223657251009E-2,1.734435001050507E-2,0,3.4812342702036755E-35,0,5.4047082182091037E-33,0,3.1475614361246003E-38,null,330,1.1923061064570967E-2,1.7148644964763603E-2,0,5.7862842421412405E-36,0,4.254229840777919E-33,0,2.857913752257053E-38,null,330,9.2227312419978098E-6,1.3037108704744586E-5,0,1.8311729017714393E-39,0,2.0505610917899646E-36,0,0,null,330,1.3721715383286646E-3,1.950991291078102E-3,0,4.2102065611053629E-37,0,3.5917538182978315E-34,0,2.9645656068241789E-39]
[340,1.202519827809284E-2,1.8290618327098718E-2,0,1.7076080014367429E-34,0,1.1379483036970457E-32,0,1.4835592805707973E-37,null,340,1.2025055430599684E-2,1.8097770596210344E-2,0,3.111877634499488E-35,0,1.0925274864629809E-32,0,1.3890139432487151E-37,null,340,9.3016504961290838E-6,1.3774461004456273E-5,0,6.0505400897285474E-39,0,6.172915493626907E-36,0,0,null,340,1.3839120446050893E-3,2.0605407167168083E-3,0,1.0775339952628541E-36,0,1.0397721674125642E-33,0,1.5065374467074959E-38]
[350,1.2114503347578838E-2,1.9221808572804432E-2,0,6.7329782069280863E-34,0,1.2247581712918256E-32,0,6.03065935370926E-37,null,350,1.2114378688506816E-2,1.9032185158168492E-2,0,1.8559036414539414E-34,0,1.9546412823461936E-32,0,5.438458630641315E-37,null,350,9.3707663821536547E-6,1.4500880505886153E-5,0,1.7026198880842065E-38,0,1.5008599618708775E-35,0,3.6434539282923162E-40,null,350,1.3941940908878529E-3,2.1684409770934498E-3,0,4.5730427042289597E-36,0,2.3433421027162201E-33,0,5.6773153720814555E-38]
[360,1.2192139723142936E-2,2.0136298412682819E-2,0,2.2326889177780984E-33,0,0,0,2.9289770080601176E-36,null,360,1.2192031812987976E-2,1.9950211685727887E-2,0,8.0542690079241108E-34,0,9.380569996996195E-33,0,2.6235131008521705E-36,null,360,9.4308533263605236E-6,1.5215004660101687E-5,0,9.6460393392822891E-38,0,2.461106685357558E-35,0,1.7180391765794059E-39,null,360,1.4031328899263042E-3,2.2744926322211148E-3,0,2.7885900353444777E-35,0,3.18236178225258E-33,0,2.7023552482532191E-37]
[370,1.2259032365974257E-2,2.103271582496043E-2,0,6.4027734770385643E-33,0,0,0,1.3467364132619845E-35,null,370,1.225893987507827E-2,2.0850428819456292E-2,0,2.7455273136446111E-33,0,0,0,1.2317074084746383E-35,null,370,9.4826270322105811E-6,1.5915674892248873E-5,0,5.0571118636945681E-37,0,4.368036291989274E-36,0,8.3122394191485624E-39,null,370,1.4108349180871065E-3,2.3785262771270333E-3,0,1.2586957658991764E-34,0,0,0,1.2947166482095936E-36]
[380,1.2316035286138834E-2,2.1909914306216256E-2,0,1.5677073697935498E-32,0,0,0,5.1668607627623314E-35,null,380,1.2315956987335945E-2,2.1731645670096916E-2,0,8.0784747404596175E-33,0,0,0,4.8137830996801893E-35,null,380,9.5267483056682641E-6,1.6601916773974504E-5,0,1.9380157590859459E-36,0,0,0,3.3446413243940771E-38,null,380,1.4173984844845545E-3,2.480399610725958E-3,0,4.309513913863675E-34,0,0,0,5.1582840693695898E-36]
[390,1.2363936402736154E-2,2.2766949794174873E-2,0,3.0921424418724311E-32,0,0,0,1.6797451787691608E-34,null,390,1.2363871164183509E-2,2.2592878384398021E-2,0,2.1109135913040662E-32,0,0,0,1.584393025393367E-34,null,390,9.5638268150774461E-6,1.727292148634481E-5,0,5.965582859069711E-36,0,0,0,1.1219581118300375E-37,null,390,1.4229142903679449E-3,2.5799946980868665E-3,0,1.2474964958032596E-33,0,0,0,1.7192794977834758E-35]
[400,1.2403462246524033E-2,2.3603059344707508E-2,0,4.1011645666857537E-32,0,0,0,4.7908295393380001E-34,null,400,1.2403409024810972E-2,2.3433328462460233E-2,0,4.7218283902584895E-32,0,0,0,4.5635485112035353E-34,null,400,9.5944247293487525E-6,1.7928028630060679E-5,0,1.6092420920812691E-35,0,0,0,3.2777411587547792E-37,null,400,1.4274659703952409E-3,2.677215433620643E-3,0,3.2314302699467386E-33,0,0,0,4.9994299796366654E-35]
[410,1.2435282457614119E-2,2.4417641545594383E-2,0,0,0,0,0,1.2141938389789679E-33,null,410,1.2435240291202387E-2,2.4252362818745505E-2,0,8.2098244665930141E-32,0,0,0,1.1694355317910606E-33,null,410,9.619060197721752E-6,1.8566710389391465E-5,0,3.9009450822786637E-35,0,0,0,8.5299254339132678E-37,null,410,1.4311306103356642E-3,2.7719852054953163E-3,0,7.3851770229334265E-33,0,0,0,1.294564646576477E-34]
[420,1.2460014049595292E-2,2.5210238612783882E-2,0,0,0,2.113733481167809E-31,0,2.6933955903785601E-33,null,420,1.245998205261882E-2,2.5049495538914154E-2,0,7.9327913424929673E-32,0,0,0,2.6326635904970768E-33,null,420,9.6382106489360281E-6,1.9188557021346616E-5,0,8.1687531247192099E-35,0,0,0,1.9603873804667916E-36,null,420,1.4339792378995394E-3,2.8642447565981255E-3,0,1.3815241103748331E-32,0,0,0,2.9553619038064647E-34]
[430,1.2478225424669828E-2,2.5980520090740075E-2,0,0,0,1.4745764929840462E-29,0,4.9923997387291105E-33,null,430,1.2478202781119958E-2,2.5824371258222834E-2,0,0,0,4.7008490459485971E-30,0,4.9879834475905823E-33,null,430,9.6523158978049645E-6,1.9793263618155898E-5,0,1.328462654717179E-34,0,0,0,3.8289490484890228E-36,null,430,1.4360772849165301E-3,2.9539502340276045E-3,0,1.7301254280742987E-32,0,0,0,5.7158335894239185E-34]
[440,1.2490440134330824E-2,2.672826806380885E-2,0,0,0,4.9225685159135941E-29,0,6.8160111389556302E-33,null,440,1.2490426092619586E-2,2.6576750070805458E-2,0,0,0,3.2463660786135186E-29,0,7.1145635974967137E-33,null,440,9.6617810549858206E-6,2.0380618076297968E-5,0,1.123833336828728E-34,0,6.705737940754138E-33,0,5.7834315630003452E-36,null,440,1.4374850202261405E-3,3.0410714170041489E-3,0,0,0,1.827845612632203E-30,0,8.4784016294382927E-34]
[450,1.2497140386756098E-2,2.7453363777622725E-2,0,0,0,1.100597138122953E-28,0,2.959280775336841E-33,null,450,1.2497134254657637E-2,2.7306493870058273E-2,0,0,0,9.1326687937265044E-29,0,4.148256192104675E-33,null,450,9.6669792407809212E-6,2.095049019663704E-5,0,0,0,4.0519705383649646E-32,0,4.4500567841124639E-36,null,450,1.4382579534230415E-3,3.1255901118801177E-3,0,0,0,7.5570019836579128E-30,0,6.0322772342818324E-34]
[460,1.2498770307043654E-2,2.8155775566659227E-2,0,0,0,1.8884804395416656E-28,0,0,null,460,1.249877144699193E-2,2.8013554016517235E-2,0,0,0,1.8538278979905251E-28,0,0,null,460,9.6682541077874881E-6,2.1502821836179109E-5,0,0,0,1.1042816429766312E-31,0,0,null,460,1.4384472101494283E-3,3.2074987023837324E-3,0,0,0,1.8445249940175871E-29,0,0]
[470,1.2495738959466119E-2,2.8835547984505917E-2,0,0,0,2.4310457362458185E-28,0,0,null,470,1.2495746784211744E-2,2.8697960229497478E-2,0,0,0,2.9093372080216079E-28,0,0,null,470,9.6659221793477326E-6,2.2037618031005773E-5,0,0,0,2.1989653376590484E-31,0,0,null,470,1.4380998799991831E-3,3.2867988431359908E-3,0,0,0,3.4008154445219886E-29,0,0]
[480,1.2488423143038111E-2,2.9492792036290901E-2,0,0,0,1.7528598347265102E-28,0,0,null,480,1.2488437111620999E-2,2.9359810601194355E-2,0,0,0,3.2904241054528098E-28,0,0,null,480,9.6602750126914076E-6,2.2554939011352749E-5,0,0,0,3.3993591492752739E-31,0,0,null,480,1.4372593383259968E-3,3.3635002847106892E-3,0,0,0,4.8262663999425764E-29,0,0]
[490,1.2477169972877112E-2,3.0127676417128303E-2,0,1.7286350819448549E-29,0,0,0,0,null,490,1.2477189586928058E-2,2.9999262636121408E-2,0,0,0,1.4117286273049804E-28,0,0,null,490,9.651581196315502E-6,2.3054893032591425E-5,0,0,0,3.7887278328913564E-31,0,0,null,490,1.43596554339686E-3,3.4376198189491128E-3,0,0,0,4.5618952617503767E-29,0,0]
[500,1.246229926046801E-2,3.0740419665823724E-2,0,7.4872623192454208E-29,0,0,0,0,null,500,1.246232406077828E-2,3.0616525223966934E-2,0,0,0,0,0,0,null,500,9.6400881917448269E-6,2.3537629949749552E-5,0,0,0,1.5668567903748376E-31,0,0,null,500,1.4342553103969052E-3,3.5091803338236022E-3,0,0,0,0,0,0]
[510,1.2444105705919988E-2,3.1331283148966528E-2,0,1.8488045345261604E-28,0,0,0,0,null,510,1.2444135269308397E-2,3.1211851459753727E-2,0,5.6925456387010161E-29,0,0,0,0,null,510,9.6260240298666355E-6,2.4003335467523556E-5,0,0,0,0,0,0,null,510,1.4321625637931613E-3,3.5782099677972982E-3,0,0,0,0,0,0]
[520,1.2422860915446161E-2,3.1900564796733401E-2,0,3.5485159230152142E-28,0,0,0,0,null,520,1.2422894851857956E-2,3.178553223137498E-2,0,1.9460023182534681E-28,0,0,0,0,null,520,9.6095988719964073E-6,2.4452226002501729E-5,0,0,0,0,0,0,null,520,1.4297185695752513E-3,3.6447413543365483E-3,0,3.6031466517506753E-30,0,0,0,0]
[530,1.2398815256497716E-2,3.2448593517762137E-2,0,5.6058027694443626E-28,0,0,0,0,null,530,1.2398853206344278E-2,3.2337890500604712E-2,0,4.4012047090391754E-28,0,0,0,0,null,530,9.5910064453669335E-6,2.4884544098988565E-5,0,6.3043353800298591E-32,0,0,0,0,null,530,1.4269521488164761E-3,3.7088109479271182E-3,0,2.0964938508996535E-29,0,0,0,0]
[540,1.2372199562852145E-2,3.2975724226579003E-2,0,7.1589507507102541E-28,0,0,0,2.3627106088836065E-30,null,540,1.2372241194562001E-2,3.2869276209851202E-2,0,7.9555133588685793E-28,0,0,0,1.9182405627380605E-30,null,540,9.5704253624628054E-6,2.530055434458702E-5,0,2.4101580349273492E-31,0,0,0,9.8323535789124628E-34,null,540,1.423889873949598E-3,3.7704584236578158E-3,0,5.5255325040110056E-29,0,0,0,1.7078750805149881E-31]
[550,1.2343226701099178E-2,3.3482333422659986E-2,0,6.4104569829843577E-28,0,0,0,1.0151191851117226E-29,null,550,1.2343271708883871E-2,3.3380061752606001E-2,0,1.1898807899503945E-27,0,0,0,9.4307510937753698E-30,null,550,9.5480203331642539E-6,2.5700539736208768E-5,0,5.6772385022410864E-31,0,0,0,6.4595741249176172E-33,null,550,1.4205562491039425E-3,3.8297261430950981E-3,0,1.1040399868676846E-28,0,0,0,1.0024310211597036E-30]
[560,1.2312093009333003E-2,3.3968815265718079E-2,0,4.5567565717340728E-29,0,6.6315418852824602E-28,0,2.4700757361148235E-29,null,560,1.2312141111114767E-2,3.3870637951056881E-2,0,1.4222712034971465E-27,0,0,0,2.3747471687420696E-29,null,560,9.5239432779714339E-6,2.608479845148443E-5,0,1.060933708109661E-30,0,0,0,1.7224691213488631E-32,null,560,1.4169738757165156E-3,3.8866586798187576E-3,0,1.8211137594066743E-28,0,0,0,2.6201607711761902E-30]
[570,1.2278979618296375E-2,3.4435578096921708E-2,0,0,0,1.5553196263390204E-26,0,4.7470863893688437E-29,null,570,1.2279030553818064E-2,3.4341410489585389E-2,0,1.1101517953229955E-27,0,5.6255132121390461E-27,0,4.65465734383779E-29,null,570,9.4983343502776714E-6,2.6453640984703966E-5,0,1.6553946885966604E-30,0,0,0,3.4820005922951487E-32,null,570,1.4131636046155072E-3,3.9413023985945227E-3,0,2.4902661981762134E-28,0,0,0,5.2414656377345703E-30]
[580,1.2244053664363362E-2,3.488304136035094E-2,0,0,0,4.0080961387217412E-26,0,7.7174104996237238E-29,null,580,1.2244107193454378E-2,3.4792796757494499E-2,0,0,0,2.879461494628268E-26,0,7.6904775755394593E-29,null,580,9.4713228749706405E-6,2.6807387610095675E-5,0,2.1293776620787405E-30,0,5.6925700085373555E-30,0,5.8950440312911852E-32,null,580,1.4091446756620384E-3,3.9937050827069821E-3,0,2.6279678425617726E-28,0,1.6973505407939193E-27,0,8.8017506777009166E-30]
[590,1.2207469403191507E-2,3.5311632883472957E-2,0,0,0,7.3644016874261382E-26,0,1.0693582709343307E-28,null,590,1.2207525304164106E-2,3.5225223058910841E-2,0,0,0,6.4524725559634256E-26,0,1.0843775650026401E-28,null,590,9.4430282101388208E-6,2.7146366138856363E-5,0,2.029091064196972E-30,0,3.0925023188529778E-29,0,8.5260152320647451E-32,null,590,1.4049348459448448E-3,4.0439156045085998E-3,0,1.4095871585668516E-28,0,5.6678418591053743E-27,0,1.2623818484767589E-29]
[600,1.216936923218203E-2,3.572178647934425E-2,0,0,0,1.11679488261669E-25,0,1.2095959484716209E-28,null,600,1.2169427300366185E-2,3.5639122151733447E-2,0,0,0,1.1056771008350989E-25,0,1.2586338817958905E-28,null,600,9.4135605382674114E-6,2.7470909939531228E-5,0,6.2665428496869368E-31,0,6.9837823985532996E-29,0,1.0256718052708204E-31,null,600,1.4005505074812475E-3,4.0919836347069524E-3,0,0,0,1.1429627788533481E-26,0,1.5011499714479723E-29]
[610,1.2129884629241501E-2,3.6113939836983605E-2,0,0,0,1.4422589399754858E-25,0,9.170667025895632E-29,null,610,1.2129944675651249E-2,3.6034931081413202E-2,0,0,0,1.5896569941483109E-25,0,1.0196361844035582E-28,null,610,9.3830215925810334E-6,2.7781356194353703E-5,0,0,0,1.2004219393540863E-28,0,9.0270413712972048E-32,null,610,1.3960067952880047E-3,4.1379593863614074E-3,0,0,0,1.8418869269972626E-26,0,1.2875703870138982E-29]
[620,1.2089137014849628E-2,3.6488532669538332E-2,0,0,0,1.5528214942736532E-25,0,0,null,620,1.2089198864919371E-2,3.6413089278435479E-2,0,0,0,1.945144851314548E-25,0,0,null,620,9.3515053241589572E-6,2.8078044366766088E-5,0,0,0,1.730523782229354E-28,0,1.7208228885656403E-32,null,620,1.3913176866174248E-3,4.1818933899384538E-3,0,0,0,2.5166690407319844E-26,0,1.5842525814758166E-30]
[630,1.2047238543722518E-2,3.6846005093101909E-2,0,0,0,1.2361724836990094E-25,0,0,null,630,1.2047302036212541E-2,3.6774036891863385E-2,0,0,0,1.9452803482835695E-25,0,0,null,630,9.3190985144758976E-6,2.8361314857936315E-5,0,0,0,2.1266926129086912E-28,0,0,null,630,1.3864960920906095E-3,4.2238362961639821E-3,0,0,0,2.9130743286306317E-26,0,0]
[640,1.200429283194991E-2,3.718679621160826E-2,0,0,0,2.5587112177761223E-26,0,0,null,640,1.2004357817873998E-2,3.7118213333778918E-2,0,0,0,1.3069776999874646E-25,0,0,null,640,9.2858813380378371E-6,2.8631507832200707E-5,0,0,0,2.1474938413123884E-28,0,0,null,640,1.3815539394028251E-3,4.2638387037156351E-3,0,0,0,2.6752020577010604E-26,0,0]
[650,1.196039562503381E-2,3.7511342885784935E-2,0,1.6514956032010479E-26,0,0,0,0,null,650,1.1960461966705414E-2,3.744605601207332E-2,0,0,0,0,0,0,null,650,9.2519278793345072E-6,2.8888962193419177E-5,0,0,0,1.4918717617209353E-28,0,0,null,650,1.3765022502264348E-3,4.3019510091121052E-3,0,0,0,1.3842220427610641E-26,0,0]
[660,1.1915635411721861E-2,3.7820078666412918E-2,0,6.3143199026851348E-26,0,0,0,0,null,660,1.1915702981886541E-2,3.7757999231495976E-2,0,0,0,0,0,0,null,660,9.2173066077774142E-6,2.9134014696129434E-5,0,0,0,0,0,0,null,660,1.3713512108725812E-3,4.3382232764148541E-3,0,0,0,0,0,0]
[670,1.1870093988195496E-2,3.8113432874128252E-2,0,1.3189720141087514E-25,0,0,0,0,null,670,1.1870162669205144E-2,3.8054473244683744E-2,0,4.0209050657487478E-26,0,0,0,0,null,670,9.1820808142657386E-6,2.9366999176932503E-5,0,0,0,0,0,0,null,670,1.366110237237304E-3,4.3727051246158334E-3,0,0,0,0,0,0]
[680,1.1823846976666335E-2,3.8391829809774486E-2,0,2.2041352666513778E-25,0,0,0,0,null,680,1.1823916659749054E-2,3.8335903436915876E-2,0,1.297140729837588E-25,0,0,0,0,null,680,9.1463090124863943E-6,2.9588245893058955E-5,0,0,0,0,0,0,null,680,1.3607880345020431E-3,4.405445630776059E-3,0,0,0,0,0,0]
[690,1.1776964302329555E-2,3.8655688081132594E-2,0,3.1922676689141883E-25,0,0,0,0,null,690,1.1777034886900555E-2,3.8602709630027744E-2,0,2.5771853255047428E-25,0,0,0,0,null,690,9.1100453079414527E-6,2.9798080956477191E-5,0,6.1733416280403076E-30,0,0,0,0,null,690,1.355392652038328E-3,4.4364932472159705E-3,0,1.0519803264668604E-26,0,0,0,0]
[700,1.1729510631953009E-2,3.8905420033067115E-2,0,4.0965487708875682E-25,0,0,0,0,null,700,1.172958202498571E-2,3.8855305492289618E-2,0,4.1791607779616228E-25,0,0,0,0,null,700,9.0733397373462125E-6,2.9996825853029756E-5,0,1.0538850080845365E-28,0,0,0,0,null,700,1.349931533894343E-3,4.4658957311945486E-3,0,2.839820705750957E-26,0,0,0,0]
[710,1.1681545777434205E-2,3.9141431269697373E-2,0,4.6269786911872436E-25,0,0,0,0,null,710,1.1681617892875673E-2,3.9094098042532534E-2,0,5.9110892657743831E-25,0,0,0,0,null,710,9.0362385808561832E-6,3.0184797037144768E-5,0,2.5918715896181607E-28,0,0,0,0,null,710,1.3444115652542681E-3,4.4937000857071668E-3,0,5.3100591465248728E-26,0,0,0,0]
[720,1.1633125067221124E-2,3.9364120258285555E-2,0,4.3968786193667937E-25,0,0,0,4.152107214134872E-27,null,720,1.1633197825466884E-2,3.9319487238052217E-2,0,7.4201805515111236E-25,0,0,0,3.6333555452255807E-27,null,720,8.9987846495058098E-6,3.036230559380645E-5,0,4.671116139512741E-28,0,0,0,2.1979666155322756E-30,null,720,1.3388391151897255E-3,4.5199525101614884E-3,0,8.3069874759827606E-26,0,0,0,3.5758253519091131E-28]
[730,1.1584299688153015E-2,3.9573878005563584E-2,0,2.9536127168719448E-25,0,0,0,1.17402874525793E-26,null,730,1.1584373015558152E-2,3.9531865636741645E-2,0,8.1809817989169622E-25,0,0,0,1.1148949071231491E-26,null,730,8.9610175496884458E-6,3.0529656960109481E-5,0,7.1429388140138577E-28,0,0,0,7.9103001171194057E-30,null,730,1.3332200760166814E-3,4.5446983598082342E-3,0,1.1435606696122391E-25,0,0,0,1.2128246386827479E-27]
[740,1.1535117000195858E-2,3.9771087798313849E-2,0,0,0,6.4481554933086584E-25,0,2.2358367913127194E-26,null,740,1.1535190828607969E-2,3.9731618125102931E-2,0,7.5155298911838579E-25,0,0,0,2.179102248702093E-26,null,740,8.9229739266922068E-6,3.0687150699731509E-5,0,9.6619258440103701E-28,0,0,0,1.6148102664808047E-29,null,740,1.3275598995195895E-3,4.5679821129534304E-3,0,1.4012217763478843E-25,0,0,0,2.4386050336656512E-27]
[750,1.1485620826468953E-2,3.9956125000710371E-2,0,0,0,2.8916260807536962E-24,0,3.5662529321138504E-26,null,750,1.1485695092836179E-2,3.9919121704496574E-2,0,4.655557835029306E-25,0,1.5542644134530459E-24,0,3.527507418356856E-26,null,750,8.8846876891276872E-6,3.0835080324186944E-5,0,1.1649943263931528E-27,0,0,0,2.6762206762173452E-29,null,750,1.3218636303463907E-3,4.5898473450352159E-3,0,1.5053742164221199E-25,0,0,0,4.0091750130684528E-27]
[760,1.1435851720235366E-2,4.0129356901880374E-2,0,0,0,5.8263357301783574E-24,0,5.0503780401469938E-26,null,760,1.1435926366198687E-2,4.0094745328875456E-2,0,0,0,4.6085025262719234E-24,0,5.0512448268805671E-26,null,760,8.8461902155113393E-6,3.097373315549852E-5,0,1.2292547732875686E-27,0,1.4345817076713697E-27,0,3.8984416915136245E-29,null,760,1.3161359367366583E-3,4.6103367087889594E-3,0,1.3325759545657623E-25,0,3.318062289418439E-25,0,5.8065001042973628E-27]
[770,1.1385847211193068E-2,4.0291142607713194E-2,0,0,0,9.290099547717314E-24,0,6.4709724467387765E-26,null,770,1.1385922182740005E-2,4.025884978796445E-2,0,0,0,8.4582296100843939E-24,0,6.5380115816889043E-26,null,770,8.8075105448439304E-6,3.1103390225374038E-5,0,1.0583220888241226E-27,0,4.5765783027050041E-27,0,5.1235599926607527E-29,null,770,1.3103811388725502E-3,4.6294919197741565E-3,0,7.4651409919293184E-26,0,7.9809529859890581E-25,0,7.5923912003350598E-27]
[780,1.1335642032334654E-2,4.044183297162824E-2,0,0,0,1.297878580906872E-23,0,7.4955011647847004E-26,null,780,1.1335717279483983E-2,4.0411787630425654E-2,0,0,0,1.2849583852310174E-23,0,7.6575752373846078E-26,null,780,8.7686755521181381E-6,3.1224326206619447E-5,0,5.4272966902862853E-28,0,8.5494773736672845E-27,0,6.0995471989158969E-29,null,780,1.3046032350003058E-3,4.6473537466290866E-3,0,0,0,1.3672725202770591E-24,0,8.9900343315316536E-27]
[790,1.1285268329213496E-2,4.058177055952631E-2,0,0,0,1.6436470522716628E-23,0,7.6782416875104921E-26,null,790,1.1285343805709294E-2,4.0553903122138454E-2,0,0,0,1.7347353007713768E-23,0,7.9621569066296093E-26,null,790,8.7297101103075992E-6,3.1336809372789357E-5,0,0,0,1.3095646836267587E-26,0,6.4784851612564537E-29,null,790,1.2988059255145733E-3,4.6639620054763596E-3,0,0,0,1.9958885874957573E-24,0,9.4823907478527455E-27]
[800,1.1234755852936427E-2,4.0711289644726339E-2,0,0,0,1.9067889602891494E-23,0,6.4833329352882708E-26,null,800,1.1234831515962579E-2,4.0685532235302142E-2,0,0,0,2.1335398836425686E-23,0,6.9078058863980308E-26,null,800,8.6906372396185335E-6,3.1441101582715173E-5,0,0,0,1.7772064254821352E-26,0,5.8310422561605306E-29,null,800,1.2929926351758175E-3,4.6793555579758058E-3,0,0,0,2.61500369514997E-24,0,8.434777935955745E-27]
[810,1.1184132138307575E-2,4.0830716229051829E-2,0,0,0,2.017278701164861E-23,0,3.3332395353275196E-26,null,810,1.1184207948238319E-2,4.0807002664431997E-2,0,0,0,2.4041619510221446E-23,0,3.9015470697864341E-26,null,810,8.6514782454090092E-6,3.1537458286699706E-5,0,0,0,2.195115555013211E-26,0,3.6812605004939559E-29,null,810,1.2871665336205743E-3,4.6935723125578433E-3,0,0,0,3.1313849172870335E-24,0,5.14749171631359E-27]
[820,1.1133422668109861E-2,4.0940368086729614E-2,0,0,0,1.9002862823166587E-23,0,0,null,820,1.1133498588275623E-2,4.0918633865838869E-2,0,0,0,2.4589946222367696E-23,0,0,null,820,8.6122528452318952E-6,3.1626128551708224E-5,0,0,0,2.4846670124339271E-26,0,0,null,820,1.2813305542648283E-3,4.7066492284395071E-3,0,0,0,3.4322599296044731E-24,0,0]
[830,1.1082651024858977E-2,4.1040554828006219E-2,0,0,0,1.4839367685334677E-23,0,0,null,830,1.1082727021335372E-2,4.102073711742369E-2,0,0,0,2.2078927744767883E-23,0,0,null,830,8.5729792863047662E-6,3.1707355102941721E-5,0,0,0,2.5566982695787648E-26,0,0,null,830,1.2754874117840817E-3,4.7186223220500824E-3,0,0,0,3.3938267712454335E-24,0,0]
[840,1.1031839030906284E-2,4.1131577979830525E-2,0,0,0,7.086592395596212E-24,0,0,null,840,1.1031915072277651E-2,4.1113615596014307E-2,0,0,0,1.5683147585366222E-23,0,0,null,840,8.5336744539260625E-6,3.1781374379701047E-5,0,0,0,2.3195195311556838E-26,0,0,null,840,1.2696396182298301E-3,4.7295266755392213E-3,0,0,0,2.8932882831844485E-24,0,0]
[850,1.0981006877850601E-2,4.1213731081201153E-2,0,6.1794171276735993E-25,0,0,0,0,null,850,1.0981082935073437E-2,4.1197564469956351E-2,0,0,0,4.7704090412099832E-24,0,0,null,850,8.4943539715573218E-6,3.1848416603495879E-5,0,0,0,1.6892052340100264E-26,0,0,null,850,1.2637894979373988E-3,4.739396447086406E-3,0,0,0,1.8237176057426869E-24,0,0]
[860,1.09301732461106E-2,4.128729979099497E-2,0,5.868119032338632E-24,0,0,0,0,null,860,1.0930249292299099E-2,4.1272871004462391E-2,0,0,0,0,0,0,null,860,8.4550322933923741E-6,3.1908705856674427E-5,0,0,0,6.0143531637097031E-27,0,0,null,860,1.2579392012803206E-3,4.7482648827504954E-3,0,0,0,1.10620388568305E-25,0,0]
[870,1.0879355415416707E-2,4.1352562006365931E-2,0,1.2734132087440057E-23,0,0,0,0,null,870,1.087943142572609E-2,4.1339814678033625E-2,0,1.7813984230013551E-24,0,0,0,0,null,870,8.415722789833683E-6,3.1962460169920157E-5,0,0,0,0,0,0,null,870,1.2520907173964621E-3,4.7561643296103913E-3,0,0,0,0,0,0]
[880,1.0828569366969047E-2,4.1409787990038208E-2,0,2.1021163759587433E-23,0,0,0,0,null,880,1.0828645318394815E-2,4.139866730803686E-2,0,1.0639039250130565E-23,0,0,0,0,null,880,8.376437826538556E-6,3.2009891617345207E-5,0,0,0,0,0,0,null,880,1.2462458859474961E-3,4.7631262500206122E-3,0,0,0,0,0,0]
[890,1.0777829877850661E-2,4.1459240504979941E-2,0,3.0302339062858345E-23,0,0,0,0,null,890,1.0777905749159492E-2,4.1449693183958532E-2,0,2.2036293197704797E-23,0,0,0,0,null,890,8.3371888374701038E-6,3.2051206417851794E-5,0,0,0,0,0,0,null,890,1.240406407982182E-3,4.7691812367773442E-3,0,3.7355055833476731E-25,0,0,0,0]
[900,1.0727150608519864E-2,4.1501174955127181E-2,0,3.9895509058648138E-23,0,0,1.6863645436818073E-40,0,null,900,1.072722638004592E-2,4.1493149207023634E-2,0,3.5591436170178038E-23,0,0,1.1070012037946351E-40,0,null,900,8.297986392588686E-6,3.2086605041672495E-5,0,3.3186559017137829E-27,0,0,0,0,null,900,1.2345738560145757E-3,4.774359029048143E-3,0,1.961499267893482E-24,0,0,0,0]
[910,1.0676544183495038E-2,4.1535839530817589E-2,0,4.8860824508425034E-23,0,0,2.6334400815927357E-40,0,null,910,1.0676619837106405E-2,4.1529285034692949E-2,0,5.0549829433149245E-23,0,0,2.6012877747105704E-40,0,null,910,8.258840260309197E-6,3.211628232106563E-5,0,1.6283426305847185E-26,0,0,0,0,null,910,1.2287496833083553E-3,4.778688528887666E-3,0,3.9889790796819691E-24,0,0,0,0]
[920,1.0626022266224514E-2,4.1563475358125455E-2,0,5.6023771380737637E-23,0,0,3.0858203584930539E-40,0,null,920,1.0626097785138117E-2,4.155834322933305E-2,0,6.5756654643893429E-23,0,0,4.3678212028557525E-40,0,null,920,8.2197594654138962E-6,3.214042756440478E-5,0,3.2782412332865386E-26,0,0,0,0,null,920,1.2229352324910181E-3,4.7821978182668E-3,0,6.3847151606640057E-24,0,0,0,0]
[930,1.0575595628312572E-2,4.1584316651043104E-2,0,6.0026638554068687E-23,0,0,2.1419483332387517E-40,0,null,930,1.0575670997054087E-2,4.1580559409855992E-2,0,7.9664188010786528E-23,0,0,5.5345412050222116E-40,0,null,930,8.1807523426125706E-6,3.2159224672830784E-5,0,5.2231501782072402E-26,0,0,0,0,null,930,1.2171317435333002E-3,4.7849141764579467E-3,0,9.0129034707797936E-24,0,0,0,0]
[940,1.0525274213589361E-2,4.1598590865512368E-2,0,5.9409169647480348E-23,0,0,0,2.1832877220822649E-25,null,940,1.0525349417867057E-2,4.1596162405415214E-2,0,9.0379929807977444E-23,0,0,4.5691833793160232E-40,1.4816590139741109E-25,null,940,8.1418265861275193E-6,3.2172852258650862E-5,0,7.3529836449992988E-26,0,0,0,3.0876851559280835E-29,null,940,1.211340361115656E-3,4.7868640976771269E-3,0,1.1669196710314045E-23,0,0,1.0239285186803034E-40,8.7915117990383681E-27]
[950,1.0475067197540855E-2,4.1606518854964657E-2,0,5.271657745057689E-23,0,0,0,1.035856612910357E-24,null,950,1.0475142224181428E-2,4.160537441071134E-2,0,9.575896396261307E-23,0,0,0,9.6326983327909452E-25,null,950,8.1029892956664353E-6,3.2181483765235589E-5,0,9.5028803670066001E-26,0,0,0,6.5737331751899049E-28,null,950,1.2055621414724536E-3,4.7880733089341061E-3,0,1.4082701607231979E-23,0,0,0,1.0222540540576932E-25]
[960,1.0424983042226344E-2,4.1608315026323679E-2,0,3.8630377025320084E-23,0,0,0,2.073766374488044E-24,null,960,1.042505787905597E-2,4.1608411141940596E-2,0,9.3540283639553955E-23,0,0,0,2.0055714058707571E-24,null,960,8.0642470189321046E-6,3.2185287587443454E-5,0,1.1454892431030223E-25,0,0,0,1.4674785694223952E-27,null,960,1.1997980587153071E-3,4.7885667879588312E-3,0,1.5924994417136694E-23,0,0,0,2.2258785172809112E-25]
[970,1.0375029547251946E-2,4.160418749619442E-2,0,1.6114854668004329E-23,0,0,0,3.3077870748356665E-24,null,970,1.0375104183086733E-2,4.1605481992976451E-2,0,8.1522764817590736E-23,0,0,0,3.2526233732747513E-24,null,970,8.0256057910628331E-6,3.2184427192450036E-5,0,1.2945256131050076E-25,0,0,0,2.4460582080517007E-27,null,970,1.194049010696944E-3,4.7883687811845219E-3,0,1.682664535752433E-23,0,0,0,3.6751433547137757E-25]
[980,1.0325213896965566E-2,4.1594338246607528E-2,0,0,0,2.7491604926202645E-23,0,4.6877038084258979E-24,null,980,1.032528832148402E-2,4.1596790191251676E-2,0,5.7772339079839026E-23,0,0,0,4.6557383375386208E-24,null,980,7.9870711711024112E-6,3.2179061240446543E-5,0,1.3677628570304065E-25,0,0,0,3.5573599043014695E-27,null,980,1.1883158244464611E-3,4.7875028216918438E-3,0,1.6401115107815162E-23,0,0,0,5.3158818869063552E-25]
[990,1.0275542704333266E-2,4.1578963279997438E-2,0,0,0,1.1376533048646007E-22,0,6.1348209829752209E-24,null,990,1.0275616908060127E-2,4.1582532952915974E-2,0,2.0848072877275236E-23,0,6.2300720202111062E-23,0,6.1372393099949492E-24,null,990,7.94864827601779E-6,3.2169343704838946E-5,0,1.3342177054471585E-25,0,0,0,4.7426323505511898E-27,null,990,1.1825992612218622E-3,4.785991747089928E-3,0,1.4275196925522015E-23,0,0,0,7.0599909335226303E-25]
[1000,1.022602205129532E-2,4.1558252772788927E-2,0,0,0,2.151882837409538E-22,5.1534878555429912E-39,7.5412780537294944E-24,null,1000,1.0226096025508571E-2,4.1562901636730723E-2,0,0,0,1.7021272714351509E-22,0,7.5895631692584515E-24,null,1000,7.9103418119033315E-6,3.2155423991598375E-5,0,1.1639862598761391E-25,0,5.4303256269118501E-26,0,5.9191750977343488E-27,null,1000,1.1769000211513852E-3,4.783857717257132E-3,0,1.0124484607689557E-23,0,1.2444976275736123E-23,0,8.7841464928520378E-25]
[]
[]
["Saved  28/02/2023: 14:59:28  Level Number: 5"]
[]
["BREAKTHROUGH RESULTS"]
[]
["Advanced"]
["Pollutant Linkage: Inert Restorati, Attenution Layer, Beenham Grange Formation",null,null,null,null,null,null,null,null,null,"Pollutant Linkage: Inert Restorati, Attenution Layer, Beenham Grange Formation, Groundwater ",null,null,null,null,null,null,null,null,null,"Pollutant Linkage: Inert Restorati, Attenution Layer, Beenham Grange Formation, River Enborne",null,null,null,null,null,null,null,null,null,"Pollutant Linkage: Inert Restorati, Attenution Layer, Beenham Grange Formation, Spring Ditch"]
["Concentrations in mg/L in Beenham Grange Formation",null,null,null,null,null,null,null,null,null,"Concentrations in mg/L in Groundwater ",null,null,null,null,null,null,null,null,null,"Concentrations in mg/L in River Enborne",null,null,null,null,null,null,null,null,null,"Concentrations in mg/L in Spring Ditch"]
[]
["Compared with EAL (GW) target concentration in mg/L",null,null,null,null,null,null,null,null,null,"Compared with EAL (GW) target concentration in mg/L",null,null,null,null,null,null,null,null,null,"Compared with EAL (River Enborne) target concentration in mg/L",null,null,null,null,null,null,null,null,null,"Compared with EAL (Spring Ditch) target concentration in mg/L"]
[null,0.26600000000000001,4.8199999999999993E-2,1E-3,4.3649999999999991E-3,2.0000000000000002E-5,2E-3,2.0000000000000001E-4,1E-3,null,null,0.26600000000000001,4.8199999999999993E-2,1E-3,4.3649999999999991E-3,2.0000000000000002E-5,2E-3,2.0000000000000001E-4,1E-3,null,null,0.26600000000000001,2.76E-2,4.7000000000000002E-3,2.8000000000000001E-2,5.0000000000000001E-4,1.75E-3,1.1999999999999999E-3,1E-3,null,null,0.26600000000000001,0.03,4.7000000000000002E-3,2.8000000000000001E-2,5.0000000000000001E-4,1.5E-3,1.1999999999999999E-3,5.0000000000000001E-3]
[]
["Time(years)","Species1","Species2","Species3","Species4","Species5","Species6","Species7","Species8",null,"Time(years)","Species1","Species2","Species3","Species4","Species5","Species6","Species7","Species8",null,"Time(years)","Species1","Species2","Species3","Species4","Species5","Species6","Species7","Species8",null,"Time(years)","Species1","Species2","Species3","Species4","Species5","Species6","Species7","Species8"]
[null,"Ammoniacal Nitrogen","Barium","Total Chromiun","Copper","Mercury","Molybdenum","Lead","Antimony",null,null,"Ammoniacal Nitrogen","Barium","Total Chromiun","Copper","Mercury","Molybdenum","Lead","Antimony",null,null,"Ammoniacal Nitrogen","Barium","Total Chromiun","Copper","Mercury","Molybdenum","Lead","Antimony",null,null,"Ammoniacal Nitrogen","Barium","Total Chromiun","Copper","Mercury","Molybdenum","Lead","Antimony"]
[10,1.5971076978511836E-12,1.9592882057883589E-22,0,0,0,0,0,0,null,10,1.5421941182368864E-12,0,0,0,0,0,0,0,null,10,1.1322049814174945E-15,4.2947608655767881E-26,0,0,0,0,0,0,null,10,1.7140472199286931E-13,2.1454872483302177E-24,0,0,0,0,0,0]
[20,2.0793731263382399E-7,1.514522300131767E-15,0,0,0,0,0,0,null,20,2.0609962470733467E-7,9.8414838193386251E-17,0,0,0,0,0,0,null,20,1.5731678858711293E-10,2.7141082008489792E-21,0,0,0,0,0,0,null,20,2.3509779450370226E-8,1.3469212170529802E-18,0,0,0,0,0,0]
[30,1.1034568439612781E-5,5.9553996920910681E-11,0,0,0,0,0,0,null,30,1.0990737887735778E-5,1.527668104815454E-11,0,0,0,0,0,0,null,30,8.4511053228842374E-9,2.026682266119852E-15,0,0,0,0,0,0,null,30,1.2598656687105035E-6,5.2655529996755895E-13,0,0,0,0,0,0]
[40,8.1508033502182914E-5,1.2168553082699859E-8,0,0,0,0,0,0,null,40,8.1324882738976312E-5,5.46517401321152E-9,0,0,0,0,0,0,null,40,6.2695714147434928E-8,1.3796354840328518E-12,0,0,0,0,0,0,null,40,9.3384028957929163E-6,2.9495339401679764E-10,0,0,0,0,0,0]
[50,2.7162932263881373E-4,3.0073506393203505E-7,0,0,0,0,0,0,null,50,2.7123795568040441E-4,1.7812487323242394E-7,0,0,0,0,0,0,null,50,2.0935886099683981E-7,6.4165196876408821E-11,0,0,0,0,0,0,null,50,3.1170987982515597E-5,1.2273490793952907E-8,0,0,0,0,0,0]
[60,6.0607604392679492E-4,2.5744265005620261E-6,0,0,0,0,0,0,null,60,6.0547037699042823E-4,1.7813760213223917E-6,0,0,0,0,0,0,null,60,4.6765105130272194E-7,7.949137692768193E-10,0,0,0,0,0,0,null,60,6.9612153445574915E-5,1.4196169178064071E-7,0,0,0,0,0,0]
[70,1.0735228512342055E-3,1.1997461551384742E-5,0,0,0,0,0,0,null,70,1.072737812573826E-3,9.1347891314368461E-6,0,0,0,0,0,0,null,70,8.28891106413946E-7,4.6766456535406571E-9,0,0,0,0,0,0,null,70,1.2336794426748613E-4,7.9859471336750478E-7,0,0,0,0,0,0]
[80,1.644514474433492E-3,3.8181386145270564E-5,0,0,0,0,0,0,null,80,1.6435996995420427E-3,3.0957200636097182E-5,0,0,0,0,0,0,null,80,1.2703228040342083E-6,1.7388821510174244E-8,0,0,0,0,0,0,null,80,1.890518291135969E-4,2.879919858584127E-6,0,0,0,0,0,0]
[90,2.285589878777609E-3,9.4145427487976849E-5,0,0,0,0,0,0,null,90,2.284594143083212E-3,7.9724599668805387E-5,0,0,0,0,0,0,null,90,1.7660611846068298E-6,4.7799610427254138E-8,0,0,0,0,0,0,null,90,2.6281267945855552E-4,7.7468252997320072E-6,0,0,0,0,0,0]
[100,2.966449207171787E-3,1.9405069265059766E-4,0,0,0,0,0,0,null,100,2.9654138374854478E-3,1.6955262841302751E-4,0,0,0,0,0,0,null,100,2.2926538150182738E-6,1.0659795050562322E-7,0,0,0,0,0,0,null,100,3.411616595440455E-4,1.700456894023787E-5,0,0,0,0,0,0]
[110,3.6624976411763679E-3,3.5094715392666764E-4,0,0,0,0,0,0,null,110,3.6614548984028115E-3,3.1386528648373266E-4,0,0,0,0,0,0,null,110,2.8310581800580097E-6,2.0446744653597021E-7,0,0,0,0,0,0,null,110,4.2126613688801227E-4,3.2230685590616716E-5,0,0,0,0,0,0]
[120,4.3550678147952805E-3,5.7523016667495295E-4,0,0,0,0,0,0,null,120,4.35404150734692E-3,5.2368210566945456E-4,0,0,0,0,0,0,null,120,3.3668180466249283E-6,3.5058476589622754E-7,0,0,0,0,0,0,null,120,5.0097579310463792E-4,5.4759778034065995E-5,0,0,0,0,0,0]
[130,5.0306954130721095E-3,8.7392574503471925E-4,0,0,0,0,0,0,null,130,5.0297022870654127E-3,8.0674176012729502E-4,0,0,0,0,0,0,null,130,3.8895046177182178E-6,5.5174517273653338E-7,0,0,0,0,0,0,null,130,5.7873943366228034E-4,8.5563259478592198E-5,0,0,0,0,0,0]
[140,5.6801313262911076E-3,1.2506281536280228E-3,0,0,0,0,0,0,null,140,5.6791825616559185E-3,1.167324930827452E-3,0,0,0,0,0,0,null,140,4.3919526038196922E-6,8.1207426869929596E-7,0,0,0,0,0,0,null,140,6.5349132406287709E-4,1.2521431057861343E-4,0,0,0,0,0,0]
[150,6.2973874622400967E-3,1.705843454469344E-3,0,0,0,0,0,0,null,150,6.2964900079692547E-3,1.6065327371765992E-3,0,0,0,0,0,0,null,150,4.8695218133954017E-6,1.1331509591399841E-6,0,0,0,0,0,0,null,150,7.2454133816840115E-4,1.7391110456695656E-4,0,0,0,0,0,0]
[160,6.8789227074419774E-3,2.23752960938336E-3,0,0,0,0,0,0,null,160,6.8780803786296805E-3,2.1227997772582568E-3,0,0,0,0,0,0,null,160,5.3194670038013248E-6,1.5143607368313742E-6,0,0,0,0,0,0,null,160,7.9148121803295239E-4,2.315317907214146E-4,0,0,0,0,0,0]
[170,7.4229896580184857E-3,2.8416893241840517E-3,0,0,0,0,0,0,null,170,7.4222039979847379E-3,2.7124843632590403E-3,0,0,0,0,0,0,null,170,5.7404320995778592E-6,1.9533417492790903E-6,0,0,0,0,0,0,null,170,8.5410933699093259E-4,2.9770154645884713E-4,0,0,0,0,0,0]
[180,7.9291282953363549E-3,3.5129310837011024E-3,0,0,0,0,0,0,null,180,7.9283992352803343E-3,3.3704404146876268E-3,0,0,0,0,0,0,null,180,6.1320581405635042E-6,2.4464358717580697E-6,0,0,0,0,0,0,null,180,9.1237238165561992E-4,3.7185934660440424E-4,0,0,0,0,0,0]
[190,8.3977820217945483E-3,4.2449567699462832E-3,0,0,0,0,0,0,null,190,8.3971083767324928E-3,4.0905219044039655E-3,0,0,0,0,0,0,null,190,6.4946859549560015E-6,2.9890968789830667E-6,0,0,0,0,0,0,null,190,9.6632112490865798E-4,4.5331783897254938E-4,0,0,0,0,0,0]
[200,8.8300108250256477E-3,5.0309615673169638E-3,0,0,0,0,0,0,null,200,8.8293906619043884E-3,4.8660010065052937E-3,0,0,0,0,0,0,null,200,6.8291340341475641E-6,3.5762348826855117E-6,0,0,0,0,0,0,null,200,1.0160773853777742E-3,5.4131355709316519E-4,0,0,0,0,0,0]
[210,9.2272794590234752E-3,5.863947413886122E-3,0,0,0,0,0,0,null,210,9.2267103670920329E-3,5.689898735305959E-3,0,0,0,0,0,0,null,210,7.1365344940607358E-6,4.2024925723125617E-6,0,0,0,0,0,0,null,210,1.0618096273183866E-3,6.3504699522300135E-4,0,0,0,0,0,0]
[220,9.5913026016943067E-3,6.7369590025418598E-3,0,0,0,0,0,0,null,220,9.5907818891126876E-3,6.555235941587639E-3,0,0,0,0,0,0,null,220,7.4182131561982924E-6,4.86245761239563E-6,0,0,0,0,0,0,null,220,1.1037151232661242E-3,7.3371328824357754E-4,0,0,0,0,0,0]
[230,9.9239328208002801E-3,7.643254328664844E-3,0,0,0,3.3538597087754569E-40,0,0,null,230,9.9234576560632507E-3,7.4552163089550661E-3,0,0,0,2.1657358324548515E-40,0,0,null,230,7.6756027784825559E-6,5.5508195560983927E-6,0,0,0,0,0,0,null,230,1.1420070476590271E-3,8.3652477751232888E-4,0,0,0,0,0,0]
[240,1.0227080464544196E-2,8.5764221136639777E-3,0,0,0,0,0,0,null,240,1.0226647976883569E-2,8.3833537479100495E-3,0,0,0,8.5438057240627883E-40,0,0,null,240,7.91018100835089E-6,6.2624808209937222E-6,0,0,0,0,0,0,null,240,1.1769052478343243E-3,9.4272688792138178E-4,0,0,0,1.86092568670234E-40,0,0]
[250,1.050265722687071E-2,9.530457427231312E-3,0,0,0,0,0,0,null,250,1.0502264576308408E-2,9.3335557787034909E-3,0,0,0,0,0,0,null,250,8.1234266697668648E-6,6.9926309492532096E-6,0,0,0,0,0,0,null,250,1.2086297421369573E-3,1.051608676853026E-3,0,0,0,0,0,0]
[260,1.0752537185553183E-2,1.049980526861718E-2,0,3.4671294311057285E-40,0,7.4443487305188611E-38,0,0,null,260,1.0752181610620299E-2,1.0300173003035514E-2,0,0,0,2.4450822834869729E-38,0,0,null,260,8.316789581544554E-6,7.7367923426975161E-6,0,0,0,0,0,0,null,260,1.2373962307638132E-3,1.1625092553270088E-3,0,0,0,0,0,0]
[270,1.097853067496495E-2,1.1479380183162129E-2,0,1.1632390343237601E-39,0,4.8494213259654691E-37,0,0,null,270,1.0978209524048283E-2,1.1278023083153014E-2,0,4.8602831826397746E-40,0,3.1447937242498113E-37,0,0,null,270,8.4916703153267255E-6,8.4908443855976669E-6,0,0,0,1.0653149078468338E-40,0,0,null,270,1.2634130850883755E-3,1.2748210899509464E-3,0,0,0,2.3883003245970862E-38,0,0]
[280,1.1182367536708711E-2,1.246456840584521E-2,0,0,0,3.2695430609387298E-36,0,0,null,280,1.1182078287479037E-2,1.2262396031545783E-2,0,6.7185012084461575E-39,0,1.404313357070496E-36,0,0,null,280,8.6494072162770387E-6,9.2510315921123914E-6,0,0,0,6.7989923676299578E-40,0,0,null,280,1.2868794172799507E-3,1.3879910055339044E-3,0,1.480821629783114E-40,0,1.0925778143004936E-37,0,0]
[290,1.136568717775863E-2,1.3451217635285543E-2,0,4.3437733982535121E-39,0,2.3603513075191038E-35,0,1.126965080953565E-40,null,290,1.1365427447976438E-2,1.3249046182168456E-2,0,0,0,1.0697022130402569E-35,0,1.0942237159128122E-40,null,290,8.7912686960150831E-6,1.0013960259582078E-5,0,0,0,2.5269549230299603E-39,0,0,null,290,1.3079839341407459E-3,1.5015195385678511E-3,0,1.6314161028064564E-39,0,5.3206947690543895E-37,0,0]
[300,1.153003352852134E-2,1.4435618377137003E-2,0,2.3706295919597702E-37,0,1.2950723588234238E-34,0,1.3375785558203552E-40,null,300,1.1529801080679157E-2,1.4234175003558966E-2,0,0,0,7.2742884135274906E-35,0,1.8470783423161291E-40,null,300,8.9184493205584871E-6,1.0776587119066783E-5,0,0,0,2.071335288919922E-38,0,0,null,300,1.3269043554217476E-3,1.6149591471533269E-3,0,0,0,4.3919017813326912E-36,0,0]
[310,1.1676853487562359E-2,1.5414479847400516E-2,0,1.2092053065617258E-36,0,5.4960931568909076E-34,0,0,null,310,1.1676646229163617E-2,1.5214407923035302E-2,0,3.5487568272378072E-37,0,3.5013681721971731E-34,0,0,null,310,9.0320685988328478E-6,1.1536202656666433E-5,0,0,0,1.324725411801999E-37,0,0,null,310,1.3438072338291314E-3,1.7279116638267648E-3,0,0,0,2.5245232280045601E-35,0,0]
[320,1.1807497808292758E-2,1.6384902670068854E-2,0,6.0366374525951906E-36,0,1.9111121408443181E-33,0,5.432495265624217E-40,null,320,1.1807313789114019E-2,1.6186767537816758E-2,0,2.0274820795228709E-36,0,1.333706203583494E-33,0,0,null,320,9.1331716627088691E-6,1.2290411120203164E-5,0,0,0,5.8159443002576403E-37,0,0,null,320,1.3588480563736507E-3,1.8400252819929025E-3,0,6.0822440578624524E-38,0,1.0481168908281819E-34,0,0]
[330,1.1923223657251009E-2,1.734435001050507E-2,0,3.4812342702036755E-35,0,5.4047082182091037E-33,0,3.1475614361246003E-38,null,330,1.1923061064570967E-2,1.7148644964763603E-2,0,5.7862842421412405E-36,0,4.254229840777919E-33,0,2.857913752257053E-38,null,330,9.2227312419978098E-6,1.3037108704744586E-5,0,1.8311729017714393E-39,0,2.0505610917899646E-36,0,0,null,330,1.3721715383286646E-3,1.950991291078102E-3,0,4.2102065611053629E-37,0,3.5917538182978315E-34,0,2.9645656068241789E-39]
[340,1.202519827809284E-2,1.8290618327098718E-2,0,1.7076080014367429E-34,0,1.1379483036970457E-32,0,1.4835592805707973E-37,null,340,1.2025055430599684E-2,1.8097770596210344E-2,0,3.111877634499488E-35,0,1.0925274864629809E-32,0,1.3890139432487151E-37,null,340,9.3016504961290838E-6,1.3774461004456273E-5,0,6.0505400897285474E-39,0,6.172915493626907E-36,0,0,null,340,1.3839120446050893E-3,2.0605407167168083E-3,0,1.0775339952628541E-36,0,1.0397721674125642E-33,0,1.5065374467074959E-38]
[350,1.2114503347578838E-2,1.9221808572804432E-2,0,6.7329782069280863E-34,0,1.2247581712918256E-32,0,6.03065935370926E-37,null,350,1.2114378688506816E-2,1.9032185158168492E-2,0,1.8559036414539414E-34,0,1.9546412823461936E-32,0,5.438458630641315E-37,null,350,9.3707663821536547E-6,1.4500880505886153E-5,0,1.7026198880842065E-38,0,1.5008599618708775E-35,0,3.6434539282923162E-40,null,350,1.3941940908878529E-3,2.1684409770934498E-3,0,4.5730427042289597E-36,0,2.3433421027162201E-33,0,5.6773153720814555E-38]
[360,1.2192139723142936E-2,2.0136298412682819E-2,0,2.2326889177780984E-33,0,0,0,2.9289770080601176E-36,null,360,1.2192031812987976E-2,1.9950211685727887E-2,0,8.0542690079241108E-34,0,9.380569996996195E-33,0,2.6235131008521705E-36,null,360,9.4308533263605236E-6,1.5215004660101687E-5,0,9.6460393392822891E-38,0,2.461106685357558E-35,0,1.7180391765794059E-39,null,360,1.4031328899263042E-3,2.2744926322211148E-3,0,2.7885900353444777E-35,0,3.18236178225258E-33,0,2.7023552482532191E-37]
[370,1.2259032365974257E-2,2.103271582496043E-2,0,6.4027734770385643E-33,0,0,0,1.3467364132619845E-35,null,370,1.225893987507827E-2,2.0850428819456292E-2,0,2.7455273136446111E-33,0,0,0,1.2317074084746383E-35,null,370,9.4826270322105811E-6,1.5915674892248873E-5,0,5.0571118636945681E-37,0,4.368036291989274E-36,0,8.3122394191485624E-39,null,370,1.4108349180871065E-3,2.3785262771270333E-3,0,1.2586957658991764E-34,0,0,0,1.2947166482095936E-36]
[380,1.2316035286138834E-2,2.1909914306216256E-2,0,1.5677073697935498E-32,0,0,0,5.1668607627623314E-35,null,380,1.2315956987335945E-2,2.1731645670096916E-2,0,8.0784747404596175E-33,0,0,0,4.8137830996801893E-35,null,380,9.5267483056682641E-6,1.6601916773974504E-5,0,1.9380157590859459E-36,0,0,0,3.3446413243940771E-38,null,380,1.4173984844845545E-3,2.480399610725958E-3,0,4.309513913863675E-34,0,0,0,5.1582840693695898E-36]
[390,1.2363936402736154E-2,2.2766949794174873E-2,0,3.0921424418724311E-32,0,0,0,1.6797451787691608E-34,null,390,1.2363871164183509E-2,2.2592878384398021E-2,0,2.1109135913040662E-32,0,0,0,1.584393025393367E-34,null,390,9.5638268150774461E-6,1.727292148634481E-5,0,5.965582859069711E-36,0,0,0,1.1219581118300375E-37,null,390,1.4229142903679449E-3,2.5799946980868665E-3,0,1.2474964958032596E-33,0,0,0,1.7192794977834758E-35]
[400,1.2403462246524033E-2,2.3603059344707508E-2,0,4.1011645666857537E-32,0,0,0,4.7908295393380001E-34,null,400,1.2403409024810972E-2,2.3433328462460233E-2,0,4.7218283902584895E-32,0,0,0,4.5635485112035353E-34,null,400,9.5944247293487525E-6,1.7928028630060679E-5,0,1.6092420920812691E-35,0,0,0,3.2777411587547792E-37,null,400,1.4274659703952409E-3,2.677215433620643E-3,0,3.2314302699467386E-33,0,0,0,4.9994299796366654E-35]
[410,1.2435282457614119E-2,2.4417641545594383E-2,0,0,0,0,0,1.2141938389789679E-33,null,410,1.2435240291202387E-2,2.4252362818745505E-2,0,8.2098244665930141E-32,0,0,0,1.1694355317910606E-33,null,410,9.619060197721752E-6,1.8566710389391465E-5,0,3.9009450822786637E-35,0,0,0,8.5299254339132678E-37,null,410,1.4311306103356642E-3,2.7719852054953163E-3,0,7.3851770229334265E-33,0,0,0,1.294564646576477E-34]
[420,1.2460014049595292E-2,2.5210238612783882E-2,0,0,0,2.113733481167809E-31,0,2.6933955903785601E-33,null,420,1.245998205261882E-2,2.5049495538914154E-2,0,7.9327913424929673E-32,0,0,0,2.6326635904970768E-33,null,420,9.6382106489360281E-6,1.9188557021346616E-5,0,8.1687531247192099E-35,0,0,0,1.9603873804667916E-36,null,420,1.4339792378995394E-3,2.8642447565981255E-3,0,1.3815241103748331E-32,0,0,0,2.9553619038064647E-34]
[430,1.2478225424669828E-2,2.5980520090740075E-2,0,0,0,1.4745764929840462E-29,0,4.9923997387291105E-33,null,430,1.2478202781119958E-2,2.5824371258222834E-2,0,0,0,4.7008490459485971E-30,0,4.9879834475905823E-33,null,430,9.6523158978049645E-6,1.9793263618155898E-5,0,1.328462654717179E-34,0,0,0,3.8289490484890228E-36,null,430,1.4360772849165301E-3,2.9539502340276045E-3,0,1.7301254280742987E-32,0,0,0,5.7158335894239185E-34]
[440,1.2490440134330824E-2,2.672826806380885E-2,0,0,0,4.9225685159135941E-29,0,6.8160111389556302E-33,null,440,1.2490426092619586E-2,2.6576750070805458E-2,0,0,0,3.2463660786135186E-29,0,7.1145635974967137E-33,null,440,9.6617810549858206E-6,2.0380618076297968E-5,0,1.123833336828728E-34,0,6.705737940754138E-33,0,5.7834315630003452E-36,null,440,1.4374850202261405E-3,3.0410714170041489E-3,0,0,0,1.827845612632203E-30,0,8.4784016294382927E-34]
[450,1.2497140386756098E-2,2.7453363777622725E-2,0,0,0,1.100597138122953E-28,0,2.959280775336841E-33,null,450,1.2497134254657637E-2,2.7306493870058273E-2,0,0,0,9.1326687937265044E-29,0,4.148256192104675E-33,null,450,9.6669792407809212E-6,2.095049019663704E-5,0,0,0,4.0519705383649646E-32,0,4.4500567841124639E-36,null,450,1.4382579534230415E-3,3.1255901118801177E-3,0,0,0,7.5570019836579128E-30,0,6.0322772342818324E-34]
[460,1.2498770307043654E-2,2.8155775566659227E-2,0,0,0,1.8884804395416656E-28,0,0,null,460,1.249877144699193E-2,2.8013554016517235E-2,0,0,0,1.8538278979905251E-28,0,0,null,460,9.6682541077874881E-6,2.1502821836179109E-5,0,0,0,1.1042816429766312E-31,0,0,null,460,1.4384472101494283E-3,3.2074987023837324E-3,0,0,0,1.8445249940175871E-29,0,0]
[470,1.2495738959466119E-2,2.8835547984505917E-2,0,0,0,2.4310457362458185E-28,0,0,null,470,1.2495746784211744E-2,2.8697960229497478E-2,0,0,0,2.9093372080216079E-28,0,0,null,470,9.6659221793477326E-6,2.2037618031005773E-5,0,0,0,2.1989653376590484E-31,0,0,null,470,1.4380998799991831E-3,3.2867988431359908E-3,0,0,0,3.4008154445219886E-29,0,0]
[480,1.2488423143038111E-2,2.9492792036290901E-2,0,0,0,1.7528598347265102E-28,0,0,null,480,1.2488437111620999E-2,2.9359810601194355E-2,0,0,0,3.2904241054528098E-28,0,0,null,480,9.6602750126914076E-6,2.2554939011352749E-5,0,0,0,3.3993591492752739E-31,0,0,null,480,1.4372593383259968E-3,3.3635002847106892E-3,0,0,0,4.8262663999425764E-29,0,0]
[490,1.2477169972877112E-2,3.0127676417128303E-2,0,1.7286350819448549E-29,0,0,0,0,null,490,1.2477189586928058E-2,2.9999262636121408E-2,0,0,0,1.4117286273049804E-28,0,0,null,490,9.651581196315502E-6,2.3054893032591425E-5,0,0,0,3.7887278328913564E-31,0,0,null,490,1.43596554339686E-3,3.4376198189491128E-3,0,0,0,4.5618952617503767E-29,0,0]
[500,1.246229926046801E-2,3.0740419665823724E-2,0,7.4872623192454208E-29,0,0,0,0,null,500,1.246232406077828E-2,3.0616525223966934E-2,0,0,0,0,0,0,null,500,9.6400881917448269E-6,2.3537629949749552E-5,0,0,0,1.5668567903748376E-31,0,0,null,500,1.4342553103969052E-3,3.5091803338236022E-3,0,0,0,0,0,0]
[510,1.2444105705919988E-2,3.1331283148966528E-2,0,1.8488045345261604E-28,0,0,0,0,null,510,1.2444135269308397E-2,3.1211851459753727E-2,0,5.6925456387010161E-29,0,0,0,0,null,510,9.6260240298666355E-6,2.4003335467523556E-5,0,0,0,0,0,0,null,510,1.4321625637931613E-3,3.5782099677972982E-3,0,0,0,0,0,0]
[520,1.2422860915446161E-2,3.1900564796733401E-2,0,3.5485159230152142E-28,0,0,0,0,null,520,1.2422894851857956E-2,3.178553223137498E-2,0,1.9460023182534681E-28,0,0,0,0,null,520,9.6095988719964073E-6,2.4452226002501729E-5,0,0,0,0,0,0,null,520,1.4297185695752513E-3,3.6447413543365483E-3,0,3.6031466517506753E-30,0,0,0,0]
[530,1.2398815256497716E-2,3.2448593517762137E-2,0,5.6058027694443626E-28,0,0,0,0,null,530,1.2398853206344278E-2,3.2337890500604712E-2,0,4.4012047090391754E-28,0,0,0,0,null,530,9.5910064453669335E-6,2.4884544098988565E-5,0,6.3043353800298591E-32,0,0,0,0,null,530,1.4269521488164761E-3,3.7088109479271182E-3,0,2.0964938508996535E-29,0,0,0,0]
[540,1.2372199562852145E-2,3.2975724226579003E-2,0,7.1589507507102541E-28,0,0,0,2.3627106088836065E-30,null,540,1.2372241194562001E-2,3.2869276209851202E-2,0,7.9555133588685793E-28,0,0,0,1.9182405627380605E-30,null,540,9.5704253624628054E-6,2.530055434458702E-5,0,2.4101580349273492E-31,0,0,0,9.8323535789124628E-34,null,540,1.423889873949598E-3,3.7704584236578158E-3,0,5.5255325040110056E-29,0,0,0,1.7078750805149881E-31]
[550,1.2343226701099178E-2,3.3482333422659986E-2,0,6.4104569829843577E-28,0,0,0,1.0151191851117226E-29,null,550,1.2343271708883871E-2,3.3380061752606001E-2,0,1.1898807899503945E-27,0,0,0,9.4307510937753698E-30,null,550,9.5480203331642539E-6,2.5700539736208768E-5,0,5.6772385022410864E-31,0,0,0,6.4595741249176172E-33,null,550,1.4205562491039425E-3,3.8297261430950981E-3,0,1.1040399868676846E-28,0,0,0,1.0024310211597036E-30]
[560,1.2312093009333003E-2,3.3968815265718079E-2,0,4.5567565717340728E-29,0,6.6315418852824602E-28,0,2.4700757361148235E-29,null,560,1.2312141111114767E-2,3.3870637951056881E-2,0,1.4222712034971465E-27,0,0,0,2.3747471687420696E-29,null,560,9.5239432779714339E-6,2.608479845148443E-5,0,1.060933708109661E-30,0,0,0,1.7224691213488631E-32,null,560,1.4169738757165156E-3,3.8866586798187576E-3,0,1.8211137594066743E-28,0,0,0,2.6201607711761902E-30]
[570,1.2278979618296375E-2,3.4435578096921708E-2,0,0,0,1.5553196263390204E-26,0,4.7470863893688437E-29,null,570,1.2279030553818064E-2,3.4341410489585389E-2,0,1.1101517953229955E-27,0,5.6255132121390461E-27,0,4.65465734383779E-29,null,570,9.4983343502776714E-6,2.6453640984703966E-5,0,1.6553946885966604E-30,0,0,0,3.4820005922951487E-32,null,570,1.4131636046155072E-3,3.9413023985945227E-3,0,2.4902661981762134E-28,0,0,0,5.2414656377345703E-30]
[580,1.2244053664363362E-2,3.488304136035094E-2,0,0,0,4.0080961387217412E-26,0,7.7174104996237238E-29,null,580,1.2244107193454378E-2,3.4792796757494499E-2,0,0,0,2.879461494628268E-26,0,7.6904775755394593E-29,null,580,9.4713228749706405E-6,2.6807387610095675E-5,0,2.1293776620787405E-30,0,5.6925700085373555E-30,0,5.8950440312911852E-32,null,580,1.4091446756620384E-3,3.9937050827069821E-3,0,2.6279678425617726E-28,0,1.6973505407939193E-27,0,8.8017506777009166E-30]
[590,1.2207469403191507E-2,3.5311632883472957E-2,0,0,0,7.3644016874261382E-26,0,1.0693582709343307E-28,null,590,1.2207525304164106E-2,3.5225223058910841E-2,0,0,0,6.4524725559634256E-26,0,1.0843775650026401E-28,null,590,9.4430282101388208E-6,2.7146366138856363E-5,0,2.029091064196972E-30,0,3.0925023188529778E-29,0,8.5260152320647451E-32,null,590,1.4049348459448448E-3,4.0439156045085998E-3,0,1.4095871585668516E-28,0,5.6678418591053743E-27,0,1.2623818484767589E-29]
[600,1.216936923218203E-2,3.572178647934425E-2,0,0,0,1.11679488261669E-25,0,1.2095959484716209E-28,null,600,1.2169427300366185E-2,3.5639122151733447E-2,0,0,0,1.1056771008350989E-25,0,1.2586338817958905E-28,null,600,9.4135605382674114E-6,2.7470909939531228E-5,0,6.2665428496869368E-31,0,6.9837823985532996E-29,0,1.0256718052708204E-31,null,600,1.4005505074812475E-3,4.0919836347069524E-3,0,0,0,1.1429627788533481E-26,0,1.5011499714479723E-29]
[610,1.2129884629241501E-2,3.6113939836983605E-2,0,0,0,1.4422589399754858E-25,0,9.170667025895632E-29,null,610,1.2129944675651249E-2,3.6034931081413202E-2,0,0,0,1.5896569941483109E-25,0,1.0196361844035582E-28,null,610,9.3830215925810334E-6,2.7781356194353703E-5,0,0,0,1.2004219393540863E-28,0,9.0270413712972048E-32,null,610,1.3960067952880047E-3,4.1379593863614074E-3,0,0,0,1.8418869269972626E-26,0,1.2875703870138982E-29]
[620,1.2089137014849628E-2,3.6488532669538332E-2,0,0,0,1.5528214942736532E-25,0,0,null,620,1.2089198864919371E-2,3.6413089278435479E-2,0,0,0,1.945144851314548E-25,0,0,null,620,9.3515053241589572E-6,2.8078044366766088E-5,0,0,0,1.730523782229354E-28,0,1.7208228885656403E-32,null,620,1.3913176866174248E-3,4.1818933899384538E-3,0,0,0,2.5166690407319844E-26,0,1.5842525814758166E-30]
[630,1.2047238543722518E-2,3.6846005093101909E-2,0,0,0,1.2361724836990094E-25,0,0,null,630,1.2047302036212541E-2,3.6774036891863385E-2,0,0,0,1.9452803482835695E-25,0,0,null,630,9.3190985144758976E-6,2.8361314857936315E-5,0,0,0,2.1266926129086912E-28,0,0,null,630,1.3864960920906095E-3,4.2238362961639821E-3,0,0,0,2.9130743286306317E-26,0,0]
[640,1.200429283194991E-2,3.718679621160826E-2,0,0,0,2.5587112177761223E-26,0,0,null,640,1.2004357817873998E-2,3.7118213333778918E-2,0,0,0,1.3069776999874646E-25,0,0,null,640,9.2858813380378371E-6,2.8631507832200707E-5,0,0,0,2.1474938413123884E-28,0,0,null,640,1.3815539394028251E-3,4.2638387037156351E-3,0,0,0,2.6752020577010604E-26,0,0]
[650,1.196039562503381E-2,3.7511342885784935E-2,0,1.6514956032010479E-26,0,0,0,0,null,650,1.1960461966705414E-2,3.744605601207332E-2,0,0,0,0,0,0,null,650,9.2519278793345072E-6,2.8888962193419177E-5,0,0,0,1.4918717617209353E-28,0,0,null,650,1.3765022502264348E-3,4.3019510091121052E-3,0,0,0,1.3842220427610641E-26,0,0]
[660,1.1915635411721861E-2,3.7820078666412918E-2,0,6.3143199026851348E-26,0,0,0,0,null,660,1.1915702981886541E-2,3.7757999231495976E-2,0,0,0,0,0,0,null,660,9.2173066077774142E-6,2.9134014696129434E-5,0,0,0,0,0,0,null,660,1.3713512108725812E-3,4.3382232764148541E-3,0,0,0,0,0,0]
[670,1.1870093988195496E-2,3.8113432874128252E-2,0,1.3189720141087514E-25,0,0,0,0,null,670,1.1870162669205144E-2,3.8054473244683744E-2,0,4.0209050657487478E-26,0,0,0,0,null,670,9.1820808142657386E-6,2.9366999176932503E-5,0,0,0,0,0,0,null,670,1.366110237237304E-3,4.3727051246158334E-3,0,0,0,0,0,0]
[680,1.1823846976666335E-2,3.8391829809774486E-2,0,2.2041352666513778E-25,0,0,0,0,null,680,1.1823916659749054E-2,3.8335903436915876E-2,0,1.297140729837588E-25,0,0,0,0,null,680,9.1463090124863943E-6,2.9588245893058955E-5,0,0,0,0,0,0,null,680,1.3607880345020431E-3,4.405445630776059E-3,0,0,0,0,0,0]
[690,1.1776964302329555E-2,3.8655688081132594E-2,0,3.1922676689141883E-25,0,0,0,0,null,690,1.1777034886900555E-2,3.8602709630027744E-2,0,2.5771853255047428E-25,0,0,0,0,null,690,9.1100453079414527E-6,2.9798080956477191E-5,0,6.1733416280403076E-30,0,0,0,0,null,690,1.355392652038328E-3,4.4364932472159705E-3,0,1.0519803264668604E-26,0,0,0,0]
[700,1.1729510631953009E-2,3.8905420033067115E-2,0,4.0965487708875682E-25,0,0,0,0,null,700,1.172958202498571E-2,3.8855305492289618E-2,0,4.1791607779616228E-25,0,0,0,0,null,700,9.0733397373462125E-6,2.9996825853029756E-5,0,1.0538850080845365E-28,0,0,0,0,null,700,1.349931533894343E-3,4.4658957311945486E-3,0,2.839820705750957E-26,0,0,0,0]
[710,1.1681545777434205E-2,3.9141431269697373E-2,0,4.6269786911872436E-25,0,0,0,0,null,710,1.1681617892875673E-2,3.9094098042532534E-2,0,5.9110892657743831E-25,0,0,0,0,null,710,9.0362385808561832E-6,3.0184797037144768E-5,0,2.5918715896181607E-28,0,0,0,0,null,710,1.3444115652542681E-3,4.4937000857071668E-3,0,5.3100591465248728E-26,0,0,0,0]
[720,1.1633125067221124E-2,3.9364120258285555E-2,0,4.3968786193667937E-25,0,0,0,4.152107214134872E-27,null,720,1.1633197825466884E-2,3.9319487238052217E-2,0,7.4201805515111236E-25,0,0,0,3.6333555452255807E-27,null,720,8.9987846495058098E-6,3.036230559380645E-5,0,4.671116139512741E-28,0,0,0,2.1979666155322756E-30,null,720,1.3388391151897255E-3,4.5199525101614884E-3,0,8.3069874759827606E-26,0,0,0,3.5758253519091131E-28]
[730,1.1584299688153015E-2,3.9573878005563584E-2,0,2.9536127168719448E-25,0,0,0,1.17402874525793E-26,null,730,1.1584373015558152E-2,3.9531865636741645E-2,0,8.1809817989169622E-25,0,0,0,1.1148949071231491E-26,null,730,8.9610175496884458E-6,3.0529656960109481E-5,0,7.1429388140138577E-28,0,0,0,7.9103001171194057E-30,null,730,1.3332200760166814E-3,4.5446983598082342E-3,0,1.1435606696122391E-25,0,0,0,1.2128246386827479E-27]
[740,1.1535117000195858E-2,3.9771087798313849E-2,0,0,0,6.4481554933086584E-25,0,2.2358367913127194E-26,null,740,1.1535190828607969E-2,3.9731618125102931E-2,0,7.5155298911838579E-25,0,0,0,2.179102248702093E-26,null,740,8.9229739266922068E-6,3.0687150699731509E-5,0,9.6619258440103701E-28,0,0,0,1.6148102664808047E-29,null,740,1.3275598995195895E-3,4.5679821129534304E-3,0,1.4012217763478843E-25,0,0,0,2.4386050336656512E-27]
[750,1.1485620826468953E-2,3.9956125000710371E-2,0,0,0,2.8916260807536962E-24,0,3.5662529321138504E-26,null,750,1.1485695092836179E-2,3.9919121704496574E-2,0,4.655557835029306E-25,0,1.5542644134530459E-24,0,3.527507418356856E-26,null,750,8.8846876891276872E-6,3.0835080324186944E-5,0,1.1649943263931528E-27,0,0,0,2.6762206762173452E-29,null,750,1.3218636303463907E-3,4.5898473450352159E-3,0,1.5053742164221199E-25,0,0,0,4.0091750130684528E-27]
[760,1.1435851720235366E-2,4.0129356901880374E-2,0,0,0,5.8263357301783574E-24,0,5.0503780401469938E-26,null,760,1.1435926366198687E-2,4.0094745328875456E-2,0,0,0,4.6085025262719234E-24,0,5.0512448268805671E-26,null,760,8.8461902155113393E-6,3.097373315549852E-5,0,1.2292547732875686E-27,0,1.4345817076713697E-27,0,3.8984416915136245E-29,null,760,1.3161359367366583E-3,4.6103367087889594E-3,0,1.3325759545657623E-25,0,3.318062289418439E-25,0,5.8065001042973628E-27]
[770,1.1385847211193068E-2,4.0291142607713194E-2,0,0,0,9.290099547717314E-24,0,6.4709724467387765E-26,null,770,1.1385922182740005E-2,4.025884978796445E-2,0,0,0,8.4582296100843939E-24,0,6.5380115816889043E-26,null,770,8.8075105448439304E-6,3.1103390225374038E-5,0,1.0583220888241226E-27,0,4.5765783027050041E-27,0,5.1235599926607527E-29,null,770,1.3103811388725502E-3,4.6294919197741565E-3,0,7.4651409919293184E-26,0,7.9809529859890581E-25,0,7.5923912003350598E-27]
[780,1.1335642032334654E-2,4.044183297162824E-2,0,0,0,1.297878580906872E-23,0,7.4955011647847004E-26,null,780,1.1335717279483983E-2,4.0411787630425654E-2,0,0,0,1.2849583852310174E-23,0,7.6575752373846078E-26,null,780,8.7686755521181381E-6,3.1224326206619447E-5,0,5.4272966902862853E-28,0,8.5494773736672845E-27,0,6.0995471989158969E-29,null,780,1.3046032350003058E-3,4.6473537466290866E-3,0,0,0,1.3672725202770591E-24,0,8.9900343315316536E-27]
[790,1.1285268329213496E-2,4.058177055952631E-2,0,0,0,1.6436470522716628E-23,0,7.6782416875104921E-26,null,790,1.1285343805709294E-2,4.0553903122138454E-2,0,0,0,1.7347353007713768E-23,0,7.9621569066296093E-26,null,790,8.7297101103075992E-6,3.1336809372789357E-5,0,0,0,1.3095646836267587E-26,0,6.4784851612564537E-29,null,790,1.2988059255145733E-3,4.6639620054763596E-3,0,0,0,1.9958885874957573E-24,0,9.4823907478527455E-27]
[800,1.1234755852936427E-2,4.0711289644726339E-2,0,0,0,1.9067889602891494E-23,0,6.4833329352882708E-26,null,800,1.1234831515962579E-2,4.0685532235302142E-2,0,0,0,2.1335398836425686E-23,0,6.9078058863980308E-26,null,800,8.6906372396185335E-6,3.1441101582715173E-5,0,0,0,1.7772064254821352E-26,0,5.8310422561605306E-29,null,800,1.2929926351758175E-3,4.6793555579758058E-3,0,0,0,2.61500369514997E-24,0,8.434777935955745E-27]
[810,1.1184132138307575E-2,4.0830716229051829E-2,0,0,0,2.017278701164861E-23,0,3.3332395353275196E-26,null,810,1.1184207948238319E-2,4.0807002664431997E-2,0,0,0,2.4041619510221446E-23,0,3.9015470697864341E-26,null,810,8.6514782454090092E-6,3.1537458286699706E-5,0,0,0,2.195115555013211E-26,0,3.6812605004939559E-29,null,810,1.2871665336205743E-3,4.6935723125578433E-3,0,0,0,3.1313849172870335E-24,0,5.14749171631359E-27]
[820,1.1133422668109861E-2,4.0940368086729614E-2,0,0,0,1.9002862823166587E-23,0,0,null,820,1.1133498588275623E-2,4.0918633865838869E-2,0,0,0,2.4589946222367696E-23,0,0,null,820,8.6122528452318952E-6,3.1626128551708224E-5,0,0,0,2.4846670124339271E-26,0,0,null,820,1.2813305542648283E-3,4.7066492284395071E-3,0,0,0,3.4322599296044731E-24,0,0]
[830,1.1082651024858977E-2,4.1040554828006219E-2,0,0,0,1.4839367685334677E-23,0,0,null,830,1.1082727021335372E-2,4.102073711742369E-2,0,0,0,2.2078927744767883E-23,0,0,null,830,8.5729792863047662E-6,3.1707355102941721E-5,0,0,0,2.5566982695787648E-26,0,0,null,830,1.2754874117840817E-3,4.7186223220500824E-3,0,0,0,3.3938267712454335E-24,0,0]
[840,1.1031839030906284E-2,4.1131577979830525E-2,0,0,0,7.086592395596212E-24,0,0,null,840,1.1031915072277651E-2,4.1113615596014307E-2,0,0,0,1.5683147585366222E-23,0,0,null,840,8.5336744539260625E-6,3.1781374379701047E-5,0,0,0,2.3195195311556838E-26,0,0,null,840,1.2696396182298301E-3,4.7295266755392213E-3,0,0,0,2.8932882831844485E-24,0,0]
[850,1.0981006877850601E-2,4.1213731081201153E-2,0,6.1794171276735993E-25,0,0,0,0,null,850,1.0981082935073437E-2,4.1197564469956351E-2,0,0,0,4.7704090412099832E-24,0,0,null,850,8.4943539715573218E-6,3.1848416603495879E-5,0,0,0,1.6892052340100264E-26,0,0,null,850,1.2637894979373988E-3,4.739396447086406E-3,0,0,0,1.8237176057426869E-24,0,0]
[860,1.09301732461106E-2,4.128729979099497E-2,0,5.868119032338632E-24,0,0,0,0,null,860,1.0930249292299099E-2,4.1272871004462391E-2,0,0,0,0,0,0,null,860,8.4550322933923741E-6,3.1908705856674427E-5,0,0,0,6.0143531637097031E-27,0,0,null,860,1.2579392012803206E-3,4.7482648827504954E-3,0,0,0,1.10620388568305E-25,0,0]
[870,1.0879355415416707E-2,4.1352562006365931E-2,0,1.2734132087440057E-23,0,0,0,0,null,870,1.087943142572609E-2,4.1339814678033625E-2,0,1.7813984230013551E-24,0,0,0,0,null,870,8.415722789833683E-6,3.1962460169920157E-5,0,0,0,0,0,0,null,870,1.2520907173964621E-3,4.7561643296103913E-3,0,0,0,0,0,0]
[880,1.0828569366969047E-2,4.1409787990038208E-2,0,2.1021163759587433E-23,0,0,0,0,null,880,1.0828645318394815E-2,4.139866730803686E-2,0,1.0639039250130565E-23,0,0,0,0,null,880,8.376437826538556E-6,3.2009891617345207E-5,0,0,0,0,0,0,null,880,1.2462458859474961E-3,4.7631262500206122E-3,0,0,0,0,0,0]
[890,1.0777829877850661E-2,4.1459240504979941E-2,0,3.0302339062858345E-23,0,0,0,0,null,890,1.0777905749159492E-2,4.1449693183958532E-2,0,2.2036293197704797E-23,0,0,0,0,null,890,8.3371888374701038E-6,3.2051206417851794E-5,0,0,0,0,0,0,null,890,1.240406407982182E-3,4.7691812367773442E-3,0,3.7355055833476731E-25,0,0,0,0]
[900,1.0727150608519864E-2,4.1501174955127181E-2,0,3.9895509058648138E-23,0,0,1.6863645436818073E-40,0,null,900,1.072722638004592E-2,4.1493149207023634E-2,0,3.5591436170178038E-23,0,0,1.1070012037946351E-40,0,null,900,8.297986392588686E-6,3.2086605041672495E-5,0,3.3186559017137829E-27,0,0,0,0,null,900,1.2345738560145757E-3,4.774359029048143E-3,0,1.961499267893482E-24,0,0,0,0]
[910,1.0676544183495038E-2,4.1535839530817589E-2,0,4.8860824508425034E-23,0,0,2.6334400815927357E-40,0,null,910,1.0676619837106405E-2,4.1529285034692949E-2,0,5.0549829433149245E-23,0,0,2.6012877747105704E-40,0,null,910,8.258840260309197E-6,3.211628232106563E-5,0,1.6283426305847185E-26,0,0,0,0,null,910,1.2287496833083553E-3,4.778688528887666E-3,0,3.9889790796819691E-24,0,0,0,0]
[920,1.0626022266224514E-2,4.1563475358125455E-2,0,5.6023771380737637E-23,0,0,3.0858203584930539E-40,0,null,920,1.0626097785138117E-2,4.155834322933305E-2,0,6.5756654643893429E-23,0,0,4.3678212028557525E-40,0,null,920,8.2197594654138962E-6,3.214042756440478E-5,0,3.2782412332865386E-26,0,0,0,0,null,920,1.2229352324910181E-3,4.7821978182668E-3,0,6.3847151606640057E-24,0,0,0,0]
[930,1.0575595628312572E-2,4.1584316651043104E-2,0,6.0026638554068687E-23,0,0,2.1419483332387517E-40,0,null,930,1.0575670997054087E-2,4.1580559409855992E-2,0,7.9664188010786528E-23,0,0,5.5345412050222116E-40,0,null,930,8.1807523426125706E-6,3.2159224672830784E-5,0,5.2231501782072402E-26,0,0,0,0,null,930,1.2171317435333002E-3,4.7849141764579467E-3,0,9.0129034707797936E-24,0,0,0,0]
[940,1.0525274213589361E-2,4.1598590865512368E-2,0,5.9409169647480348E-23,0,0,0,2.1832877220822649E-25,null,940,1.0525349417867057E-2,4.1596162405415214E-2,0,9.0379929807977444E-23,0,0,4.5691833793160232E-40,1.4816590139741109E-25,null,940,8.1418265861275193E-6,3.2172852258650862E-5,0,7.3529836449992988E-26,0,0,0,3.0876851559280835E-29,null,940,1.211340361115656E-3,4.7868640976771269E-3,0,1.1669196710314045E-23,0,0,1.0239285186803034E-40,8.7915117990383681E-27]
[950,1.0475067197540855E-2,4.1606518854964657E-2,0,5.271657745057689E-23,0,0,0,1.035856612910357E-24,null,950,1.0475142224181428E-2,4.160537441071134E-2,0,9.575896396261307E-23,0,0,0,9.6326983327909452E-25,null,950,8.1029892956664353E-6,3.2181483765235589E-5,0,9.5028803670066001E-26,0,0,0,6.5737331751899049E-28,null,950,1.2055621414724536E-3,4.7880733089341061E-3,0,1.4082701607231979E-23,0,0,0,1.0222540540576932E-25]
[960,1.0424983042226344E-2,4.1608315026323679E-2,0,3.8630377025320084E-23,0,0,0,2.073766374488044E-24,null,960,1.042505787905597E-2,4.1608411141940596E-2,0,9.3540283639553955E-23,0,0,0,2.0055714058707571E-24,null,960,8.0642470189321046E-6,3.2185287587443454E-5,0,1.1454892431030223E-25,0,0,0,1.4674785694223952E-27,null,960,1.1997980587153071E-3,4.7885667879588312E-3,0,1.5924994417136694E-23,0,0,0,2.2258785172809112E-25]
[970,1.0375029547251946E-2,4.160418749619442E-2,0,1.6114854668004329E-23,0,0,0,3.3077870748356665E-24,null,970,1.0375104183086733E-2,4.1605481992976451E-2,0,8.1522764817590736E-23,0,0,0,3.2526233732747513E-24,null,970,8.0256057910628331E-6,3.2184427192450036E-5,0,1.2945256131050076E-25,0,0,0,2.4460582080517007E-27,null,970,1.194049010696944E-3,4.7883687811845219E-3,0,1.682664535752433E-23,0,0,0,3.6751433547137757E-25]
[980,1.0325213896965566E-2,4.1594338246607528E-2,0,0,0,2.7491604926202645E-23,0,4.6877038084258979E-24,null,980,1.032528832148402E-2,4.1596790191251676E-2,0,5.7772339079839026E-23,0,0,0,4.6557383375386208E-24,null,980,7.9870711711024112E-6,3.2179061240446543E-5,0,1.3677628570304065E-25,0,0,0,3.5573599043014695E-27,null,980,1.1883158244464611E-3,4.7875028216918438E-3,0,1.6401115107815162E-23,0,0,0,5.3158818869063552E-25]
[990,1.0275542704333266E-2,4.1578963279997438E-2,0,0,0,1.1376533048646007E-22,0,6.1348209829752209E-24,null,990,1.0275616908060127E-2,4.1582532952915974E-2,0,2.0848072877275236E-23,0,6.2300720202111062E-23,0,6.1372393099949492E-24,null,990,7.94864827601779E-6,3.2169343704838946E-5,0,1.3342177054471585E-25,0,0,0,4.7426323505511898E-27,null,990,1.1825992612218622E-3,4.785991747089928E-3,0,1.4275196925522015E-23,0,0,0,7.0599909335226303E-25]
[1000,1.022602205129532E-2,4.1558252772788927E-2,0,0,0,2.151882837409538E-22,5.1534878555429912E-39,7.5412780537294944E-24,null,1000,1.0226096025508571E-2,4.1562901636730723E-2,0,0,0,1.7021272714351509E-22,0,7.5895631692584515E-24,null,1000,7.9103418119033315E-6,3.2155423991598375E-5,0,1.1639862598761391E-25,0,5.4303256269118501E-26,0,5.9191750977343488E-27,null,1000,1.1769000211513852E-3,4.783857717257132E-3,0,1.0124484607689557E-23,0,1.2444976275736123E-23,0,8.7841464928520378E-25]
[]
[]
["Saved  28/02/2023: 15:45:21  Level Number: 5"]
[]
["BREAKTHROUGH RESULTS"]
[]
["Advanced"]
["Pollutant Linkage: Inert Restorati, Attenution Layer, Beenham Grange Formation",null,null,null,null,null,null,null,null,null,"Pollutant Linkage: Inert Restorati, Attenution Layer, Beenham Grange Formation, Groundwater ",null,null,null,null,null,null,null,null,null,"Pollutant Linkage: Inert Restorati, Attenution Layer, Beenham Grange Formation, River Enborne",null,null,null,null,null,null,null,null,null,"Pollutant Linkage: Inert Restorati, Attenution Layer, Beenham Grange Formation, Spring Ditch"]
["Concentrations in mg/L in Beenham Grange Formation",null,null,null,null,null,null,null,null,null,"Concentrations in mg/L in Groundwater ",null,null,null,null,null,null,null,null,null,"Concentrations in mg/L in River Enborne",null,null,null,null,null,null,null,null,null,"Concentrations in mg/L in Spring Ditch"]
[]
["Compared with EAL (GW) target concentration in mg/L",null,null,null,null,null,null,null,null,null,"Compared with EAL (GW) target concentration in mg/L",null,null,null,null,null,null,null,null,null,"Compared with EAL (River Enborne) target concentration in mg/L",null,null,null,null,null,null,null,null,null,"Compared with EAL (Spring Ditch) target concentration in mg/L"]
[null,0.39,4.8199999999999993E-2,1E-3,4.3649999999999991E-3,2.0000000000000002E-5,2E-3,2.0000000000000001E-4,1E-3,null,null,0.39,4.8199999999999993E-2,1E-3,4.3649999999999991E-3,2.0000000000000002E-5,2E-3,2.0000000000000001E-4,1E-3,null,null,0.39,2.76E-2,4.7000000000000002E-3,2.8000000000000001E-2,5.0000000000000001E-4,1.75E-3,1.1999999999999999E-3,1E-3,null,null,0.39,0.03,4.7000000000000002E-3,2.8000000000000001E-2,5.0000000000000001E-4,1.5E-3,1.1999999999999999E-3,5.0000000000000001E-3]
[]
["Time(years)","Species1","Species2","Species3","Species4","Species5","Species6","Species7","Species8",null,"Time(years)","Species1","Species2","Species3","Species4","Species5","Species6","Species7","Species8",null,"Time(years)","Species1","Species2","Species3","Species4","Species5","Species6","Species7","Species8",null,"Time(years)","Species1","Species2","Species3","Species4","Species5","Species6","Species7","Species8"]
[null,"Ammoniacal Nitrogen","Barium","Total Chromiun","Copper","Mercury","Molybdenum","Lead","Antimony",null,null,"Ammoniacal Nitrogen","Barium","Total Chromiun","Copper","Mercury","Molybdenum","Lead","Antimony",null,null,"Ammoniacal Nitrogen","Barium","Total Chromiun","Copper","Mercury","Molybdenum","Lead","Antimony",null,null,"Ammoniacal Nitrogen","Barium","Total Chromiun","Copper","Mercury","Molybdenum","Lead","Antimony"]
[10,1.5971076978511836E-12,1.9592882057883589E-22,0,0,0,0,0,0,null,10,1.5421941182368864E-12,0,0,0,0,0,0,0,null,10,1.1322049814174945E-15,4.2947608655767881E-26,0,0,0,0,0,0,null,10,1.7140472199286931E-13,2.1454872483302177E-24,0,0,0,0,0,0]
[20,2.0793731263382399E-7,1.514522300131767E-15,0,0,0,0,0,0,null,20,2.0609962470733467E-7,9.8414838193386251E-17,0,0,0,0,0,0,null,20,1.5731678858711293E-10,2.7141082008489792E-21,0,0,0,0,0,0,null,20,2.3509779450370226E-8,1.3469212170529802E-18,0,0,0,0,0,0]
[30,1.1034568439612781E-5,5.9553996920910681E-11,0,0,0,0,0,0,null,30,1.0990737887735778E-5,1.527668104815454E-11,0,0,0,0,0,0,null,30,8.4511053228842374E-9,2.026682266119852E-15,0,0,0,0,0,0,null,30,1.2598656687105035E-6,5.2655529996755895E-13,0,0,0,0,0,0]
[40,8.1508033502182914E-5,1.2168553082699859E-8,0,0,0,0,0,0,null,40,8.1324882738976312E-5,5.46517401321152E-9,0,0,0,0,0,0,null,40,6.2695714147434928E-8,1.3796354840328518E-12,0,0,0,0,0,0,null,40,9.3384028957929163E-6,2.9495339401679764E-10,0,0,0,0,0,0]
[50,2.7162932263881373E-4,3.0073506393203505E-7,0,0,0,0,0,0,null,50,2.7123795568040441E-4,1.7812487323242394E-7,0,0,0,0,0,0,null,50,2.0935886099683981E-7,6.4165196876408821E-11,0,0,0,0,0,0,null,50,3.1170987982515597E-5,1.2273490793952907E-8,0,0,0,0,0,0]
[60,6.0607604392679492E-4,2.5744265005620261E-6,0,0,0,0,0,0,null,60,6.0547037699042823E-4,1.7813760213223917E-6,0,0,0,0,0,0,null,60,4.6765105130272194E-7,7.949137692768193E-10,0,0,0,0,0,0,null,60,6.9612153445574915E-5,1.4196169178064071E-7,0,0,0,0,0,0]
[70,1.0735228512342055E-3,1.1997461551384742E-5,0,0,0,0,0,0,null,70,1.072737812573826E-3,9.1347891314368461E-6,0,0,0,0,0,0,null,70,8.28891106413946E-7,4.6766456535406571E-9,0,0,0,0,0,0,null,70,1.2336794426748613E-4,7.9859471336750478E-7,0,0,0,0,0,0]
[80,1.644514474433492E-3,3.8181386145270564E-5,0,0,0,0,0,0,null,80,1.6435996995420427E-3,3.0957200636097182E-5,0,0,0,0,0,0,null,80,1.2703228040342083E-6,1.7388821510174244E-8,0,0,0,0,0,0,null,80,1.890518291135969E-4,2.879919858584127E-6,0,0,0,0,0,0]
[90,2.285589878777609E-3,9.4145427487976849E-5,0,0,0,0,0,0,null,90,2.284594143083212E-3,7.9724599668805387E-5,0,0,0,0,0,0,null,90,1.7660611846068298E-6,4.7799610427254138E-8,0,0,0,0,0,0,null,90,2.6281267945855552E-4,7.7468252997320072E-6,0,0,0,0,0,0]
[100,2.966449207171787E-3,1.9405069265059766E-4,0,0,0,0,0,0,null,100,2.9654138374854478E-3,1.6955262841302751E-4,0,0,0,0,0,0,null,100,2.2926538150182738E-6,1.0659795050562322E-7,0,0,0,0,0,0,null,100,3.411616595440455E-4,1.700456894023787E-5,0,0,0,0,0,0]
[110,3.6624976411763679E-3,3.5094715392666764E-4,0,0,0,0,0,0,null,110,3.6614548984028115E-3,3.1386528648373266E-4,0,0,0,0,0,0,null,110,2.8310581800580097E-6,2.0446744653597021E-7,0,0,0,0,0,0,null,110,4.2126613688801227E-4,3.2230685590616716E-5,0,0,0,0,0,0]
[120,4.3550678147952805E-3,5.7523016667495295E-4,0,0,0,0,0,0,null,120,4.35404150734692E-3,5.2368210566945456E-4,0,0,0,0,0,0,null,120,3.3668180466249283E-6,3.5058476589622754E-7,0,0,0,0,0,0,null,120,5.0097579310463792E-4,5.4759778034065995E-5,0,0,0,0,0,0]
[130,5.0306954130721095E-3,8.7392574503471925E-4,0,0,0,0,0,0,null,130,5.0297022870654127E-3,8.0674176012729502E-4,0,0,0,0,0,0,null,130,3.8895046177182178E-6,5.5174517273653338E-7,0,0,0,0,0,0,null,130,5.7873943366228034E-4,8.5563259478592198E-5,0,0,0,0,0,0]
[140,5.6801313262911076E-3,1.2506281536280228E-3,0,0,0,0,0,0,null,140,5.6791825616559185E-3,1.167324930827452E-3,0,0,0,0,0,0,null,140,4.3919526038196922E-6,8.1207426869929596E-7,0,0,0,0,0,0,null,140,6.5349132406287709E-4,1.2521431057861343E-4,0,0,0,0,0,0]
[150,6.2973874622400967E-3,1.705843454469344E-3,0,0,0,0,0,0,null,150,6.2964900079692547E-3,1.6065327371765992E-3,0,0,0,0,0,0,null,150,4.8695218133954017E-6,1.1331509591399841E-6,0,0,0,0,0,0,null,150,7.2454133816840115E-4,1.7391110456695656E-4,0,0,0,0,0,0]
[160,6.8789227074419774E-3,2.23752960938336E-3,0,0,0,0,0,0,null,160,6.8780803786296805E-3,2.1227997772582568E-3,0,0,0,0,0,0,null,160,5.3194670038013248E-6,1.5143607368313742E-6,0,0,0,0,0,0,null,160,7.9148121803295239E-4,2.315317907214146E-4,0,0,0,0,0,0]
[170,7.4229896580184857E-3,2.8416893241840517E-3,0,0,0,0,0,0,null,170,7.4222039979847379E-3,2.7124843632590403E-3,0,0,0,0,0,0,null,170,5.7404320995778592E-6,1.9533417492790903E-6,0,0,0,0,0,0,null,170,8.5410933699093259E-4,2.9770154645884713E-4,0,0,0,0,0,0]
[180,7.9291282953363549E-3,3.5129310837011024E-3,0,0,0,0,0,0,null,180,7.9283992352803343E-3,3.3704404146876268E-3,0,0,0,0,0,0,null,180,6.1320581405635042E-6,2.4464358717580697E-6,0,0,0,0,0,0,null,180,9.1237238165561992E-4,3.7185934660440424E-4,0,0,0,0,0,0]
[190,8.3977820217945483E-3,4.2449567699462832E-3,0,0,0,0,0,0,null,190,8.3971083767324928E-3,4.0905219044039655E-3,0,0,0,0,0,0,null,190,6.4946859549560015E-6,2.9890968789830667E-6,0,0,0,0,0,0,null,190,9.6632112490865798E-4,4.5331783897254938E-4,0,0,0,0,0,0]
[200,8.8300108250256477E-3,5.0309615673169638E-3,0,0,0,0,0,0,null,200,8.8293906619043884E-3,4.8660010065052937E-3,0,0,0,0,0,0,null,200,6.8291340341475641E-6,3.5762348826855117E-6,0,0,0,0,0,0,null,200,1.0160773853777742E-3,5.4131355709316519E-4,0,0,0,0,0,0]
[210,9.2272794590234752E-3,5.863947413886122E-3,0,0,0,0,0,0,null,210,9.2267103670920329E-3,5.689898735305959E-3,0,0,0,0,0,0,null,210,7.1365344940607358E-6,4.2024925723125617E-6,0,0,0,0,0,0,null,210,1.0618096273183866E-3,6.3504699522300135E-4,0,0,0,0,0,0]
[220,9.5913026016943067E-3,6.7369590025418598E-3,0,0,0,0,0,0,null,220,9.5907818891126876E-3,6.555235941587639E-3,0,0,0,0,0,0,null,220,7.4182131561982924E-6,4.86245761239563E-6,0,0,0,0,0,0,null,220,1.1037151232661242E-3,7.3371328824357754E-4,0,0,0,0,0,0]
[230,9.9239328208002801E-3,7.643254328664844E-3,0,0,0,3.3538597087754569E-40,0,0,null,230,9.9234576560632507E-3,7.4552163089550661E-3,0,0,0,2.1657358324548515E-40,0,0,null,230,7.6756027784825559E-6,5.5508195560983927E-6,0,0,0,0,0,0,null,230,1.1420070476590271E-3,8.3652477751232888E-4,0,0,0,0,0,0]
[240,1.0227080464544196E-2,8.5764221136639777E-3,0,0,0,0,0,0,null,240,1.0226647976883569E-2,8.3833537479100495E-3,0,0,0,8.5438057240627883E-40,0,0,null,240,7.91018100835089E-6,6.2624808209937222E-6,0,0,0,0,0,0,null,240,1.1769052478343243E-3,9.4272688792138178E-4,0,0,0,1.86092568670234E-40,0,0]
[250,1.050265722687071E-2,9.530457427231312E-3,0,0,0,0,0,0,null,250,1.0502264576308408E-2,9.3335557787034909E-3,0,0,0,0,0,0,null,250,8.1234266697668648E-6,6.9926309492532096E-6,0,0,0,0,0,0,null,250,1.2086297421369573E-3,1.051608676853026E-3,0,0,0,0,0,0]
[260,1.0752537185553183E-2,1.049980526861718E-2,0,3.4671294311057285E-40,0,7.4443487305188611E-38,0,0,null,260,1.0752181610620299E-2,1.0300173003035514E-2,0,0,0,2.4450822834869729E-38,0,0,null,260,8.316789581544554E-6,7.7367923426975161E-6,0,0,0,0,0,0,null,260,1.2373962307638132E-3,1.1625092553270088E-3,0,0,0,0,0,0]
[270,1.097853067496495E-2,1.1479380183162129E-2,0,1.1632390343237601E-39,0,4.8494213259654691E-37,0,0,null,270,1.0978209524048283E-2,1.1278023083153014E-2,0,4.8602831826397746E-40,0,3.1447937242498113E-37,0,0,null,270,8.4916703153267255E-6,8.4908443855976669E-6,0,0,0,1.0653149078468338E-40,0,0,null,270,1.2634130850883755E-3,1.2748210899509464E-3,0,0,0,2.3883003245970862E-38,0,0]
[280,1.1182367536708711E-2,1.246456840584521E-2,0,0,0,3.2695430609387298E-36,0,0,null,280,1.1182078287479037E-2,1.2262396031545783E-2,0,6.7185012084461575E-39,0,1.404313357070496E-36,0,0,null,280,8.6494072162770387E-6,9.2510315921123914E-6,0,0,0,6.7989923676299578E-40,0,0,null,280,1.2868794172799507E-3,1.3879910055339044E-3,0,1.480821629783114E-40,0,1.0925778143004936E-37,0,0]
[290,1.136568717775863E-2,1.3451217635285543E-2,0,4.3437733982535121E-39,0,2.3603513075191038E-35,0,1.126965080953565E-40,null,290,1.1365427447976438E-2,1.3249046182168456E-2,0,0,0,1.0697022130402569E-35,0,1.0942237159128122E-40,null,290,8.7912686960150831E-6,1.0013960259582078E-5,0,0,0,2.5269549230299603E-39,0,0,null,290,1.3079839341407459E-3,1.5015195385678511E-3,0,1.6314161028064564E-39,0,5.3206947690543895E-37,0,0]
[300,1.153003352852134E-2,1.4435618377137003E-2,0,2.3706295919597702E-37,0,1.2950723588234238E-34,0,1.3375785558203552E-40,null,300,1.1529801080679157E-2,1.4234175003558966E-2,0,0,0,7.2742884135274906E-35,0,1.8470783423161291E-40,null,300,8.9184493205584871E-6,1.0776587119066783E-5,0,0,0,2.071335288919922E-38,0,0,null,300,1.3269043554217476E-3,1.6149591471533269E-3,0,0,0,4.3919017813326912E-36,0,0]
[310,1.1676853487562359E-2,1.5414479847400516E-2,0,1.2092053065617258E-36,0,5.4960931568909076E-34,0,0,null,310,1.1676646229163617E-2,1.5214407923035302E-2,0,3.5487568272378072E-37,0,3.5013681721971731E-34,0,0,null,310,9.0320685988328478E-6,1.1536202656666433E-5,0,0,0,1.324725411801999E-37,0,0,null,310,1.3438072338291314E-3,1.7279116638267648E-3,0,0,0,2.5245232280045601E-35,0,0]
[320,1.1807497808292758E-2,1.6384902670068854E-2,0,6.0366374525951906E-36,0,1.9111121408443181E-33,0,5.432495265624217E-40,null,320,1.1807313789114019E-2,1.6186767537816758E-2,0,2.0274820795228709E-36,0,1.333706203583494E-33,0,0,null,320,9.1331716627088691E-6,1.2290411120203164E-5,0,0,0,5.8159443002576403E-37,0,0,null,320,1.3588480563736507E-3,1.8400252819929025E-3,0,6.0822440578624524E-38,0,1.0481168908281819E-34,0,0]
[330,1.1923223657251009E-2,1.734435001050507E-2,0,3.4812342702036755E-35,0,5.4047082182091037E-33,0,3.1475614361246003E-38,null,330,1.1923061064570967E-2,1.7148644964763603E-2,0,5.7862842421412405E-36,0,4.254229840777919E-33,0,2.857913752257053E-38,null,330,9.2227312419978098E-6,1.3037108704744586E-5,0,1.8311729017714393E-39,0,2.0505610917899646E-36,0,0,null,330,1.3721715383286646E-3,1.950991291078102E-3,0,4.2102065611053629E-37,0,3.5917538182978315E-34,0,2.9645656068241789E-39]
[340,1.202519827809284E-2,1.8290618327098718E-2,0,1.7076080014367429E-34,0,1.1379483036970457E-32,0,1.4835592805707973E-37,null,340,1.2025055430599684E-2,1.8097770596210344E-2,0,3.111877634499488E-35,0,1.0925274864629809E-32,0,1.3890139432487151E-37,null,340,9.3016504961290838E-6,1.3774461004456273E-5,0,6.0505400897285474E-39,0,6.172915493626907E-36,0,0,null,340,1.3839120446050893E-3,2.0605407167168083E-3,0,1.0775339952628541E-36,0,1.0397721674125642E-33,0,1.5065374467074959E-38]
[350,1.2114503347578838E-2,1.9221808572804432E-2,0,6.7329782069280863E-34,0,1.2247581712918256E-32,0,6.03065935370926E-37,null,350,1.2114378688506816E-2,1.9032185158168492E-2,0,1.8559036414539414E-34,0,1.9546412823461936E-32,0,5.438458630641315E-37,null,350,9.3707663821536547E-6,1.4500880505886153E-5,0,1.7026198880842065E-38,0,1.5008599618708775E-35,0,3.6434539282923162E-40,null,350,1.3941940908878529E-3,2.1684409770934498E-3,0,4.5730427042289597E-36,0,2.3433421027162201E-33,0,5.6773153720814555E-38]
[360,1.2192139723142936E-2,2.0136298412682819E-2,0,2.2326889177780984E-33,0,0,0,2.9289770080601176E-36,null,360,1.2192031812987976E-2,1.9950211685727887E-2,0,8.0542690079241108E-34,0,9.380569996996195E-33,0,2.6235131008521705E-36,null,360,9.4308533263605236E-6,1.5215004660101687E-5,0,9.6460393392822891E-38,0,2.461106685357558E-35,0,1.7180391765794059E-39,null,360,1.4031328899263042E-3,2.2744926322211148E-3,0,2.7885900353444777E-35,0,3.18236178225258E-33,0,2.7023552482532191E-37]
[370,1.2259032365974257E-2,2.103271582496043E-2,0,6.4027734770385643E-33,0,0,0,1.3467364132619845E-35,null,370,1.225893987507827E-2,2.0850428819456292E-2,0,2.7455273136446111E-33,0,0,0,1.2317074084746383E-35,null,370,9.4826270322105811E-6,1.5915674892248873E-5,0,5.0571118636945681E-37,0,4.368036291989274E-36,0,8.3122394191485624E-39,null,370,1.4108349180871065E-3,2.3785262771270333E-3,0,1.2586957658991764E-34,0,0,0,1.2947166482095936E-36]
[380,1.2316035286138834E-2,2.1909914306216256E-2,0,1.5677073697935498E-32,0,0,0,5.1668607627623314E-35,null,380,1.2315956987335945E-2,2.1731645670096916E-2,0,8.0784747404596175E-33,0,0,0,4.8137830996801893E-35,null,380,9.5267483056682641E-6,1.6601916773974504E-5,0,1.9380157590859459E-36,0,0,0,3.3446413243940771E-38,null,380,1.4173984844845545E-3,2.480399610725958E-3,0,4.309513913863675E-34,0,0,0,5.1582840693695898E-36]
[390,1.2363936402736154E-2,2.2766949794174873E-2,0,3.0921424418724311E-32,0,0,0,1.6797451787691608E-34,null,390,1.2363871164183509E-2,2.2592878384398021E-2,0,2.1109135913040662E-32,0,0,0,1.584393025393367E-34,null,390,9.5638268150774461E-6,1.727292148634481E-5,0,5.965582859069711E-36,0,0,0,1.1219581118300375E-37,null,390,1.4229142903679449E-3,2.5799946980868665E-3,0,1.2474964958032596E-33,0,0,0,1.7192794977834758E-35]
[400,1.2403462246524033E-2,2.3603059344707508E-2,0,4.1011645666857537E-32,0,0,0,4.7908295393380001E-34,null,400,1.2403409024810972E-2,2.3433328462460233E-2,0,4.7218283902584895E-32,0,0,0,4.5635485112035353E-34,null,400,9.5944247293487525E-6,1.7928028630060679E-5,0,1.6092420920812691E-35,0,0,0,3.2777411587547792E-37,null,400,1.4274659703952409E-3,2.677215433620643E-3,0,3.2314302699467386E-33,0,0,0,4.9994299796366654E-35]
[410,1.2435282457614119E-2,2.4417641545594383E-2,0,0,0,0,0,1.2141938389789679E-33,null,410,1.2435240291202387E-2,2.4252362818745505E-2,0,8.2098244665930141E-32,0,0,0,1.1694355317910606E-33,null,410,9.619060197721752E-6,1.8566710389391465E-5,0,3.9009450822786637E-35,0,0,0,8.5299254339132678E-37,null,410,1.4311306103356642E-3,2.7719852054953163E-3,0,7.3851770229334265E-33,0,0,0,1.294564646576477E-34]
[420,1.2460014049595292E-2,2.5210238612783882E-2,0,0,0,2.113733481167809E-31,0,2.6933955903785601E-33,null,420,1.245998205261882E-2,2.5049495538914154E-2,0,7.9327913424929673E-32,0,0,0,2.6326635904970768E-33,null,420,9.6382106489360281E-6,1.9188557021346616E-5,0,8.1687531247192099E-35,0,0,0,1.9603873804667916E-36,null,420,1.4339792378995394E-3,2.8642447565981255E-3,0,1.3815241103748331E-32,0,0,0,2.9553619038064647E-34]
[430,1.2478225424669828E-2,2.5980520090740075E-2,0,0,0,1.4745764929840462E-29,0,4.9923997387291105E-33,null,430,1.2478202781119958E-2,2.5824371258222834E-2,0,0,0,4.7008490459485971E-30,0,4.9879834475905823E-33,null,430,9.6523158978049645E-6,1.9793263618155898E-5,0,1.328462654717179E-34,0,0,0,3.8289490484890228E-36,null,430,1.4360772849165301E-3,2.9539502340276045E-3,0,1.7301254280742987E-32,0,0,0,5.7158335894239185E-34]
[440,1.2490440134330824E-2,2.672826806380885E-2,0,0,0,4.9225685159135941E-29,0,6.8160111389556302E-33,null,440,1.2490426092619586E-2,2.6576750070805458E-2,0,0,0,3.2463660786135186E-29,0,7.1145635974967137E-33,null,440,9.6617810549858206E-6,2.0380618076297968E-5,0,1.123833336828728E-34,0,6.705737940754138E-33,0,5.7834315630003452E-36,null,440,1.4374850202261405E-3,3.0410714170041489E-3,0,0,0,1.827845612632203E-30,0,8.4784016294382927E-34]
[450,1.2497140386756098E-2,2.7453363777622725E-2,0,0,0,1.100597138122953E-28,0,2.959280775336841E-33,null,450,1.2497134254657637E-2,2.7306493870058273E-2,0,0,0,9.1326687937265044E-29,0,4.148256192104675E-33,null,450,9.6669792407809212E-6,2.095049019663704E-5,0,0,0,4.0519705383649646E-32,0,4.4500567841124639E-36,null,450,1.4382579534230415E-3,3.1255901118801177E-3,0,0,0,7.5570019836579128E-30,0,6.0322772342818324E-34]
[460,1.2498770307043654E-2,2.8155775566659227E-2,0,0,0,1.8884804395416656E-28,0,0,null,460,1.249877144699193E-2,2.8013554016517235E-2,0,0,0,1.8538278979905251E-28,0,0,null,460,9.6682541077874881E-6,2.1502821836179109E-5,0,0,0,1.1042816429766312E-31,0,0,null,460,1.4384472101494283E-3,3.2074987023837324E-3,0,0,0,1.8445249940175871E-29,0,0]
[470,1.2495738959466119E-2,2.8835547984505917E-2,0,0,0,2.4310457362458185E-28,0,0,null,470,1.2495746784211744E-2,2.8697960229497478E-2,0,0,0,2.9093372080216079E-28,0,0,null,470,9.6659221793477326E-6,2.2037618031005773E-5,0,0,0,2.1989653376590484E-31,0,0,null,470,1.4380998799991831E-3,3.2867988431359908E-3,0,0,0,3.4008154445219886E-29,0,0]
[480,1.2488423143038111E-2,2.9492792036290901E-2,0,0,0,1.7528598347265102E-28,0,0,null,480,1.2488437111620999E-2,2.9359810601194355E-2,0,0,0,3.2904241054528098E-28,0,0,null,480,9.6602750126914076E-6,2.2554939011352749E-5,0,0,0,3.3993591492752739E-31,0,0,null,480,1.4372593383259968E-3,3.3635002847106892E-3,0,0,0,4.8262663999425764E-29,0,0]
[490,1.2477169972877112E-2,3.0127676417128303E-2,0,1.7286350819448549E-29,0,0,0,0,null,490,1.2477189586928058E-2,2.9999262636121408E-2,0,0,0,1.4117286273049804E-28,0,0,null,490,9.651581196315502E-6,2.3054893032591425E-5,0,0,0,3.7887278328913564E-31,0,0,null,490,1.43596554339686E-3,3.4376198189491128E-3,0,0,0,4.5618952617503767E-29,0,0]
[500,1.246229926046801E-2,3.0740419665823724E-2,0,7.4872623192454208E-29,0,0,0,0,null,500,1.246232406077828E-2,3.0616525223966934E-2,0,0,0,0,0,0,null,500,9.6400881917448269E-6,2.3537629949749552E-5,0,0,0,1.5668567903748376E-31,0,0,null,500,1.4342553103969052E-3,3.5091803338236022E-3,0,0,0,0,0,0]
[510,1.2444105705919988E-2,3.1331283148966528E-2,0,1.8488045345261604E-28,0,0,0,0,null,510,1.2444135269308397E-2,3.1211851459753727E-2,0,5.6925456387010161E-29,0,0,0,0,null,510,9.6260240298666355E-6,2.4003335467523556E-5,0,0,0,0,0,0,null,510,1.4321625637931613E-3,3.5782099677972982E-3,0,0,0,0,0,0]
[520,1.2422860915446161E-2,3.1900564796733401E-2,0,3.5485159230152142E-28,0,0,0,0,null,520,1.2422894851857956E-2,3.178553223137498E-2,0,1.9460023182534681E-28,0,0,0,0,null,520,9.6095988719964073E-6,2.4452226002501729E-5,0,0,0,0,0,0,null,520,1.4297185695752513E-3,3.6447413543365483E-3,0,3.6031466517506753E-30,0,0,0,0]
[530,1.2398815256497716E-2,3.2448593517762137E-2,0,5.6058027694443626E-28,0,0,0,0,null,530,1.2398853206344278E-2,3.2337890500604712E-2,0,4.4012047090391754E-28,0,0,0,0,null,530,9.5910064453669335E-6,2.4884544098988565E-5,0,6.3043353800298591E-32,0,0,0,0,null,530,1.4269521488164761E-3,3.7088109479271182E-3,0,2.0964938508996535E-29,0,0,0,0]
[540,1.2372199562852145E-2,3.2975724226579003E-2,0,7.1589507507102541E-28,0,0,0,2.3627106088836065E-30,null,540,1.2372241194562001E-2,3.2869276209851202E-2,0,7.9555133588685793E-28,0,0,0,1.9182405627380605E-30,null,540,9.5704253624628054E-6,2.530055434458702E-5,0,2.4101580349273492E-31,0,0,0,9.8323535789124628E-34,null,540,1.423889873949598E-3,3.7704584236578158E-3,0,5.5255325040110056E-29,0,0,0,1.7078750805149881E-31]
[550,1.2343226701099178E-2,3.3482333422659986E-2,0,6.4104569829843577E-28,0,0,0,1.0151191851117226E-29,null,550,1.2343271708883871E-2,3.3380061752606001E-2,0,1.1898807899503945E-27,0,0,0,9.4307510937753698E-30,null,550,9.5480203331642539E-6,2.5700539736208768E-5,0,5.6772385022410864E-31,0,0,0,6.4595741249176172E-33,null,550,1.4205562491039425E-3,3.8297261430950981E-3,0,1.1040399868676846E-28,0,0,0,1.0024310211597036E-30]
[560,1.2312093009333003E-2,3.3968815265718079E-2,0,4.5567565717340728E-29,0,6.6315418852824602E-28,0,2.4700757361148235E-29,null,560,1.2312141111114767E-2,3.3870637951056881E-2,0,1.4222712034971465E-27,0,0,0,2.3747471687420696E-29,null,560,9.5239432779714339E-6,2.608479845148443E-5,0,1.060933708109661E-30,0,0,0,1.7224691213488631E-32,null,560,1.4169738757165156E-3,3.8866586798187576E-3,0,1.8211137594066743E-28,0,0,0,2.6201607711761902E-30]
[570,1.2278979618296375E-2,3.4435578096921708E-2,0,0,0,1.5553196263390204E-26,0,4.7470863893688437E-29,null,570,1.2279030553818064E-2,3.4341410489585389E-2,0,1.1101517953229955E-27,0,5.6255132121390461E-27,0,4.65465734383779E-29,null,570,9.4983343502776714E-6,2.6453640984703966E-5,0,1.6553946885966604E-30,0,0,0,3.4820005922951487E-32,null,570,1.4131636046155072E-3,3.9413023985945227E-3,0,2.4902661981762134E-28,0,0,0,5.2414656377345703E-30]
[580,1.2244053664363362E-2,3.488304136035094E-2,0,0,0,4.0080961387217412E-26,0,7.7174104996237238E-29,null,580,1.2244107193454378E-2,3.4792796757494499E-2,0,0,0,2.879461494628268E-26,0,7.6904775755394593E-29,null,580,9.4713228749706405E-6,2.6807387610095675E-5,0,2.1293776620787405E-30,0,5.6925700085373555E-30,0,5.8950440312911852E-32,null,580,1.4091446756620384E-3,3.9937050827069821E-3,0,2.6279678425617726E-28,0,1.6973505407939193E-27,0,8.8017506777009166E-30]
[590,1.2207469403191507E-2,3.5311632883472957E-2,0,0,0,7.3644016874261382E-26,0,1.0693582709343307E-28,null,590,1.2207525304164106E-2,3.5225223058910841E-2,0,0,0,6.4524725559634256E-26,0,1.0843775650026401E-28,null,590,9.4430282101388208E-6,2.7146366138856363E-5,0,2.029091064196972E-30,0,3.0925023188529778E-29,0,8.5260152320647451E-32,null,590,1.4049348459448448E-3,4.0439156045085998E-3,0,1.4095871585668516E-28,0,5.6678418591053743E-27,0,1.2623818484767589E-29]
[600,1.216936923218203E-2,3.572178647934425E-2,0,0,0,1.11679488261669E-25,0,1.2095959484716209E-28,null,600,1.2169427300366185E-2,3.5639122151733447E-2,0,0,0,1.1056771008350989E-25,0,1.2586338817958905E-28,null,600,9.4135605382674114E-6,2.7470909939531228E-5,0,6.2665428496869368E-31,0,6.9837823985532996E-29,0,1.0256718052708204E-31,null,600,1.4005505074812475E-3,4.0919836347069524E-3,0,0,0,1.1429627788533481E-26,0,1.5011499714479723E-29]
[610,1.2129884629241501E-2,3.6113939836983605E-2,0,0,0,1.4422589399754858E-25,0,9.170667025895632E-29,null,610,1.2129944675651249E-2,3.6034931081413202E-2,0,0,0,1.5896569941483109E-25,0,1.0196361844035582E-28,null,610,9.3830215925810334E-6,2.7781356194353703E-5,0,0,0,1.2004219393540863E-28,0,9.0270413712972048E-32,null,610,1.3960067952880047E-3,4.1379593863614074E-3,0,0,0,1.8418869269972626E-26,0,1.2875703870138982E-29]
[620,1.2089137014849628E-2,3.6488532669538332E-2,0,0,0,1.5528214942736532E-25,0,0,null,620,1.2089198864919371E-2,3.6413089278435479E-2,0,0,0,1.945144851314548E-25,0,0,null,620,9.3515053241589572E-6,2.8078044366766088E-5,0,0,0,1.730523782229354E-28,0,1.7208228885656403E-32,null,620,1.3913176866174248E-3,4.1818933899384538E-3,0,0,0,2.5166690407319844E-26,0,1.5842525814758166E-30]
[630,1.2047238543722518E-2,3.6846005093101909E-2,0,0,0,1.2361724836990094E-25,0,0,null,630,1.2047302036212541E-2,3.6774036891863385E-2,0,0,0,1.9452803482835695E-25,0,0,null,630,9.3190985144758976E-6,2.8361314857936315E-5,0,0,0,2.1266926129086912E-28,0,0,null,630,1.3864960920906095E-3,4.2238362961639821E-3,0,0,0,2.9130743286306317E-26,0,0]
[640,1.200429283194991E-2,3.718679621160826E-2,0,0,0,2.5587112177761223E-26,0,0,null,640,1.2004357817873998E-2,3.7118213333778918E-2,0,0,0,1.3069776999874646E-25,0,0,null,640,9.2858813380378371E-6,2.8631507832200707E-5,0,0,0,2.1474938413123884E-28,0,0,null,640,1.3815539394028251E-3,4.2638387037156351E-3,0,0,0,2.6752020577010604E-26,0,0]
[650,1.196039562503381E-2,3.7511342885784935E-2,0,1.6514956032010479E-26,0,0,0,0,null,650,1.1960461966705414E-2,3.744605601207332E-2,0,0,0,0,0,0,null,650,9.2519278793345072E-6,2.8888962193419177E-5,0,0,0,1.4918717617209353E-28,0,0,null,650,1.3765022502264348E-3,4.3019510091121052E-3,0,0,0,1.3842220427610641E-26,0,0]
[660,1.1915635411721861E-2,3.7820078666412918E-2,0,6.3143199026851348E-26,0,0,0,0,null,660,1.1915702981886541E-2,3.7757999231495976E-2,0,0,0,0,0,0,null,660,9.2173066077774142E-6,2.9134014696129434E-5,0,0,0,0,0,0,null,660,1.3713512108725812E-3,4.3382232764148541E-3,0,0,0,0,0,0]
[670,1.1870093988195496E-2,3.8113432874128252E-2,0,1.3189720141087514E-25,0,0,0,0,null,670,1.1870162669205144E-2,3.8054473244683744E-2,0,4.0209050657487478E-26,0,0,0,0,null,670,9.1820808142657386E-6,2.9366999176932503E-5,0,0,0,0,0,0,null,670,1.366110237237304E-3,4.3727051246158334E-3,0,0,0,0,0,0]
[680,1.1823846976666335E-2,3.8391829809774486E-2,0,2.2041352666513778E-25,0,0,0,0,null,680,1.1823916659749054E-2,3.8335903436915876E-2,0,1.297140729837588E-25,0,0,0,0,null,680,9.1463090124863943E-6,2.9588245893058955E-5,0,0,0,0,0,0,null,680,1.3607880345020431E-3,4.405445630776059E-3,0,0,0,0,0,0]
[690,1.1776964302329555E-2,3.8655688081132594E-2,0,3.1922676689141883E-25,0,0,0,0,null,690,1.1777034886900555E-2,3.8602709630027744E-2,0,2.5771853255047428E-25,0,0,0,0,null,690,9.1100453079414527E-6,2.9798080956477191E-5,0,6.1733416280403076E-30,0,0,0,0,null,690,1.355392652038328E-3,4.4364932472159705E-3,0,1.0519803264668604E-26,0,0,0,0]
[700,1.1729510631953009E-2,3.8905420033067115E-2,0,4.0965487708875682E-25,0,0,0,0,null,700,1.172958202498571E-2,3.8855305492289618E-2,0,4.1791607779616228E-25,0,0,0,0,null,700,9.0733397373462125E-6,2.9996825853029756E-5,0,1.0538850080845365E-28,0,0,0,0,null,700,1.349931533894343E-3,4.4658957311945486E-3,0,2.839820705750957E-26,0,0,0,0]
[710,1.1681545777434205E-2,3.9141431269697373E-2,0,4.6269786911872436E-25,0,0,0,0,null,710,1.1681617892875673E-2,3.9094098042532534E-2,0,5.9110892657743831E-25,0,0,0,0,null,710,9.0362385808561832E-6,3.0184797037144768E-5,0,2.5918715896181607E-28,0,0,0,0,null,710,1.3444115652542681E-3,4.4937000857071668E-3,0,5.3100591465248728E-26,0,0,0,0]
[720,1.1633125067221124E-2,3.9364120258285555E-2,0,4.3968786193667937E-25,0,0,0,4.152107214134872E-27,null,720,1.1633197825466884E-2,3.9319487238052217E-2,0,7.4201805515111236E-25,0,0,0,3.6333555452255807E-27,null,720,8.9987846495058098E-6,3.036230559380645E-5,0,4.671116139512741E-28,0,0,0,2.1979666155322756E-30,null,720,1.3388391151897255E-3,4.5199525101614884E-3,0,8.3069874759827606E-26,0,0,0,3.5758253519091131E-28]
[730,1.1584299688153015E-2,3.9573878005563584E-2,0,2.9536127168719448E-25,0,0,0,1.17402874525793E-26,null,730,1.1584373015558152E-2,3.9531865636741645E-2,0,8.1809817989169622E-25,0,0,0,1.1148949071231491E-26,null,730,8.9610175496884458E-6,3.0529656960109481E-5,0,7.1429388140138577E-28,0,0,0,7.9103001171194057E-30,null,730,1.3332200760166814E-3,4.5446983598082342E-3,0,1.1435606696122391E-25,0,0,0,1.2128246386827479E-27]
[740,1.1535117000195858E-2,3.9771087798313849E-2,0,0,0,6.4481554933086584E-25,0,2.2358367913127194E-26,null,740,1.1535190828607969E-2,3.9731618125102931E-2,0,7.5155298911838579E-25,0,0,0,2.179102248702093E-26,null,740,8.9229739266922068E-6,3.0687150699731509E-5,0,9.6619258440103701E-28,0,0,0,1.6148102664808047E-29,null,740,1.3275598995195895E-3,4.5679821129534304E-3,0,1.4012217763478843E-25,0,0,0,2.4386050336656512E-27]
[750,1.1485620826468953E-2,3.9956125000710371E-2,0,0,0,2.8916260807536962E-24,0,3.5662529321138504E-26,null,750,1.1485695092836179E-2,3.9919121704496574E-2,0,4.655557835029306E-25,0,1.5542644134530459E-24,0,3.527507418356856E-26,null,750,8.8846876891276872E-6,3.0835080324186944E-5,0,1.1649943263931528E-27,0,0,0,2.6762206762173452E-29,null,750,1.3218636303463907E-3,4.5898473450352159E-3,0,1.5053742164221199E-25,0,0,0,4.0091750130684528E-27]
[760,1.1435851720235366E-2,4.0129356901880374E-2,0,0,0,5.8263357301783574E-24,0,5.0503780401469938E-26,null,760,1.1435926366198687E-2,4.0094745328875456E-2,0,0,0,4.6085025262719234E-24,0,5.0512448268805671E-26,null,760,8.8461902155113393E-6,3.097373315549852E-5,0,1.2292547732875686E-27,0,1.4345817076713697E-27,0,3.8984416915136245E-29,null,760,1.3161359367366583E-3,4.6103367087889594E-3,0,1.3325759545657623E-25,0,3.318062289418439E-25,0,5.8065001042973628E-27]
[770,1.1385847211193068E-2,4.0291142607713194E-2,0,0,0,9.290099547717314E-24,0,6.4709724467387765E-26,null,770,1.1385922182740005E-2,4.025884978796445E-2,0,0,0,8.4582296100843939E-24,0,6.5380115816889043E-26,null,770,8.8075105448439304E-6,3.1103390225374038E-5,0,1.0583220888241226E-27,0,4.5765783027050041E-27,0,5.1235599926607527E-29,null,770,1.3103811388725502E-3,4.6294919197741565E-3,0,7.4651409919293184E-26,0,7.9809529859890581E-25,0,7.5923912003350598E-27]
[780,1.1335642032334654E-2,4.044183297162824E-2,0,0,0,1.297878580906872E-23,0,7.4955011647847004E-26,null,780,1.1335717279483983E-2,4.0411787630425654E-2,0,0,0,1.2849583852310174E-23,0,7.6575752373846078E-26,null,780,8.7686755521181381E-6,3.1224326206619447E-5,0,5.4272966902862853E-28,0,8.5494773736672845E-27,0,6.0995471989158969E-29,null,780,1.3046032350003058E-3,4.6473537466290866E-3,0,0,0,1.3672725202770591E-24,0,8.9900343315316536E-27]
[790,1.1285268329213496E-2,4.058177055952631E-2,0,0,0,1.6436470522716628E-23,0,7.6782416875104921E-26,null,790,1.1285343805709294E-2,4.0553903122138454E-2,0,0,0,1.7347353007713768E-23,0,7.9621569066296093E-26,null,790,8.7297101103075992E-6,3.1336809372789357E-5,0,0,0,1.3095646836267587E-26,0,6.4784851612564537E-29,null,790,1.2988059255145733E-3,4.6639620054763596E-3,0,0,0,1.9958885874957573E-24,0,9.4823907478527455E-27]
[800,1.1234755852936427E-2,4.0711289644726339E-2,0,0,0,1.9067889602891494E-23,0,6.4833329352882708E-26,null,800,1.1234831515962579E-2,4.0685532235302142E-2,0,0,0,2.1335398836425686E-23,0,6.9078058863980308E-26,null,800,8.6906372396185335E-6,3.1441101582715173E-5,0,0,0,1.7772064254821352E-26,0,5.8310422561605306E-29,null,800,1.2929926351758175E-3,4.6793555579758058E-3,0,0,0,2.61500369514997E-24,0,8.434777935955745E-27]
[810,1.1184132138307575E-2,4.0830716229051829E-2,0,0,0,2.017278701164861E-23,0,3.3332395353275196E-26,null,810,1.1184207948238319E-2,4.0807002664431997E-2,0,0,0,2.4041619510221446E-23,0,3.9015470697864341E-26,null,810,8.6514782454090092E-6,3.1537458286699706E-5,0,0,0,2.195115555013211E-26,0,3.6812605004939559E-29,null,810,1.2871665336205743E-3,4.6935723125578433E-3,0,0,0,3.1313849172870335E-24,0,5.14749171631359E-27]
[820,1.1133422668109861E-2,4.0940368086729614E-2,0,0,0,1.9002862823166587E-23,0,0,null,820,1.1133498588275623E-2,4.0918633865838869E-2,0,0,0,2.4589946222367696E-23,0,0,null,820,8.6122528452318952E-6,3.1626128551708224E-5,0,0,0,2.4846670124339271E-26,0,0,null,820,1.2813305542648283E-3,4.7066492284395071E-3,0,0,0,3.4322599296044731E-24,0,0]
[830,1.1082651024858977E-2,4.1040554828006219E-2,0,0,0,1.4839367685334677E-23,0,0,null,830,1.1082727021335372E-2,4.102073711742369E-2,0,0,0,2.2078927744767883E-23,0,0,null,830,8.5729792863047662E-6,3.1707355102941721E-5,0,0,0,2.5566982695787648E-26,0,0,null,830,1.2754874117840817E-3,4.7186223220500824E-3,0,0,0,3.3938267712454335E-24,0,0]
[840,1.1031839030906284E-2,4.1131577979830525E-2,0,0,0,7.086592395596212E-24,0,0,null,840,1.1031915072277651E-2,4.1113615596014307E-2,0,0,0,1.5683147585366222E-23,0,0,null,840,8.5336744539260625E-6,3.1781374379701047E-5,0,0,0,2.3195195311556838E-26,0,0,null,840,1.2696396182298301E-3,4.7295266755392213E-3,0,0,0,2.8932882831844485E-24,0,0]
[850,1.0981006877850601E-2,4.1213731081201153E-2,0,6.1794171276735993E-25,0,0,0,0,null,850,1.0981082935073437E-2,4.1197564469956351E-2,0,0,0,4.7704090412099832E-24,0,0,null,850,8.4943539715573218E-6,3.1848416603495879E-5,0,0,0,1.6892052340100264E-26,0,0,null,850,1.2637894979373988E-3,4.739396447086406E-3,0,0,0,1.8237176057426869E-24,0,0]
[860,1.09301732461106E-2,4.128729979099497E-2,0,5.868119032338632E-24,0,0,0,0,null,860,1.0930249292299099E-2,4.1272871004462391E-2,0,0,0,0,0,0,null,860,8.4550322933923741E-6,3.1908705856674427E-5,0,0,0,6.0143531637097031E-27,0,0,null,860,1.2579392012803206E-3,4.7482648827504954E-3,0,0,0,1.10620388568305E-25,0,0]
[870,1.0879355415416707E-2,4.1352562006365931E-2,0,1.2734132087440057E-23,0,0,0,0,null,870,1.087943142572609E-2,4.1339814678033625E-2,0,1.7813984230013551E-24,0,0,0,0,null,870,8.415722789833683E-6,3.1962460169920157E-5,0,0,0,0,0,0,null,870,1.2520907173964621E-3,4.7561643296103913E-3,0,0,0,0,0,0]
[880,1.0828569366969047E-2,4.1409787990038208E-2,0,2.1021163759587433E-23,0,0,0,0,null,880,1.0828645318394815E-2,4.139866730803686E-2,0,1.0639039250130565E-23,0,0,0,0,null,880,8.376437826538556E-6,3.2009891617345207E-5,0,0,0,0,0,0,null,880,1.2462458859474961E-3,4.7631262500206122E-3,0,0,0,0,0,0]
[890,1.0777829877850661E-2,4.1459240504979941E-2,0,3.0302339062858345E-23,0,0,0,0,null,890,1.0777905749159492E-2,4.1449693183958532E-2,0,2.2036293197704797E-23,0,0,0,0,null,890,8.3371888374701038E-6,3.2051206417851794E-5,0,0,0,0,0,0,null,890,1.240406407982182E-3,4.7691812367773442E-3,0,3.7355055833476731E-25,0,0,0,0]
[900,1.0727150608519864E-2,4.1501174955127181E-2,0,3.9895509058648138E-23,0,0,1.6863645436818073E-40,0,null,900,1.072722638004592E-2,4.1493149207023634E-2,0,3.5591436170178038E-23,0,0,1.1070012037946351E-40,0,null,900,8.297986392588686E-6,3.2086605041672495E-5,0,3.3186559017137829E-27,0,0,0,0,null,900,1.2345738560145757E-3,4.774359029048143E-3,0,1.961499267893482E-24,0,0,0,0]
[910,1.0676544183495038E-2,4.1535839530817589E-2,0,4.8860824508425034E-23,0,0,2.6334400815927357E-40,0,null,910,1.0676619837106405E-2,4.1529285034692949E-2,0,5.0549829433149245E-23,0,0,2.6012877747105704E-40,0,null,910,8.258840260309197E-6,3.211628232106563E-5,0,1.6283426305847185E-26,0,0,0,0,null,910,1.2287496833083553E-3,4.778688528887666E-3,0,3.9889790796819691E-24,0,0,0,0]
[920,1.0626022266224514E-2,4.1563475358125455E-2,0,5.6023771380737637E-23,0,0,3.0858203584930539E-40,0,null,920,1.0626097785138117E-2,4.155834322933305E-2,0,6.5756654643893429E-23,0,0,4.3678212028557525E-40,0,null,920,8.2197594654138962E-6,3.214042756440478E-5,0,3.2782412332865386E-26,0,0,0,0,null,920,1.2229352324910181E-3,4.7821978182668E-3,0,6.3847151606640057E-24,0,0,0,0]
[930,1.0575595628312572E-2,4.1584316651043104E-2,0,6.0026638554068687E-23,0,0,2.1419483332387517E-40,0,null,930,1.0575670997054087E-2,4.1580559409855992E-2,0,7.9664188010786528E-23,0,0,5.5345412050222116E-40,0,null,930,8.1807523426125706E-6,3.2159224672830784E-5,0,5.2231501782072402E-26,0,0,0,0,null,930,1.2171317435333002E-3,4.7849141764579467E-3,0,9.0129034707797936E-24,0,0,0,0]
[940,1.0525274213589361E-2,4.1598590865512368E-2,0,5.9409169647480348E-23,0,0,0,2.1832877220822649E-25,null,940,1.0525349417867057E-2,4.1596162405415214E-2,0,9.0379929807977444E-23,0,0,4.5691833793160232E-40,1.4816590139741109E-25,null,940,8.1418265861275193E-6,3.2172852258650862E-5,0,7.3529836449992988E-26,0,0,0,3.0876851559280835E-29,null,940,1.211340361115656E-3,4.7868640976771269E-3,0,1.1669196710314045E-23,0,0,1.0239285186803034E-40,8.7915117990383681E-27]
[950,1.0475067197540855E-2,4.1606518854964657E-2,0,5.271657745057689E-23,0,0,0,1.035856612910357E-24,null,950,1.0475142224181428E-2,4.160537441071134E-2,0,9.575896396261307E-23,0,0,0,9.6326983327909452E-25,null,950,8.1029892956664353E-6,3.2181483765235589E-5,0,9.5028803670066001E-26,0,0,0,6.5737331751899049E-28,null,950,1.2055621414724536E-3,4.7880733089341061E-3,0,1.4082701607231979E-23,0,0,0,1.0222540540576932E-25]
[960,1.0424983042226344E-2,4.1608315026323679E-2,0,3.8630377025320084E-23,0,0,0,2.073766374488044E-24,null,960,1.042505787905597E-2,4.1608411141940596E-2,0,9.3540283639553955E-23,0,0,0,2.0055714058707571E-24,null,960,8.0642470189321046E-6,3.2185287587443454E-5,0,1.1454892431030223E-25,0,0,0,1.4674785694223952E-27,null,960,1.1997980587153071E-3,4.7885667879588312E-3,0,1.5924994417136694E-23,0,0,0,2.2258785172809112E-25]
[970,1.0375029547251946E-2,4.160418749619442E-2,0,1.6114854668004329E-23,0,0,0,3.3077870748356665E-24,null,970,1.0375104183086733E-2,4.1605481992976451E-2,0,8.1522764817590736E-23,0,0,0,3.2526233732747513E-24,null,970,8.0256057910628331E-6,3.2184427192450036E-5,0,1.2945256131050076E-25,0,0,0,2.4460582080517007E-27,null,970,1.194049010696944E-3,4.7883687811845219E-3,0,1.682664535752433E-23,0,0,0,3.6751433547137757E-25]
[980,1.0325213896965566E-2,4.1594338246607528E-2,0,0,0,2.7491604926202645E-23,0,4.6877038084258979E-24,null,980,1.032528832148402E-2,4.1596790191251676E-2,0,5.7772339079839026E-23,0,0,0,4.6557383375386208E-24,null,980,7.9870711711024112E-6,3.2179061240446543E-5,0,1.3677628570304065E-25,0,0,0,3.5573599043014695E-27,null,980,1.1883158244464611E-3,4.7875028216918438E-3,0,1.6401115107815162E-23,0,0,0,5.3158818869063552E-25]
[990,1.0275542704333266E-2,4.1578963279997438E-2,0,0,0,1.1376533048646007E-22,0,6.1348209829752209E-24,null,990,1.0275616908060127E-2,4.1582532952915974E-2,0,2.0848072877275236E-23,0,6.2300720202111062E-23,0,6.1372393099949492E-24,null,990,7.94864827601779E-6,3.2169343704838946E-5,0,1.3342177054471585E-25,0,0,0,4.7426323505511898E-27,null,990,1.1825992612218622E-3,4.785991747089928E-3,0,1.4275196925522015E-23,0,0,0,7.0599909335226303E-25]
[1000,1.022602205129532E-2,4.1558252772788927E-2,0,0,0,2.151882837409538E-22,5.1534878555429912E-39,7.5412780537294944E-24,null,1000,1.0226096025508571E-2,4.1562901636730723E-2,0,0,0,1.7021272714351509E-22,0,7.5895631692584515E-24,null,1000,7.9103418119033315E-6,3.2155423991598375E-5,0,1.1639862598761391E-25,0,5.4303256269118501E-26,0,5.9191750977343488E-27,null,1000,1.1769000211513852E-3,4.783857717257132E-3,0,1.0124484607689557E-23,0,1.2444976275736123E-23,0,8.7841464928520378E-25]
[]
[]
["Saved  28/02/2023: 16:30:29  Level Number: 5"]
[]
["BREAKTHROUGH RESULTS"]
[]
["Advanced"]
["Pollutant Linkage: Inert Restorati, Attenution Layer, Beenham Grange Formation",null,null,null,null,null,null,null,null,null,"Pollutant Linkage: Inert Restorati, Attenution Layer, Beenham Grange Formation, Groundwater ",null,null,null,null,null,null,null,null,null,"Pollutant Linkage: Inert Restorati, Attenution Layer, Beenham Grange Formation, River Enborne",null,null,null,null,null,null,null,null,null,"Pollutant Linkage: Inert Restorati, Attenution Layer, Beenham Grange Formation, Spring Ditch"]
["Concentrations in mg/L in Beenham Grange Formation",null,null,null,null,null,null,null,null,null,"Concentrations in mg/L in Groundwater ",null,null,null,null,null,null,null,null,null,"Concentrations in mg/L in River Enborne",null,null,null,null,null,null,null,null,null,"Concentrations in mg/L in Spring Ditch"]
[]
["Compared with EAL (GW) target concentration in mg/L",null,null,null,null,null,null,null,null,null,"Compared with EAL (GW) target concentration in mg/L",null,null,null,null,null,null,null,null,null,"Compared with EAL (River Enborne) target concentration in mg/L",null,null,null,null,null,null,null,null,null,"Compared with EAL (Spring Ditch) target concentration in mg/L"]
[null,0.39,4.8199999999999993E-2,1E-3,4.3649999999999991E-3,2.0000000000000002E-5,2E-3,2.0000000000000001E-4,1E-3,null,null,0.39,4.8199999999999993E-2,1E-3,4.3649999999999991E-3,2.0000000000000002E-5,2E-3,2.0000000000000001E-4,1E-3,null,null,0.39,2.76E-2,4.7000000000000002E-3,2.8000000000000001E-2,5.0000000000000001E-4,1.75E-3,1.1999999999999999E-3,1E-3,null,null,0.39,0.03,4.7000000000000002E-3,2.8000000000000001E-2,5.0000000000000001E-4,1.5E-3,1.1999999999999999E-3,5.0000000000000001E-3]
[]
["Time(years)","Species1","Species2","Species3","Species4","Species5","Species6","Species7","Species8",null,"Time(years)","Species1","Species2","Species3","Species4","Species5","Species6","Species7","Species8",null,"Time(years)","Species1","Species2","Species3","Species4","Species5","Species6","Species7","Species8",null,"Time(years)","Species1","Species2","Species3","Species4","Species5","Species6","Species7","Species8"]
[null,"Ammoniacal Nitrogen","Barium","Total Chromiun","Copper","Mercury","Molybdenum","Lead","Antimony",null,null,"Ammoniacal Nitrogen","Barium","Total Chromiun","Copper","Mercury","Molybdenum","Lead","Antimony",null,null,"Ammoniacal Nitrogen","Barium","Total Chromiun","Copper","Mercury","Molybdenum","Lead","Antimony",null,null,"Ammoniacal Nitrogen","Barium","Total Chromiun","Copper","Mercury","Molybdenum","Lead","Antimony"]
[10,1.5971076978511836E-12,1.9592882057883589E-22,0,0,0,0,0,0,null,10,1.5421941182368864E-12,0,0,0,0,0,0,0,null,10,1.1322049814174945E-15,4.2947608655767881E-26,0,0,0,0,0,0,null,10,1.912099354136044E-14,2.3933907620175684E-25,0,0,0,0,0,0]
[20,2.0793731263382399E-7,1.514522300131767E-15,0,0,0,0,0,0,null,20,2.0609962470733467E-7,9.8414838193386251E-17,0,0,0,0,0,0,null,20,1.5731678858711293E-10,2.7141082008489792E-21,0,0,0,0,0,0,null,20,2.6226251867672474E-9,1.5025532314716799E-19,0,0,0,0,0,0]
[30,1.1034568439612781E-5,5.9553996920910681E-11,0,0,0,0,0,0,null,30,1.0990737887735778E-5,1.527668104815454E-11,0,0,0,0,0,0,null,30,8.4511053228842374E-9,2.026682266119852E-15,0,0,0,0,0,0,null,30,1.4054387203753606E-7,5.8739691490340789E-14,0,0,0,0,0,0]
[40,8.1508033502182914E-5,1.2168553082699859E-8,0,0,0,0,0,0,null,40,8.1324882738976312E-5,5.46517401321152E-9,0,0,0,0,0,0,null,40,6.2695714147434928E-8,1.3796354840328518E-12,0,0,0,0,0,0,null,40,1.0417422541282506E-6,3.2903422241962209E-11,0,0,0,0,0,0]
[50,2.7162932263881373E-4,3.0073506393203505E-7,0,0,0,0,0,0,null,50,2.7123795568040441E-4,1.7812487323242394E-7,0,0,0,0,0,0,null,50,2.0935886099683981E-7,6.4165196876408821E-11,0,0,0,0,0,0,null,50,3.4772686129166241E-6,1.3691649534070783E-9,0,0,0,0,0,0]
[60,6.0607604392679492E-4,2.5744265005620261E-6,0,0,0,0,0,0,null,60,6.0547037699042823E-4,1.7813760213223917E-6,0,0,0,0,0,0,null,60,4.6765105130272194E-7,7.949137692768193E-10,0,0,0,0,0,0,null,60,7.7655593204042681E-6,1.5836486650415348E-8,0,0,0,0,0,0]
[70,1.0735228512342055E-3,1.1997461551384742E-5,0,0,0,0,0,0,null,70,1.072737812573826E-3,9.1347891314368461E-6,0,0,0,0,0,0,null,70,8.28891106413946E-7,4.6766456535406571E-9,0,0,0,0,0,0,null,70,1.3762267679227931E-5,8.9086952675083717E-8,0,0,0,0,0,0]
[80,1.644514474433492E-3,3.8181386145270564E-5,0,0,0,0,0,0,null,80,1.6435996995420427E-3,3.0957200636097182E-5,0,0,0,0,0,0,null,80,1.2703228040342083E-6,1.7388821510174244E-8,0,0,0,0,0,0,null,80,2.1089610376158963E-5,3.2126844800642999E-7,0,0,0,0,0,0]
[90,2.285589878777609E-3,9.4145427487976849E-5,0,0,0,0,0,0,null,90,2.284594143083212E-3,7.9724599668805387E-5,0,0,0,0,0,0,null,90,1.7660611846068298E-6,4.7799610427254138E-8,0,0,0,0,0,0,null,90,2.9317976121589727E-5,8.6419437457729737E-7,0,0,0,0,0,0]
[100,2.966449207171787E-3,1.9405069265059766E-4,0,0,0,0,0,0,null,100,2.9654138374854478E-3,1.6955262841302751E-4,0,0,0,0,0,0,null,100,2.2926538150182738E-6,1.0659795050562322E-7,0,0,0,0,0,0,null,100,3.8058169068252847E-5,1.8969387138204566E-6,0,0,0,0,0,0]
[110,3.6624976411763679E-3,3.5094715392666764E-4,0,0,0,0,0,0,null,110,3.6614548984028115E-3,3.1386528648373266E-4,0,0,0,0,0,0,null,110,2.8310581800580097E-6,2.0446744653597021E-7,0,0,0,0,0,0,null,110,4.6994195894816886E-5,3.5954828072790145E-6,0,0,0,0,0,0]
[120,4.3550678147952805E-3,5.7523016667495295E-4,0,0,0,0,0,0,null,120,4.35404150734692E-3,5.2368210566945456E-4,0,0,0,0,0,0,null,120,3.3668180466249283E-6,3.5058476589622754E-7,0,0,0,0,0,0,null,120,5.5886178589235163E-5,6.108707799539303E-6,0,0,0,0,0,0]
[130,5.0306954130721095E-3,8.7392574503471925E-4,0,0,0,0,0,0,null,130,5.0297022870654127E-3,8.0674176012729502E-4,0,0,0,0,0,0,null,130,3.8895046177182178E-6,5.5174517273653338E-7,0,0,0,0,0,0,null,130,6.4561074190519783E-5,9.5449793497285911E-6,0,0,0,0,0,0]
[140,5.6801313262911076E-3,1.2506281536280228E-3,0,0,0,0,0,0,null,140,5.6791825616559185E-3,1.167324930827452E-3,0,0,0,0,0,0,null,140,4.3919526038196922E-6,8.1207426869929596E-7,0,0,0,0,0,0,null,140,7.2899995061170012E-5,1.3968238424371806E-5,0,0,0,0,0,0]
[150,6.2973874622400967E-3,1.705843454469344E-3,0,0,0,0,0,0,null,150,6.2964900079692547E-3,1.6065327371765992E-3,0,0,0,0,0,0,null,150,4.8695218133954017E-6,1.1331509591399841E-6,0,0,0,0,0,0,null,150,8.0825954422323102E-5,1.9400592168831695E-5,0,0,0,0,0,0]
[160,6.8789227074419774E-3,2.23752960938336E-3,0,0,0,0,0,0,null,160,6.8780803786296805E-3,2.1227997772582568E-3,0,0,0,0,0,0,null,160,5.3194670038013248E-6,1.5143607368313742E-6,0,0,0,0,0,0,null,160,8.8293409202261055E-5,2.5828447568602911E-5,0,0,0,0,0,0]
[170,7.4229896580184857E-3,2.8416893241840517E-3,0,0,0,0,0,0,null,170,7.4222039979847379E-3,2.7124843632590403E-3,0,0,0,0,0,0,null,170,5.7404320995778592E-6,1.9533417492790903E-6,0,0,0,0,0,0,null,170,9.5279867009140257E-5,3.3209991422111677E-5,0,0,0,0,0,0]
[180,7.9291282953363549E-3,3.5129310837011024E-3,0,0,0,0,0,0,null,180,7.9283992352803343E-3,3.3704404146876268E-3,0,0,0,0,0,0,null,180,6.1320581405635042E-6,2.4464358717580697E-6,0,0,0,0,0,0,null,180,1.0177938048683667E-4,4.1482638763085652E-5,0,0,0,0,0,0]
[190,8.3977820217945483E-3,4.2449567699462832E-3,0,0,0,0,0,0,null,190,8.3971083767324928E-3,4.0905219044039655E-3,0,0,0,0,0,0,null,190,6.4946859549560015E-6,2.9890968789830667E-6,0,0,0,0,0,0,null,190,1.0779761358632377E-4,5.0569712259958475E-5,0,0,0,0,0,0]
[200,8.8300108250256477E-3,5.0309615673169638E-3,0,0,0,0,0,0,null,200,8.8293906619043884E-3,4.8660010065052937E-3,0,0,0,0,0,0,null,200,6.8291340341475641E-6,3.5762348826855117E-6,0,0,0,0,0,0,null,200,1.1334815574181758E-4,6.0386043678889113E-5,0,0,0,0,0,0]
[210,9.2272794590234752E-3,5.863947413886122E-3,0,0,0,0,0,0,null,210,9.2267103670920329E-3,5.689898735305959E-3,0,0,0,0,0,0,null,210,7.1365344940607358E-6,4.2024925723125617E-6,0,0,0,0,0,0,null,210,1.1844979992414666E-4,7.084244443758386E-5,0,0,0,0,0,0]
[220,9.5913026016943067E-3,6.7369590025418598E-3,0,0,0,0,0,0,null,220,9.5907818891126876E-3,6.555235941587639E-3,0,0,0,0,0,0,null,220,7.4182131561982924E-6,4.86245761239563E-6,0,0,0,0,0,0,null,220,1.2312455280170882E-4,8.1849128090528319E-5,0,0,0,0,0,0]
[230,9.9239328208002801E-3,7.643254328664844E-3,0,0,0,3.3538597087754569E-40,0,0,null,230,9.9234576560632507E-3,7.4552163089550661E-3,0,0,0,2.1657358324548515E-40,0,0,null,230,7.6756027784825559E-6,5.5508195560983927E-6,0,0,0,0,0,0,null,230,1.2739619497404873E-4,9.3318227654583691E-5,0,0,0,0,0,0]
[240,1.0227080464544196E-2,8.5764221136639777E-3,0,0,0,0,0,0,null,240,1.0226647976883569E-2,8.3833537479100495E-3,0,0,0,8.5438057240627883E-40,0,0,null,240,7.91018100835089E-6,6.2624808209937222E-6,0,0,0,0,0,0,null,240,1.3128925143362876E-4,1.0516556676870005E-4,0,0,0,0,0,0]
[250,1.050265722687071E-2,9.530457427231312E-3,0,0,0,0,0,0,null,250,1.0502264576308408E-2,9.3335557787034909E-3,0,0,0,0,0,0,null,250,8.1234266697668648E-6,6.9926309492532096E-6,0,0,0,0,0,0,null,250,1.3482826624962077E-4,1.1731183647893798E-4,0,0,0,0,0,0]
[260,1.0752537185553183E-2,1.049980526861718E-2,0,3.4671294311057285E-40,0,7.4443487305188611E-38,0,0,null,260,1.0752181610620299E-2,1.0300173003035514E-2,0,0,0,2.4450822834869729E-38,0,0,null,260,8.316789581544554E-6,7.7367923426975161E-6,0,0,0,0,0,0,null,260,1.3803730178170207E-4,1.2968331154729896E-4,0,0,0,0,0,0]
[270,1.097853067496495E-2,1.1479380183162129E-2,0,1.1632390343237601E-39,0,4.8494213259654691E-37,0,0,null,270,1.0978209524048283E-2,1.1278023083153014E-2,0,4.8602831826397746E-40,0,3.1447937242498113E-37,0,0,null,270,8.4916703153267255E-6,8.4908443855976669E-6,0,0,0,1.0653149078468338E-40,0,0,null,270,1.4093960282523561E-4,1.4221221879964438E-4,0,0,0,2.664260036158729E-39,0,0]
[280,1.1182367536708711E-2,1.246456840584521E-2,0,0,0,3.2695430609387298E-36,0,0,null,280,1.1182078287479037E-2,1.2262396031545783E-2,0,6.7185012084461575E-39,0,1.404313357070496E-36,0,0,null,280,8.6494072162770387E-6,9.2510315921123914E-6,0,0,0,6.7989923676299578E-40,0,0,null,280,1.4355738126831374E-4,1.5483684897189839E-4,0,0,0,1.2188213421297997E-38,0,0]
[290,1.136568717775863E-2,1.3451217635285543E-2,0,4.3437733982535121E-39,0,2.3603513075191038E-35,0,1.126965080953565E-40,null,290,1.1365427447976438E-2,1.3249046182168456E-2,0,0,0,1.0697022130402569E-35,0,1.0942237159128122E-40,null,290,8.7912686960150831E-6,1.0013960259582078E-5,0,0,0,2.5269549230299603E-39,0,0,null,290,1.4591168823195521E-4,1.6750148458790295E-4,0,1.8199205017427334E-40,0,5.935482356132026E-38,0,0]
[300,1.153003352852134E-2,1.4435618377137003E-2,0,2.3706295919597702E-37,0,1.2950723588234238E-34,0,1.3375785558203552E-40,null,300,1.1529801080679157E-2,1.4234175003558966E-2,0,0,0,7.2742884135274906E-35,0,1.8470783423161291E-40,null,300,8.9184493205584871E-6,1.0776587119066783E-5,0,0,0,2.071335288919922E-38,0,0,null,300,1.4802234918054379E-4,1.8015620026830045E-4,0,0,0,4.8993706018580579E-37,0,0]
[310,1.1676853487562359E-2,1.5414479847400516E-2,0,1.2092053065617258E-36,0,5.4960931568909076E-34,0,0,null,310,1.1676646229163617E-2,1.5214407923035302E-2,0,3.5487568272378072E-37,0,3.5013681721971731E-34,0,0,null,310,9.0320685988328478E-6,1.1536202656666433E-5,0,0,0,1.324725411801999E-37,0,0,null,310,1.499079438426984E-4,1.9275657858158307E-4,0,0,0,2.8162230174555934E-36,0,0]
[320,1.1807497808292758E-2,1.6384902670068854E-2,0,6.0366374525951906E-36,0,1.9111121408443181E-33,0,5.432495265624217E-40,null,320,1.1807313789114019E-2,1.6186767537816758E-2,0,2.0274820795228709E-36,0,1.333706203583494E-33,0,0,null,320,9.1331716627088691E-6,1.2290411120203164E-5,0,0,0,5.8159443002576403E-37,0,0,null,320,1.5158581751727735E-4,2.0526337386661881E-4,0,6.7850259896692865E-39,0,1.1692231151572456E-35,0,0]
[330,1.1923223657251009E-2,1.734435001050507E-2,0,3.4812342702036755E-35,0,5.4047082182091037E-33,0,3.1475614361246003E-38,null,330,1.1923061064570967E-2,1.7148644964763603E-2,0,5.7862842421412405E-36,0,4.254229840777919E-33,0,2.857913752257053E-38,null,330,9.2227312419978098E-6,1.3037108704744586E-5,0,1.8311729017714393E-39,0,2.0505610917899646E-36,0,0,null,330,1.5307211386575894E-4,2.1764214802382601E-4,0,4.6966811372931699E-38,0,4.0067683528979181E-35,0,3.3071107471229726E-40]
[340,1.202519827809284E-2,1.8290618327098718E-2,0,1.7076080014367429E-34,0,1.1379483036970457E-32,0,1.4835592805707973E-37,null,340,1.2025055430599684E-2,1.8097770596210344E-2,0,3.111877634499488E-35,0,1.0925274864629809E-32,0,1.3890139432487151E-37,null,340,9.3016504961290838E-6,1.3774461004456273E-5,0,6.0505400897285474E-39,0,6.172915493626907E-36,0,0,null,340,1.5438182191857068E-4,2.2986289571235612E-4,0,1.2020392626566298E-37,0,1.1599141882689248E-34,0,1.6806125556745185E-39]
[350,1.2114503347578838E-2,1.9221808572804432E-2,0,6.7329782069280863E-34,0,1.2247581712918256E-32,0,6.03065935370926E-37,null,350,1.2114378688506816E-2,1.9032185158168492E-2,0,1.8559036414539414E-34,0,1.9546412823461936E-32,0,5.438458630641315E-37,null,350,9.3707663821536547E-6,1.4500880505886153E-5,0,1.7026198880842065E-38,0,1.5008599618708775E-35,0,3.6434539282923162E-40,null,350,1.5552883197919741E-4,2.4189967134948575E-4,0,5.1014417219827261E-37,0,2.6141070496936967E-34,0,6.3333092169042946E-39]
[360,1.2192139723142936E-2,2.0136298412682819E-2,0,2.2326889177780984E-33,0,0,0,2.9289770080601176E-36,null,360,1.2192031812987976E-2,1.9950211685727887E-2,0,8.0542690079241108E-34,0,9.380569996996195E-33,0,2.6235131008521705E-36,null,360,9.4308533263605236E-6,1.5215004660101687E-5,0,9.6460393392822891E-38,0,2.461106685357558E-35,0,1.7180391765794059E-39,null,360,1.5652599656541477E-4,2.537302264775473E-4,0,3.1108018166233483E-36,0,3.5500725054269658E-34,0,3.0146029028570673E-38]
[370,1.2259032365974257E-2,2.103271582496043E-2,0,6.4027734770385643E-33,0,0,0,1.3467364132619845E-35,null,370,1.225893987507827E-2,2.0850428819456292E-2,0,2.7455273136446111E-33,0,0,0,1.2317074084746383E-35,null,370,9.4826270322105811E-6,1.5915674892248873E-5,0,5.0571118636945681E-37,0,4.368036291989274E-36,0,8.3122394191485624E-39,null,370,1.5738519361089138E-4,2.6533566318432067E-4,0,1.4041336394044678E-35,0,0,0,1.4443166081117267E-37]
[380,1.2316035286138834E-2,2.1909914306216256E-2,0,1.5677073697935498E-32,0,0,0,5.1668607627623314E-35,null,380,1.2315956987335945E-2,2.1731645670096916E-2,0,8.0784747404596175E-33,0,0,0,4.8137830996801893E-35,null,380,9.5267483056682641E-6,1.6601916773974504E-5,0,1.9380157590859459E-36,0,0,0,3.3446413243940771E-38,null,380,1.5811738995434978E-4,2.7670010712223508E-4,0,4.8074631057607788E-35,0,0,0,5.7543056707050071E-37]
[390,1.2363936402736154E-2,2.2766949794174873E-2,0,3.0921424418724311E-32,0,0,0,1.6797451787691608E-34,null,390,1.2363871164183509E-2,2.2592878384398021E-2,0,2.1109135913040662E-32,0,0,0,1.584393025393367E-34,null,390,9.5638268150774461E-6,1.727292148634481E-5,0,5.965582859069711E-36,0,0,0,1.1219581118300375E-37,null,390,1.5873270374177205E-4,2.8781040210149706E-4,0,1.3916403329959732E-34,0,0,0,1.9179362033140989E-36]
[400,1.2403462246524033E-2,2.3603059344707508E-2,0,4.1011645666857537E-32,0,0,0,4.7908295393380001E-34,null,400,1.2403409024810972E-2,2.3433328462460233E-2,0,4.7218283902584895E-32,0,0,0,4.5635485112035353E-34,null,400,9.5944247293487525E-6,1.7928028630060679E-5,0,1.6092420920812691E-35,0,0,0,3.2777411587547792E-37,null,400,1.5924046480804917E-4,2.9865582709687877E-4,0,3.6048106844791962E-34,0,0,0,5.5770965490141604E-36]
[410,1.2435282457614119E-2,2.4417641545594383E-2,0,0,0,0,0,1.2141938389789679E-33,null,410,1.2435240291202387E-2,2.4252362818745505E-2,0,8.2098244665930141E-32,0,0,0,1.1694355317910606E-33,null,410,9.619060197721752E-6,1.8566710389391465E-5,0,3.9009450822786637E-35,0,0,0,8.5299254339132678E-37,null,410,1.5964927242908647E-4,3.0922783570237696E-4,0,8.2385082811888982E-34,0,0,0,1.4441470432239396E-35]
[420,1.2460014049595292E-2,2.5210238612783882E-2,0,0,0,2.113733481167809E-31,0,2.6933955903785601E-33,null,420,1.245998205261882E-2,2.5049495538914154E-2,0,7.9327913424929673E-32,0,0,0,2.6326635904970768E-33,null,420,9.6382106489360281E-6,1.9188557021346616E-5,0,8.1687531247192099E-35,0,0,0,1.9603873804667916E-36,null,420,1.5996705007614848E-4,3.1951981751159828E-4,0,1.5411543675447775E-33,0,0,0,3.2968435885574342E-35]
[430,1.2478225424669828E-2,2.5980520090740075E-2,0,0,0,1.4745764929840462E-29,0,4.9923997387291105E-33,null,430,1.2478202781119958E-2,2.5824371258222834E-2,0,0,0,4.7008490459485971E-30,0,4.9879834475905823E-33,null,430,9.6523158978049645E-6,1.9793263618155898E-5,0,1.328462654717179E-34,0,0,0,3.8289490484890228E-36,null,430,1.6020109697401295E-4,3.2952688052953125E-4,0,1.9300353427444287E-33,0,0,0,6.3762780789325283E-35]
[440,1.2490440134330824E-2,2.672826806380885E-2,0,0,0,4.9225685159135941E-29,0,6.8160111389556302E-33,null,440,1.2490426092619586E-2,2.6576750070805458E-2,0,0,0,3.2463660786135186E-29,0,7.1145635974967137E-33,null,440,9.6617810549858206E-6,2.0380618076297968E-5,0,1.123833336828728E-34,0,6.705737940754138E-33,0,5.7834315630003452E-36,null,440,1.6035813639188868E-4,3.3924565348772222E-4,0,0,0,2.039046751302355E-31,0,9.4580511500898683E-35]
[450,1.2497140386756098E-2,2.7453363777622725E-2,0,0,0,1.100597138122953E-28,0,2.959280775336841E-33,null,450,1.2497134254657637E-2,2.7306493870058273E-2,0,0,0,9.1326687937265044E-29,0,4.148256192104675E-33,null,450,9.6669792407809212E-6,2.095049019663704E-5,0,0,0,4.0519705383649646E-32,0,4.4500567841124639E-36,null,450,1.6044436068310798E-4,3.4867410680019769E-4,0,0,0,8.4301870124431098E-31,0,6.7292856751750963E-35]
[460,1.2498770307043654E-2,2.8155775566659227E-2,0,0,0,1.8884804395416656E-28,0,0,null,460,1.249877144699193E-2,2.8013554016517235E-2,0,0,0,1.8538278979905251E-28,0,0,null,460,9.6682541077874881E-6,2.1502821836179109E-5,0,0,0,1.1042816429766312E-31,0,0,null,460,1.6046547315073611E-4,3.5781139083643692E-4,0,0,0,2.0576533766062407E-30,0,0]
[470,1.2495738959466119E-2,2.8835547984505917E-2,0,0,0,2.4310457362458185E-28,0,0,null,470,1.2495746784211744E-2,2.8697960229497478E-2,0,0,0,2.9093372080216079E-28,0,0,null,470,9.6659221793477326E-6,2.2037618031005773E-5,0,0,0,2.1989653376590484E-31,0,0,null,470,1.6042672685785339E-4,3.6665769017710524E-4,0,0,0,3.793767720866462E-30,0,0]
[480,1.2488423143038111E-2,2.9492792036290901E-2,0,0,0,1.7528598347265102E-28,0,0,null,480,1.2488437111620999E-2,2.9359810601194355E-2,0,0,0,3.2904241054528098E-28,0,0,null,480,9.6602750126914076E-6,2.2554939011352749E-5,0,0,0,3.3993591492752739E-31,0,0,null,480,1.603329605268131E-4,3.7521409254403522E-4,0,0,0,5.3839245260714489E-30,0,0]
[490,1.2477169972877112E-2,3.0127676417128303E-2,0,1.7286350819448549E-29,0,0,0,0,null,490,1.2477189586928058E-2,2.9999262636121408E-2,0,0,0,1.4117286273049804E-28,0,0,null,490,9.651581196315502E-6,2.3054893032591425E-5,0,0,0,3.7887278328913564E-31,0,0,null,490,1.6018863168803726E-4,3.834824711451828E-4,0,0,0,5.089006231690653E-30,0,0]
[500,1.246229926046801E-2,3.0740419665823724E-2,0,7.4872623192454208E-29,0,0,0,0,null,500,1.246232406077828E-2,3.0616525223966934E-2,0,0,0,0,0,0,null,500,9.6400881917448269E-6,2.3537629949749552E-5,0,0,0,1.5668567903748376E-31,0,0,null,500,1.5999784724660734E-4,3.9146537924025977E-4,0,0,0,0,0,0]
[510,1.2444105705919988E-2,3.1331283148966528E-2,0,1.8488045345261604E-28,0,0,0,0,null,510,1.2444135269308397E-2,3.1211851459753727E-2,0,5.6925456387010161E-29,0,0,0,0,null,510,9.6260240298666355E-6,2.4003335467523556E-5,0,0,0,0,0,0,null,510,1.5976439163447334E-4,3.9916595580564068E-4,0,0,0,0,0,0]
[520,1.2422860915446161E-2,3.1900564796733401E-2,0,3.5485159230152142E-28,0,0,0,0,null,520,1.2422894851857956E-2,3.178553223137498E-2,0,1.9460023182534681E-28,0,0,0,0,null,520,9.6095988719964073E-6,2.4452226002501729E-5,0,0,0,0,0,0,null,520,1.5949175271815511E-4,4.0658784125619066E-4,0,4.0194775882291802E-31,0,0,0,0]
[530,1.2398815256497716E-2,3.2448593517762137E-2,0,5.6058027694443626E-28,0,0,0,0,null,530,1.2398853206344278E-2,3.2337890500604712E-2,0,4.4012047090391754E-28,0,0,0,0,null,530,9.5910064453669335E-6,2.4884544098988565E-5,0,6.3043353800298591E-32,0,0,0,0,null,530,1.5918314562233981E-4,4.1373510225926744E-4,0,2.338736349645127E-30,0,0,0,0]
[540,1.2372199562852145E-2,3.2975724226579003E-2,0,7.1589507507102541E-28,0,0,0,2.3627106088836065E-30,null,540,1.2372241194562001E-2,3.2869276209851202E-2,0,7.9555133588685793E-28,0,0,0,1.9182405627380605E-30,null,540,9.5704253624628054E-6,2.530055434458702E-5,0,2.4101580349273492E-31,0,0,0,9.8323535789124628E-34,null,540,1.5884153462545782E-4,4.2061216475546183E-4,0,6.1639883716953157E-30,0,0,0,1.9052140456979954E-32]
[550,1.2343226701099178E-2,3.3482333422659986E-2,0,6.4104569829843577E-28,0,0,0,1.0151191851117226E-29,null,550,1.2343271708883871E-2,3.3380061752606001E-2,0,1.1898807899503945E-27,0,0,0,9.4307510937753698E-30,null,550,9.5480203331642539E-6,2.5700539736208768E-5,0,5.6772385022410864E-31,0,0,0,6.4595741249176172E-33,null,550,1.5846965327702666E-4,4.272237543744382E-4,0,1.2316079284664554E-29,0,0,0,1.1182584037592273E-31]
[560,1.2312093009333003E-2,3.3968815265718079E-2,0,4.5567565717340728E-29,0,6.6315418852824602E-28,0,2.4700757361148235E-29,null,560,1.2312141111114767E-2,3.3870637951056881E-2,0,1.4222712034971465E-27,0,0,0,2.3747471687420696E-29,null,560,9.5239432779714339E-6,2.608479845148443E-5,0,1.060933708109661E-30,0,0,0,1.7224691213488631E-32,null,560,1.5807002287240998E-4,4.3357484350622802E-4,0,2.0315370560880024E-29,0,0,0,2.9229111427321186E-31]
[570,1.2278979618296375E-2,3.4435578096921708E-2,0,0,0,1.5553196263390204E-26,0,4.7470863893688437E-29,null,570,1.2279030553818064E-2,3.4341410489585389E-2,0,1.1101517953229955E-27,0,5.6255132121390461E-27,0,4.65465734383779E-29,null,570,9.4983343502776714E-6,2.6453640984703966E-5,0,1.6553946885966604E-30,0,0,0,3.4820005922951487E-32,null,570,1.5764496941840999E-4,4.3967060435598195E-4,0,2.7780077081876703E-29,0,0,0,5.8470985770482274E-31]
[580,1.2244053664363362E-2,3.488304136035094E-2,0,0,0,4.0080961387217412E-26,0,7.7174104996237238E-29,null,580,1.2244107193454378E-2,3.4792796757494499E-2,0,0,0,2.879461494628268E-26,0,7.6904775755394593E-29,null,580,9.4713228749706405E-6,2.6807387610095675E-5,0,2.1293776620787405E-30,0,5.6925700085373555E-30,0,5.8950440312911852E-32,null,580,1.5719663921100446E-4,4.4551636737123382E-4,0,2.9316202937872971E-29,0,1.8934734323885908E-28,0,9.8187620448394272E-31]
[590,1.2207469403191507E-2,3.5311632883472957E-2,0,0,0,7.3644016874261382E-26,0,1.0693582709343307E-28,null,590,1.2207525304164106E-2,3.5225223058910841E-2,0,0,0,6.4524725559634256E-26,0,1.0843775650026401E-28,null,590,9.4430282101388208E-6,2.7146366138856363E-5,0,2.029091064196972E-30,0,3.0925023188529778E-29,0,8.5260152320647451E-32,null,590,1.5672701313598365E-4,4.5111758449006747E-4,0,1.5724600023599472E-29,0,6.3227410727876138E-28,0,1.4082456358733758E-30]
[600,1.216936923218203E-2,3.572178647934425E-2,0,0,0,1.11679488261669E-25,0,1.2095959484716209E-28,null,600,1.2169427300366185E-2,3.5639122151733447E-2,0,0,0,1.1056771008350989E-25,0,1.2586338817958905E-28,null,600,9.4135605382674114E-6,2.7470909939531228E-5,0,6.2665428496869368E-31,0,6.9837823985532996E-29,0,1.0256718052708204E-31,null,600,1.5623791979903269E-4,4.5647979671084983E-4,0,0,0,1.2750281123164981E-27,0,1.6746025765768681E-30]
[610,1.2129884629241501E-2,3.6113939836983605E-2,0,0,0,1.4422589399754858E-25,0,9.170667025895632E-29,null,610,1.2129944675651249E-2,3.6034931081413202E-2,0,0,0,1.5896569941483109E-25,0,1.0196361844035582E-28,null,610,9.3830215925810334E-6,2.7781356194353703E-5,0,0,0,1.2004219393540863E-28,0,9.0270413712972048E-32,null,610,1.5573104758167768E-4,4.6160860553374979E-4,0,0,0,2.0547104902101786E-27,0,1.4363446215422166E-30]
[620,1.2089137014849628E-2,3.6488532669538332E-2,0,0,0,1.5528214942736532E-25,0,0,null,620,1.2089198864919371E-2,3.6413089278435479E-2,0,0,0,1.945144851314548E-25,0,0,null,620,9.3515053241589572E-6,2.8078044366766088E-5,0,0,0,1.730523782229354E-28,0,1.7208228885656403E-32,null,620,1.5520795571138073E-4,4.6650964786721603E-4,0,0,0,2.8074613064382155E-27,0,1.7673074012244954E-31]
[630,1.2047238543722518E-2,3.6846005093101909E-2,0,0,0,1.2361724836990094E-25,0,0,null,630,1.2047302036212541E-2,3.6774036891863385E-2,0,0,0,1.9452803482835695E-25,0,0,null,630,9.3190985144758976E-6,2.8361314857936315E-5,0,0,0,2.1266926129086912E-28,0,0,null,630,1.5467008442794408E-4,4.7118857403517615E-4,0,0,0,3.2496698326412654E-27,0,0]
[640,1.200429283194991E-2,3.718679621160826E-2,0,0,0,2.5587112177761223E-26,0,0,null,640,1.2004357817873998E-2,3.7118213333778918E-2,0,0,0,1.3069776999874646E-25,0,0,null,640,9.2858813380378371E-6,2.8631507832200707E-5,0,0,0,2.1474938413123884E-28,0,0,null,640,1.5411876432121192E-4,4.756510285553315E-4,0,0,0,2.9843122565353818E-27,0,0]
[650,1.196039562503381E-2,3.7511342885784935E-2,0,1.6514956032010479E-26,0,0,0,0,null,650,1.1960461966705414E-2,3.744605601207332E-2,0,0,0,0,0,0,null,650,9.2519278793345072E-6,2.8888962193419177E-5,0,0,0,1.4918717617209353E-28,0,0,null,650,1.5355522490998432E-4,4.7990263339363164E-4,0,0,0,1.5441640365394125E-27,0,0]
[660,1.1915635411721861E-2,3.7820078666412918E-2,0,6.3143199026851348E-26,0,0,0,0,null,660,1.1915702981886541E-2,3.7757999231495976E-2,0,0,0,0,0,0,null,660,9.2173066077774142E-6,2.9134014696129434E-5,0,0,0,0,0,0,null,660,1.5298060252460846E-4,4.8394897342885575E-4,0,0,0,0,0,0]
[670,1.1870093988195496E-2,3.8113432874128252E-2,0,1.3189720141087514E-25,0,0,0,0,null,670,1.1870162669205144E-2,3.8054473244683744E-2,0,4.0209050657487478E-26,0,0,0,0,null,670,9.1820808142657386E-6,2.9366999176932503E-5,0,0,0,0,0,0,null,670,1.5239594755206054E-4,4.8779558389022915E-4,0,0,0,0,0,0]
[680,1.1823846976666335E-2,3.8391829809774486E-2,0,2.2041352666513778E-25,0,0,0,0,null,680,1.1823916659749054E-2,3.8335903436915876E-2,0,1.297140729837588E-25,0,0,0,0,null,680,9.1463090124863943E-6,2.9588245893058955E-5,0,0,0,0,0,0,null,680,1.5180223109581673E-4,4.9144793955202581E-4,0,0,0,0,0,0]
[690,1.1776964302329555E-2,3.8655688081132594E-2,0,3.1922676689141883E-25,0,0,0,0,null,690,1.1777034886900555E-2,3.8602709630027744E-2,0,2.5771853255047428E-25,0,0,0,0,null,690,9.1100453079414527E-6,2.9798080956477191E-5,0,6.1733416280403076E-30,0,0,0,0,null,690,1.5120035110066752E-4,4.9491144549585939E-4,0,1.1735329572103496E-27,0,0,0,0]
[700,1.1729510631953009E-2,3.8905420033067115E-2,0,4.0965487708875682E-25,0,0,0,0,null,700,1.172958202498571E-2,3.8855305492289618E-2,0,4.1791607779616228E-25,0,0,0,0,null,700,9.0733397373462125E-6,2.9996825853029756E-5,0,1.0538850080845365E-28,0,0,0,0,null,700,1.5059113798480161E-4,4.9819142926595182E-4,0,3.1679520110037903E-27,0,0,0,0]
[710,1.1681545777434205E-2,3.9141431269697373E-2,0,4.6269786911872436E-25,0,0,0,0,null,710,1.1681617892875673E-2,3.9094098042532534E-2,0,5.9110892657743831E-25,0,0,0,0,null,710,9.0362385808561832E-6,3.0184797037144768E-5,0,2.5918715896181607E-28,0,0,0,0,null,710,1.4997535982250729E-4,5.0129313426495179E-4,0,5.9236178247859396E-27,0,0,0,0]
[720,1.1633125067221124E-2,3.9364120258285555E-2,0,4.3968786193667937E-25,0,0,0,4.152107214134872E-27,null,720,1.1633197825466884E-2,3.9319487238052217E-2,0,7.4201805515111236E-25,0,0,0,3.6333555452255807E-27,null,720,8.9987846495058098E-6,3.036230559380645E-5,0,4.671116139512741E-28,0,0,0,2.1979666155322756E-30,null,720,1.4935372711335151E-4,5.0422171425154182E-4,0,9.2668306934412299E-27,0,0,0,3.9889994081803405E-29]
[730,1.1584299688153015E-2,3.9573878005563584E-2,0,2.9536127168719448E-25,0,0,0,1.17402874525793E-26,null,730,1.1584373015558152E-2,3.9531865636741645E-2,0,8.1809817989169622E-25,0,0,0,1.1148949071231491E-26,null,730,8.9610175496884458E-6,3.0529656960109481E-5,0,7.1429388140138577E-28,0,0,0,7.9103001171194057E-30,null,730,1.487268971725884E-4,5.0698222881478527E-4,0,1.2756950872519756E-26,0,0,0,1.3529622645997097E-28]
[740,1.1535117000195858E-2,3.9771087798313849E-2,0,0,0,6.4481554933086584E-25,0,2.2358367913127194E-26,null,740,1.1535190828607969E-2,3.9731618125102931E-2,0,7.5155298911838579E-25,0,0,0,2.179102248702093E-26,null,740,8.9229739266922068E-6,3.0687150699731509E-5,0,9.6619258440103701E-28,0,0,0,1.6148102664808047E-29,null,740,1.4809547817205962E-4,5.0957963971649204E-4,0,1.5631280296161287E-26,0,0,0,2.7203772776218886E-28]
[750,1.1485620826468953E-2,3.9956125000710371E-2,0,0,0,2.8916260807536962E-24,0,3.5662529321138504E-26,null,750,1.1485695092836179E-2,3.9919121704496574E-2,0,4.655557835029306E-25,0,1.5542644134530459E-24,0,3.527507418356856E-26,null,750,8.8846876891276872E-6,3.0835080324186944E-5,0,1.1649943263931528E-27,0,0,0,2.6762206762173452E-29,null,750,1.4746003286574046E-4,5.1201880799935356E-4,0,1.6793149182165035E-26,0,0,0,4.4724211001756718E-28]
[760,1.1435851720235366E-2,4.0129356901880374E-2,0,0,0,5.8263357301783574E-24,0,5.0503780401469938E-26,null,760,1.1435926366198687E-2,4.0094745328875456E-2,0,0,0,4.6085025262719234E-24,0,5.0512448268805671E-26,null,760,8.8461902155113393E-6,3.097373315549852E-5,0,1.2292547732875686E-27,0,1.4345817076713697E-27,0,3.8984416915136245E-29,null,760,1.4682108201744752E-4,5.1430449177426057E-4,0,1.4865504243041849E-26,0,3.701452729431475E-26,0,6.4774207910560214E-28]
[770,1.1385847211193068E-2,4.0291142607713194E-2,0,0,0,9.290099547717314E-24,0,6.4709724467387765E-26,null,770,1.1385922182740005E-2,4.025884978796445E-2,0,0,0,8.4582296100843939E-24,0,6.5380115816889043E-26,null,770,8.8075105448439304E-6,3.1103390225374038E-5,0,1.0583220888241226E-27,0,4.5765783027050041E-27,0,5.1235599926607527E-29,null,770,1.461791075635919E-4,5.1644134460581521E-4,0,8.3277118058604744E-27,0,8.903124063603484E-26,0,8.4696653287724506E-28]
[780,1.1335642032334654E-2,4.044183297162824E-2,0,0,0,1.297878580906872E-23,0,7.4955011647847004E-26,null,780,1.1335717279483983E-2,4.0411787630425654E-2,0,0,0,1.2849583852310174E-23,0,7.6575752373846078E-26,null,780,8.7686755521181381E-6,3.1224326206619447E-5,0,5.4272966902862853E-28,0,8.5494773736672845E-27,0,6.0995471989158969E-29,null,780,1.455345555270972E-4,5.1843391442510855E-4,0,0,0,1.5252560562820975E-25,0,1.0028801213363089E-27]
[790,1.1285268329213496E-2,4.058177055952631E-2,0,0,0,1.6436470522716628E-23,0,7.6782416875104921E-26,null,790,1.1285343805709294E-2,4.0553903122138454E-2,0,0,0,1.7347353007713768E-23,0,7.9621569066296093E-26,null,790,8.7297101103075992E-6,3.1336809372789357E-5,0,0,0,1.3095646836267587E-26,0,6.4784851612564537E-29,null,790,1.4488783870422135E-4,5.2028664290575816E-4,0,0,0,2.2265065015168246E-25,0,1.0578047683767392E-27]
[800,1.1234755852936427E-2,4.0711289644726339E-2,0,0,0,1.9067889602891494E-23,0,6.4833329352882708E-26,null,800,1.1234831515962579E-2,4.0685532235302142E-2,0,0,0,2.1335398836425686E-23,0,6.9078058863980308E-26,null,800,8.6906372396185335E-6,3.1441101582715173E-5,0,0,0,1.7772064254821352E-26,0,5.8310422561605306E-29,null,800,1.4423933914288711E-4,5.2200386524653311E-4,0,0,0,2.9171581846897325E-25,0,9.4093868920907923E-28]
[810,1.1184132138307575E-2,4.0830716229051829E-2,0,0,0,2.017278701164861E-23,0,3.3332395353275196E-26,null,810,1.1184207948238319E-2,4.0807002664431997E-2,0,0,0,2.4041619510221446E-23,0,3.9015470697864341E-26,null,810,8.6514782454090092E-6,3.1537458286699706E-5,0,0,0,2.195115555013211E-26,0,3.6812605004939559E-29,null,810,1.4358941043080429E-4,5.2358981030907145E-4,0,0,0,3.4932054428144673E-25,0,5.742266299170544E-28]
[820,1.1133422668109861E-2,4.0940368086729614E-2,0,0,0,1.9002862823166587E-23,0,0,null,820,1.1133498588275623E-2,4.0918633865838869E-2,0,0,0,2.4589946222367696E-23,0,0,null,820,8.6122528452318952E-6,3.1626128551708224E-5,0,0,0,2.4846670124339271E-26,0,0,null,820,1.4293837980418905E-4,5.2504860106586783E-4,0,0,0,3.828845505724803E-25,0,0]
[830,1.1082651024858977E-2,4.1040554828006219E-2,0,0,0,1.4839367685334677E-23,0,0,null,830,1.1082727021335372E-2,4.102073711742369E-2,0,0,0,2.2078927744767883E-23,0,0,null,830,8.5729792863047662E-6,3.1707355102941721E-5,0,0,0,2.5566982695787648E-26,0,0,null,830,1.4228655009762979E-4,5.2638425531702172E-4,0,0,0,3.7859715309460156E-25,0,0]
[840,1.1031839030906284E-2,4.1131577979830525E-2,0,0,0,7.086592395596212E-24,0,0,null,840,1.1031915072277651E-2,4.1113615596014307E-2,0,0,0,1.5683147585366222E-23,0,0,null,840,8.5336744539260625E-6,3.1781374379701047E-5,0,0,0,2.3195195311556838E-26,0,0,null,840,1.416342015422603E-4,5.2760068663942092E-4,0,0,0,3.2275975791589892E-25,0,0]
[850,1.0981006877850601E-2,4.1213731081201153E-2,0,6.1794171276735993E-25,0,0,0,0,null,850,1.0981082935073437E-2,4.1197564469956351E-2,0,0,0,4.7704090412099832E-24,0,0,null,850,8.4943539715573218E-6,3.1848416603495879E-5,0,0,0,1.6892052340100264E-26,0,0,null,850,1.4098159342836107E-4,5.2870170553676401E-4,0,0,0,2.0344417677198073E-25,0,0]
[860,1.09301732461106E-2,4.128729979099497E-2,0,5.868119032338632E-24,0,0,0,0,null,860,1.0930249292299099E-2,4.1272871004462391E-2,0,0,0,0,0,0,null,860,8.4550322933923741E-6,3.1908705856674427E-5,0,0,0,6.0143531637097031E-27,0,0,null,860,1.4032896564019246E-4,5.2969102076149636E-4,0,0,0,1.2340218581952339E-26,0,0]
[870,1.0879355415416707E-2,4.1352562006365931E-2,0,1.2734132087440057E-23,0,0,0,0,null,870,1.087943142572609E-2,4.1339814678033625E-2,0,1.7813984230013551E-24,0,0,0,0,null,870,8.415722789833683E-6,3.1962460169920157E-5,0,0,0,0,0,0,null,870,1.39676540075317E-4,5.3057224078057396E-4,0,0,0,0,0,0]
[880,1.0828569366969047E-2,4.1409787990038208E-2,0,2.1021163759587433E-23,0,0,0,0,null,880,1.0828645318394815E-2,4.139866730803686E-2,0,1.0639039250130565E-23,0,0,0,0,null,880,8.376437826538556E-6,3.2009891617345207E-5,0,0,0,0,0,0,null,880,1.3902452195650589E-4,5.3134887536596088E-4,0,0,0,0,0,0]
[890,1.0777829877850661E-2,4.1459240504979941E-2,0,3.0302339062858345E-23,0,0,0,0,null,890,1.0777905749159492E-2,4.1449693183958532E-2,0,2.2036293197704797E-23,0,0,0,0,null,890,8.3371888374701038E-6,3.2051206417851794E-5,0,0,0,0,0,0,null,890,1.3837310104370426E-4,5.3202433728630292E-4,0,4.1671301293488106E-26,0,0,0,0]
[900,1.0727150608519864E-2,4.1501174955127181E-2,0,3.9895509058648138E-23,0,0,1.6863645436818073E-40,0,null,900,1.072722638004592E-2,4.1493149207023634E-2,0,3.5591436170178038E-23,0,0,1.1070012037946351E-40,0,null,900,8.297986392588686E-6,3.2086605041672495E-5,0,3.3186559017137829E-27,0,0,0,0,null,900,1.3772245275817658E-4,5.3260194408392459E-4,0,2.1881436168562581E-25,0,0,0,0]
[910,1.0676544183495038E-2,4.1535839530817589E-2,0,4.8860824508425034E-23,0,0,2.6334400815927357E-40,0,null,910,1.0676619837106405E-2,4.1529285034692949E-2,0,5.0549829433149245E-23,0,0,2.6012877747105704E-40,0,null,910,8.258840260309197E-6,3.211628232106563E-5,0,1.6283426305847185E-26,0,0,0,0,null,910,1.3707273921815521E-4,5.3308491991741456E-4,0,4.4498915976418452E-25,0,0,0,0]
[920,1.0626022266224514E-2,4.1563475358125455E-2,0,5.6023771380737637E-23,0,0,3.0858203584930539E-40,0,null,920,1.0626097785138117E-2,4.155834322933305E-2,0,6.5756654643893429E-23,0,0,4.3678212028557525E-40,0,null,920,8.2197594654138962E-6,3.214042756440478E-5,0,3.2782412332865386E-26,0,0,0,0,null,920,1.3642411020003446E-4,5.3347639746116496E-4,0,7.1224465657114717E-25,0,0,0,0]
[930,1.0575595628312572E-2,4.1584316651043104E-2,0,6.0026638554068687E-23,0,0,2.1419483332387517E-40,0,null,930,1.0575670997054087E-2,4.1580559409855992E-2,0,7.9664188010786528E-23,0,0,5.5345412050222116E-40,0,null,930,8.1807523426125706E-6,3.2159224672830784E-5,0,5.2231501782072402E-26,0,0,0,0,null,930,1.3577670402837265E-4,5.3377941984483193E-4,0,1.0054312801303594E-24,0,0,0,0]
[940,1.0525274213589361E-2,4.1598590865512368E-2,0,5.9409169647480348E-23,0,0,0,2.1832877220822649E-25,null,940,1.0525349417867057E-2,4.1596162405415214E-2,0,9.0379929807977444E-23,0,0,4.5691833793160232E-40,1.4816590139741109E-25,null,940,8.1418265861275193E-6,3.2172852258650862E-5,0,7.3529836449992988E-26,0,0,0,3.0876851559280835E-29,null,940,1.351306483974483E-4,5.3399694262134048E-4,0,1.3017531392166646E-24,0,0,0,9.8073400997151216E-28]
[950,1.0475067197540855E-2,4.1606518854964657E-2,0,5.271657745057689E-23,0,0,0,1.035856612910357E-24,null,950,1.0475142224181428E-2,4.160537441071134E-2,0,9.575896396261307E-23,0,0,0,9.6326983327909452E-25,null,950,8.1029892956664353E-6,3.2181483765235589E-5,0,9.5028803670066001E-26,0,0,0,6.5737331751899049E-28,null,950,1.3448606113525686E-4,5.3413183575829013E-4,0,1.5709908300425366E-24,0,0,0,1.1403719184629419E-26]
[960,1.0424983042226344E-2,4.1608315026323679E-2,0,3.8630377025320084E-23,0,0,0,2.073766374488044E-24,null,960,1.042505787905597E-2,4.1608411141940596E-2,0,9.3540283639553955E-23,0,0,0,2.0055714058707571E-24,null,960,8.0642470189321046E-6,3.2185287587443454E-5,0,1.1454892431030223E-25,0,0,0,1.4674785694223952E-27,null,960,1.3384305090839198E-4,5.3418688563752889E-4,0,1.7765071571887018E-24,0,0,0,2.4830709596523931E-26]
[970,1.0375029547251946E-2,4.160418749619442E-2,0,1.6114854668004329E-23,0,0,0,3.3077870748356665E-24,null,970,1.0375104183086733E-2,4.1605481992976451E-2,0,8.1522764817590736E-23,0,0,0,3.2526233732747513E-24,null,970,8.0256057910628331E-6,3.2184427192450036E-5,0,1.2945256131050076E-25,0,0,0,2.4460582080517007E-27,null,970,1.3320171787657061E-4,5.3416479706138418E-4,0,1.8770905110618178E-24,0,0,0,4.0997932572698532E-26]
[980,1.0325213896965566E-2,4.1594338246607528E-2,0,0,0,2.7491604926202645E-23,0,4.6877038084258979E-24,null,980,1.032528832148402E-2,4.1596790191251676E-2,0,5.7772339079839026E-23,0,0,0,4.6557383375386208E-24,null,980,7.9870711711024112E-6,3.2179061240446543E-5,0,1.3677628570304065E-25,0,0,0,3.5573599043014695E-27,null,980,1.3256215429866778E-4,5.3406819525439952E-4,0,1.8296206335593136E-24,0,0,0,5.9301133623611516E-26]
[990,1.0275542704333266E-2,4.1578963279997438E-2,0,0,0,1.1376533048646007E-22,0,6.1348209829752209E-24,null,990,1.0275616908060127E-2,4.1582532952915974E-2,0,2.0848072877275236E-23,0,6.2300720202111062E-23,0,6.1372393099949492E-24,null,990,7.94864827601779E-6,3.2169343704838946E-5,0,1.3342177054471585E-25,0,0,0,4.7426323505511898E-27,null,990,1.319244450965718E-4,5.3389962785809603E-4,0,1.5924645776438491E-24,0,0,0,7.8757480816408125E-26]
[1000,1.022602205129532E-2,4.1558252772788927E-2,0,0,0,2.151882837409538E-22,5.1534878555429912E-39,7.5412780537294944E-24,null,1000,1.0226096025508571E-2,4.1562901636730723E-2,0,0,0,1.7021272714351509E-22,0,7.5895631692584515E-24,null,1000,7.9103418119033315E-6,3.2155423991598375E-5,0,1.1639862598761391E-25,0,5.4303256269118501E-26,0,5.9191750977343488E-27,null,1000,1.3128866837284003E-4,5.3366156690983413E-4,0,1.1294333233203452E-24,0,1.38829495607846E-24,0,9.7991237582812187E-26]
[]
[]
["Saved  20/03/2023: 16:40:47  Level Number: 5"]
[]
["BREAKTHROUGH RESULTS"]
[]
["Advanced"]
["Pollutant Linkage: Inert Restorati, Attenution Layer, Beenham Grange Formation",null,null,null,null,null,null,null,null,null,"Pollutant Linkage: Inert Restorati, Attenution Layer, Beenham Grange Formation, Groundwater ",null,null,null,null,null,null,null,null,null,"Pollutant Linkage: Inert Restorati, Attenution Layer, Beenham Grange Formation, River Enborne",null,null,null,null,null,null,null,null,null,"Pollutant Linkage: Inert Restorati, Attenution Layer, Beenham Grange Formation, Spring Ditch"]
["Concentrations in mg/L in Beenham Grange Formation",null,null,null,null,null,null,null,null,null,"Concentrations in mg/L in Groundwater ",null,null,null,null,null,null,null,null,null,"Concentrations in mg/L in River Enborne",null,null,null,null,null,null,null,null,null,"Concentrations in mg/L in Spring Ditch"]
[]
["Compared with EAL (GW) target concentration in mg/L",null,null,null,null,null,null,null,null,null,"Compared with EAL (GW) target concentration in mg/L",null,null,null,null,null,null,null,null,null,"Compared with EAL (River Enborne) target concentration in mg/L",null,null,null,null,null,null,null,null,null,"Compared with EAL (Spring Ditch) target concentration in mg/L"]
[null,0.39,4.8199999999999993E-2,3.2649999999999991E-4,1E-3,4.3649999999999991E-3,2.0000000000000002E-5,2E-3,2.0000000000000001E-4,null,null,0.39,4.8199999999999993E-2,3.2649999999999991E-4,1E-3,4.3649999999999991E-3,2.0000000000000002E-5,2E-3,2.0000000000000001E-4,null,null,0.39,2.76E-2,6.4999999999999994E-5,1E-3,4.4000000000000003E-3,2.0000000000000002E-5,1.75E-3,2.0000000000000001E-4,null,null,0.39,0.03,5.0000000000000002E-5,1E-3,3.5500000000000002E-3,2.0000000000000002E-5,1.5E-3,2.0000000000000001E-4]
[]
["Time(years)","Species1","Species2","Species3","Species4","Species5","Species6","Species7","Species8",null,"Time(years)","Species1","Species2","Species3","Species4","Species5","Species6","Species7","Species8",null,"Time(years)","Species1","Species2","Species3","Species4","Species5","Species6","Species7","Species8",null,"Time(years)","Species1","Species2","Species3","Species4","Species5","Species6","Species7","Species8"]
[null,"Ammoniacal Nitrogen","Barium","Cadmium","Total Chromium","Copper","Mercury","Molybdenum","Lead",null,null,"Ammoniacal Nitrogen","Barium","Cadmium","Total Chromium","Copper","Mercury","Molybdenum","Lead",null,null,"Ammoniacal Nitrogen","Barium","Cadmium","Total Chromium","Copper","Mercury","Molybdenum","Lead",null,null,"Ammoniacal Nitrogen","Barium","Cadmium","Total Chromium","Copper","Mercury","Molybdenum","Lead"]
[10,1.9176753035767084E-12,2.3528154640992319E-22,0,0,0,0,0,0,null,10,1.8517398094899134E-12,0,0,0,0,0,0,0,null,10,1.359458810211212E-15,5.1566687830634195E-26,0,0,0,0,0,0,null,10,2.2958918343941704E-14,2.8725633462689074E-25,0,0,0,0,0,0]
[20,2.4964755466582675E-7,1.8184771294196808E-15,0,0,0,0,0,0,null,20,2.4744129375361557E-7,1.1816712289902459E-16,0,0,0,0,0,0,null,20,1.8887313072611548E-10,3.2589338241051262E-21,0,0,0,0,0,0,null,20,3.1487000518534935E-9,1.8041686566412734E-19,0,0,0,0,0,0]
[30,1.3245880091967222E-5,7.1501106461082394E-11,0,0,0,0,0,0,null,30,1.3193269586050863E-5,1.8341564159664127E-11,0,0,0,0,0,0,null,30,1.0144701639383584E-8,2.4333118473602594E-15,0,0,0,0,0,0,null,30,1.6870875458128709E-7,7.052489509642158E-14,0,0,0,0,0,0]
[40,9.7822009131676995E-5,1.4608316784064376E-8,0,0,0,0,0,0,null,40,9.7602233469682611E-5,6.5610452223773618E-9,0,0,0,0,0,0,null,40,7.5244434751375513E-8,1.6563085204585389E-12,0,0,0,0,0,0,null,40,1.250249636556785E-6,3.9501691842250227E-11,0,0,0,0,0,0]
[50,3.2591634090016919E-4,3.6099003943723728E-7,0,0,0,0,0,0,null,50,3.254468850686777E-4,2.1381866924457961E-7,0,0,0,0,0,0,null,50,2.5120094025861991E-7,7.7024990217652333E-11,0,0,0,0,0,0,null,50,4.1722283388151664E-6,1.6435563895043285E-9,0,0,0,0,0,0]
[60,7.2700000202025256E-4,3.0898170608355557E-6,0,0,0,0,0,0,null,60,7.2627381651487561E-4,2.1380590763571909E-6,0,0,0,0,0,0,null,60,5.6095715608620627E-7,9.5410971836312033E-10,0,0,0,0,0,0,null,60,9.3149477365872317E-6,1.9007842046586388E-8,0,0,0,0,0,0]
[70,1.2873075622878262E-3,1.439708398273412E-5,0,0,0,0,0,0,null,70,1.2863668216924267E-3,1.0962189462224551E-5,0,0,0,0,0,0,null,70,9.9396030636157776E-7,5.6124231044645387E-9,0,0,0,0,0,0,null,70,1.6502945114480169E-5,1.0691157234914015E-7,0,0,0,0,0,0]
[80,1.9713309122148691E-3,4.5810185512216256E-5,0,0,0,0,0,0,null,80,1.9702353970703118E-3,3.7143882582803756E-5,0,0,0,0,0,0,null,80,1.5227776949626674E-6,2.0864870567690676E-8,0,0,0,0,0,0,null,80,2.5280802319438492E-5,3.8548488048988977E-7,0,0,0,0,0,0]
[90,2.7387913658622619E-3,1.1293472682064658E-4,0,0,0,0,0,0,null,90,2.7375997631564949E-3,9.5639527269431414E-5,0,0,0,0,0,0,null,90,2.1162502158863178E-6,5.7344522826571611E-8,0,0,0,0,0,0,null,90,3.5131373709864161E-5,1.0367447911815233E-6,0,0,0,0,0,0]
[100,3.5532451406856281E-3,2.3273114152713749E-4,0,0,0,0,0,0,null,100,3.5520071385547179E-3,2.0335838315116127E-4,0,0,0,0,0,0,null,100,2.7461698908738609E-6,1.2785900975064048E-7,0,0,0,0,0,0,null,100,4.5586544871438116E-5,2.2752430239932712E-6,0,0,0,0,0,0]
[110,4.3851320833119024E-3,4.2080947937844077E-4,0,0,0,0,0,0,null,110,4.3838864395679307E-3,3.7636280613037923E-4,0,0,0,0,0,0,null,110,3.3896497327215824E-6,2.4519679032002371E-7,0,0,0,0,0,0,null,110,5.6266527165544954E-5,4.3116058630167121E-6,0,0,0,0,0,0]
[120,5.2120354504414622E-3,6.8957847595747758E-4,0,0,0,0,0,0,null,120,5.2108107399859516E-3,6.27813575783484E-4,0,0,0,0,0,0,null,120,4.0293298820791996E-6,4.2032511413406019E-7,0,0,0,0,0,0,null,120,6.6883261767630375E-5,7.3237269932218776E-6,0,0,0,0,0,0]
[130,6.0178052267716641E-3,1.0473910901983019E-3,0,0,0,0,0,0,null,130,6.016621520384422E-3,9.6692111602468631E-4,0,0,0,0,0,0,null,130,4.6527012662956709E-6,6.6134244864408677E-7,0,0,0,0,0,0,null,130,7.7229188327846158E-5,1.1440701450433249E-5,0,0,0,0,0,0]
[140,6.7913662149025342E-3,1.4984737370604586E-3,0,0,0,0,0,0,null,140,6.7902368833868245E-3,1.3987369403959443E-3,0,0,0,0,0,0,null,140,5.2511838574929029E-6,9.7313546749959047E-7,0,0,0,0,0,0,null,140,8.716194586552905E-5,1.6738183964796123E-5,0,0,0,0,0,0]
[150,7.525567751112028E-3,2.0433427604349603E-3,0,0,0,0,0,0,null,150,7.5245010745355846E-3,1.9244920165908464E-3,0,0,0,0,0,0,null,150,5.8192365095654583E-6,1.3575298846715033E-6,0,0,0,0,0,0,null,150,9.6589599846404718E-5,2.3241552522771334E-5,0,0,0,0,0,0]
[160,8.2162027940944436E-3,2.6794563544314488E-3,0,0,0,0,0,0,null,160,8.2152032835061499E-3,2.5422163253137828E-3,0,0,0,0,0,0,null,160,6.3535976318121191E-6,1.8137175262571862E-6,0,0,0,0,0,0,null,160,1.0545804137272897E-4,3.0933320204730071E-5,0,0,0,0,0,0]
[170,8.8612209558929355E-3,3.4019291078111651E-3,0,0,0,0,0,0,null,170,8.8602903917698941E-3,3.2474504207366923E-3,0,0,0,0,0,0,null,170,6.8526758919619427E-6,2.338794308422534E-6,0,0,0,0,0,0,null,170,1.1374087640791723E-4,3.976215504813197E-5,0,0,0,0,0,0]
[180,9.4601186837892301E-3,4.2042076426941112E-3,0,0,0,0,0,0,null,180,9.4592569104403872E-3,4.0339342491346707E-3,0,0,0,0,0,0,null,180,7.3160780277010682E-6,2.9283036701696073E-6,0,0,0,0,0,0,null,180,1.2143159036031028E-4,4.9651852789753788E-5,0,0,0,0,0,0]
[190,1.0013476907496505E-2,5.0786574569425171E-3,0,0,0,0,0,0,null,190,1.0012682430183367E-2,4.8942143214163545E-3,0,0,0,0,0,0,null,190,7.7442508183790115E-6,3.5767279650464421E-6,0,0,0,0,0,0,null,190,1.285376071006009E-4,6.0509377541737307E-5,0,0,0,0,0,0]
[200,1.0522615720315882E-2,6.0170439059807866E-3,0,0,0,0,0,0,null,200,1.0521886148363817E-2,5.8201467019579926E-3,0,0,0,0,0,0,null,200,8.1382136704343146E-6,4.2779028654714889E-6,0,0,0,0,0,0,null,200,1.3507585163099743E-4,7.2231600655902302E-5,0,0,0,0,0,0]
[210,1.0989339438824399E-2,7.010908944094842E-3,0,0,0,0,0,0,null,210,1.0988671810984613E-2,6.8032944682042788E-3,0,0,0,0,0,0,null,210,8.4993611840268883E-6,5.025349503565207E-6,0,0,0,0,0,0,null,210,1.4106947401018444E-4,8.4710675549475538E-5,0,0,0,0,0,0]
[220,1.1415750298560913E-2,8.0518545374558149E-3,0,0,0,0,0,0,null,220,1.1415141319519951E-2,7.8352291894772403E-3,0,0,0,0,0,0,null,220,8.8293188680032261E-6,5.8125296576888929E-6,0,0,0,0,0,0,null,220,1.4654545520361467E-4,9.7838149309739669E-5,0,0,0,0,0,0]
[230,1.1804113712746849E-2,9.1317472414267891E-3,0,0,0,0,4.0266998086639027E-40,0,null,230,1.1803559923168613E-2,8.9077504956601369E-3,0,0,0,0,2.6046428197078383E-40,0,null,230,9.1298387840484387E-6,6.6330340956703778E-6,0,0,0,0,0,0,null,230,1.5153287550067146E-4,1.1150798387458616E-4,0,0,0,0,0,0]
[240,1.2156761979965756E-2,1.024285881890229E-2,0,0,0,0,0,0,null,240,1.2156259877132338E-2,1.001303869763538E-2,0,0,0,0,1.0232548346235316E-39,0,null,240,9.4027249655066049E-6,7.4807155991265033E-6,0,0,0,0,0,0,null,240,1.5606167699701201E-4,1.2561867870957495E-4,0,0,0,0,0,0]
[250,1.2476026500962491E-2,1.1377956553279752E-2,0,0,0,0,0,0,null,250,1.247557262287201E-2,1.1143754438010274E-2,0,0,0,0,0,0,null,250,9.649780913930514E-6,8.3497777927355888E-6,0,0,0,0,0,0,null,250,1.6016179242153155E-4,1.4007467806051175E-4,0,0,0,0,0,0]
[260,1.2764191032639226E-2,1.2530355020445397E-2,0,0,4.1689280714741373E-40,0,8.9365919369607764E-38,0,null,260,1.2763782015215063E-2,1.2293097546996389E-2,0,0,0,0,2.94068168559276E-38,0,null,260,9.8727733873200343E-6,9.2348296527110389E-6,0,0,0,0,0,0,null,260,1.6386254429717601E-4,1.5478722419971165E-4,0,0,0,0,0,0]
[270,1.3023460391702681E-2,1.3693939051085364E-2,0,0,1.3936606794684991E-39,0,5.8142366055966987E-37,0,null,270,1.3023093006298224E-2,1.3454835247865473E-2,0,0,5.8632013177779276E-40,0,3.773151335513679E-37,0,null,270,1.0073408153146646E-5,1.0130914025424519E-5,0,0,0,0,1.2803371522014733E-40,0,null,270,1.671922426367194E-4,1.6967479225697029E-4,0,0,0,0,3.1999487947478901E-39,0]
[280,1.3255940443742337E-2,1.4863165703173422E-2,0,0,0,0,3.9192518949102166E-36,0,null,280,1.3255611620305035E-2,1.4623307907470929E-2,0,0,8.0621999009980838E-39,0,1.6827014929028797E-36,0,null,280,1.0253314481432596E-5,1.1033516947285545E-5,0,0,0,0,8.1539926434670235E-40,0,null,280,1.7017792766417075E-4,1.8466321681840915E-4,0,0,0,0,1.4609973314977942E-38,0]
[290,1.3463626281633657E-2,1.6033051390392655E-2,0,0,5.2448575077718349E-39,0,2.8297101298348317E-35,0,null,290,1.3463333121499308E-2,1.5793418800099719E-2,0,0,0,0,1.2823409367092446E-35,0,null,290,1.0414035980258985E-5,1.1938563163147729E-5,0,0,0,0,3.0265068934390409E-39,0,null,290,1.7284521777710026E-4,1.9968559765114402E-4,0,0,2.1838459340289884E-40,0,7.1112703593924194E-38,0]
[300,1.3648396295677675E-2,1.7199148908485257E-2,0,0,2.8455952870997716E-37,0,1.5522159077410963E-34,0,null,300,1.3648136076954313E-2,1.6960612893548881E-2,0,0,0,0,8.7207307410078766E-35,0,null,300,1.0557025994457144E-5,1.2842402047116976E-5,0,0,0,0,2.4831634854411828E-38,0,null,300,1.7521823322543862E-4,2.1468205246041479E-4,0,0,0,0,5.8739912572591448E-37,0]
[310,1.3812010433481639E-2,1.8357517958510875E-2,0,0,1.4496171786680278E-36,0,6.584548409167212E-34,0,null,310,1.3811780611193727E-2,1.8120848471703952E-2,0,0,4.2659131215673627E-37,0,4.1959717406484742E-34,0,null,310,1.0683646249435551E-5,1.3741787143863315E-5,0,0,0,0,1.5881060318715032E-37,0,null,310,1.77319573636711E-4,2.2959936856954788E-4,0,0,0,0,3.3757924238726923E-36,0]
[320,1.3956111391604541E-2,1.9504691854939849E-2,0,0,7.2339382899649326E-36,0,2.2884023930317814E-33,0,null,320,1.3955909594219128E-2,1.9270564451945606E-2,0,0,2.4319918243638208E-36,0,1.5974916610421065E-33,0,null,320,1.0795167765950887E-5,1.4633851754454973E-5,0,0,0,0,6.9689524542726624E-37,0,null,320,1.791703332217911E-4,2.4439059254122457E-4,0,0,8.1612913012342018E-39,0,1.4008372261949565E-35,0]
[330,1.4082227811533298E-2,2.0637642392107615E-2,0,0,4.1724869319175577E-35,0,6.4669301562326693E-33,0,null,330,1.4082051835044919E-2,2.0406645503769784E-2,0,0,6.9279747119320124E-36,0,5.0927952441374735E-33,0,null,330,1.0892773327598481E-5,1.5516082362902148E-5,0,0,2.1991971306932363E-39,0,2.4557270885141269E-36,0,null,330,1.8079014174390411E-4,2.5901458659953708E-4,0,0,5.6354134637182685E-38,0,4.7978986283027785E-35,0]
[340,1.4191778798837651E-2,2.1753744289891411E-2,0,0,2.0464691796062793E-34,0,1.3595468591146244E-32,0,null,340,1.4191626599280912E-2,2.1526386491767854E-2,0,0,3.7283650557230336E-35,0,1.306736584252449E-32,0,null,340,1.097756097349746E-5,1.6386291210555404E-5,0,0,7.2516193312650904E-39,0,7.3883239181497982E-36,0,null,340,1.8219722249744044E-4,2.734355728107752E-4,0,0,1.4391507299745999E-37,0,1.3880665905652404E-34,0]
[350,1.4286079267730517E-2,2.2850740216875588E-2,0,0,8.0662655530731176E-34,0,1.4538191913717947E-32,0,null,350,1.428594895276976E-2,2.2627457319101315E-2,0,0,2.2246155277225436E-34,0,2.3328202272751073E-32,0,null,350,1.1050548130703535E-5,1.7242588949286087E-5,0,0,2.0376856465277757E-38,0,1.7946947546814112E-35,0,null,350,1.8340846090005535E-4,2.8762267990977634E-4,0,0,6.109112601873601E-37,0,3.1246415630244823E-34,0]
[360,1.436634574968541E-2,2.3926707069662646E-2,0,0,2.6735934726490447E-33,0,0,0,null,360,1.4366235569715389E-2,2.3707868908762534E-2,0,0,9.6518243892963311E-34,0,1.094655221288473E-32,0,null,360,1.111267610644841E-5,1.8083358018204373E-5,0,0,1.1557764738415843E-37,0,2.9353942904514949E-35,0,null,360,1.8443947905432044E-4,3.0154950304635779E-4,0,0,3.7285549318158802E-36,0,4.2267224785808272E-34,0]
[370,1.443370240637897E-2,2.4980023947967896E-2,0,0,7.6630547460115728E-33,0,0,0,null,370,1.4433610745468015E-2,2.4765940805917298E-2,0,0,3.2884036969607579E-33,0,0,0,null,370,1.1164814739077534E-5,1.8907227173380094E-5,0,0,6.061314321012237E-37,0,4.8255622893536108E-36,0,null,370,1.8530471294098702E-4,3.1519368326045073E-4,0,0,1.6827672197050111E-35,0,0,0]
[380,1.4489187062582084E-2,2.6009342088393776E-2,0,0,1.8748897508115822E-32,0,0,0,null,380,1.4489112429508736E-2,2.5800270696336072E-2,0,0,9.6705629795491994E-33,0,0,0,null,380,1.1207767064862144E-5,1.9713047439841957E-5,0,0,2.3220293099062922E-36,0,0,0,null,380,1.8601748987409947E-4,3.28536510918936E-4,0,0,5.7585141264567943E-35,0,0,0]
[390,1.4533757130621182E-2,2.701355689096388E-2,0,0,3.693020366248101E-32,0,0,0,null,390,1.4533698150136689E-2,2.6809705998257011E-2,0,0,2.5254795463499203E-32,0,0,0,null,390,1.1242273901236895E-5,2.0499869637486847E-5,0,0,7.143526050184637E-36,0,0,0,null,390,1.8659010456839991E-4,3.4156255545855448E-4,0,0,1.6659553929873516E-34,0,0,0]
[400,1.4568295339420313E-2,2.7991782080106598E-2,0,0,4.8792069971423285E-32,0,0,0,null,400,1.4568250743855088E-2,2.7793317585934875E-2,0,0,5.6444177194189525E-32,0,0,0,null,400,1.1269018279087797E-5,2.1266923547375649E-5,0,0,1.9258444856861591E-35,0,0,0,null,400,1.8703389270040161E-4,3.5425932241453219E-4,0,0,4.3128620297510537E-34,0,0,0]
[410,1.4593615211509304E-2,2.8943325976885256E-2,0,0,0,0,0,0,null,410,1.4593583832786578E-2,2.8750375633179674E-2,0,0,9.7963090101283503E-32,0,0,0,null,410,1.1288629680194718E-5,2.2013598724380215E-5,0,0,4.6655211875877123E-35,0,0,0,null,410,1.8735930123527414E-4,3.6661693774692005E-4,0,0,9.8496088030807236E-34,0,0,0]
[420,1.4610466253870594E-2,2.9867669815117844E-2,0,0,0,0,3.1950441120148827E-31,0,null,420,1.4610447015961064E-2,2.9680327517237728E-2,0,0,9.3961284270292255E-32,0,0,0,null,420,1.130168805340739E-5,2.2739426920252778E-5,0,0,9.7609359161408818E-35,0,0,0,null,420,1.8757595508099361E-4,3.7862785880908611E-4,0,0,1.8400535044622187E-33,0,0,0]
[430,1.4619538844448892E-2,3.0764448005137002E-2,0,0,0,0,1.7798396962109675E-29,0,null,430,1.4619530756293367E-2,3.0582777691715145E-2,0,0,0,0,5.7512414262960863E-30,0,null,430,1.1308727595428722E-5,2.344406605310356E-5,0,0,1.584194376610709E-34,0,0,0,null,430,1.8769271983582321E-4,3.9028661085702967E-4,0,0,2.2949038901136599E-33,0,0,0]
[440,1.4621468808100798E-2,3.1633430231440718E-2,0,0,0,0,5.9174905046164499E-29,0,null,440,1.4621470956995871E-2,3.1457469417643477E-2,0,0,0,0,3.9110479009424426E-29,0,null,440,1.1310240291384189E-5,2.4127285641528976E-5,0,0,1.3275942545552939E-34,0,8.1805061070702356E-33,0,null,440,1.8771776054821003E-4,4.0158954771879338E-4,0,0,0,0,2.4690460692382491E-31,0]
[450,1.461684168369452E-2,3.2474505261128814E-2,0,0,0,0,1.3204190135303648E-28,0,null,450,1.4616853229137536E-2,3.2304268230995171E-2,0,0,0,0,1.0970474902620071E-28,0,null,450,1.1306679216439567E-5,2.4788953611326593E-5,0,0,0,0,4.8804556161216669E-32,0,null,450,1.8765859651209482E-4,4.1253463508340247E-4,0,0,0,0,1.0142675536607927E-30,0]
[460,1.4606196690086096E-2,3.328766633665111E-2,0,0,0,0,2.2614921900998611E-28,0,null,460,1.4606216858057486E-2,3.3123147020478312E-2,0,0,0,0,2.2228201677269502E-28,0,null,460,1.1298461604531448E-5,2.5429024377948953E-5,0,0,0,0,1.3263581417732015E-31,0,null,460,1.8752215219520687E-4,4.231212547968731E-4,0,0,0,0,2.470008162187379E-30,0]
[470,1.4590030402264875E-2,3.4072998027063928E-2,0,0,0,0,2.9029249638999517E-28,0,null,470,1.4590058479942292E-2,3.3914172589439025E-2,0,0,0,0,3.4814642452306218E-28,0,null,470,1.1285971692756112E-5,2.6047528106830212E-5,0,0,0,0,2.6364245700571236E-31,0,null,470,1.8731480444627511E-4,4.3335002854210563E-4,0,0,0,0,4.5459677132412432E-30,0]
[480,1.4568800151557162E-2,3.4830664415609426E-2,0,0,0,0,2.0725353614078388E-28,0,null,480,1.4568835482422467E-2,3.4677493578740864E-2,0,0,0,0,3.922827185583041E-28,0,null,480,1.1269563352372018E-5,2.664456105549982E-5,0,0,0,0,4.0674492726175295E-31,0,null,480,1.870424261587361E-4,4.4322265931194343E-4,0,0,0,0,6.4365567431652621E-30,0]
[490,1.4542927165165828E-2,3.5560898506825769E-2,0,0,2.1037077511247974E-29,0,0,0,null,490,1.4542969144501802E-2,3.5413329632650946E-2,0,0,0,0,1.6431579190555508E-28,0,null,490,1.1249562518076211E-5,2.722027690485236E-5,0,0,0,0,4.5161510612067334E-31,0,null,490,1.8671042658741386E-4,4.5274178914557316E-4,0,0,0,0,6.0505003663071108E-30,0]
[500,1.4512799461016973E-2,3.6263992743000149E-2,0,0,9.0220573077753721E-29,0,0,0,null,500,1.4512847531737288E-2,3.6121961696103454E-2,0,0,0,0,0,0,null,500,1.1226269427931246E-5,2.7774878991698545E-5,0,0,0,0,1.8210045190242586E-31,0,null,500,1.8632378852322662E-4,4.6191087167789989E-4,0,0,0,0,0,0]
[510,1.4478774513941301E-2,3.694029052695183E-2,6.1554864528053874E-40,0,2.2213503704371005E-28,0,0,0,null,510,1.4478828162778467E-2,3.6803723338826928E-2,0,0,6.8960192953301265E-29,0,0,0,null,510,1.1199960686416527E-5,2.8308613359991385E-5,0,0,0,0,0,0,null,510,1.8588710253138188E-4,4.707340581407491E-4,0,0,0,0,0,0]
[520,1.4441181709237952E-2,3.7590178655671685E-2,4.9506799210275714E-39,0,4.255615920094578E-28,0,0,0,null,520,1.4441240463222401E-2,3.7458993009336375E-2,3.4027387760657185E-39,0,2.3426622738547062E-28,0,0,0,null,520,1.1170891162928992E-5,2.8821762553925095E-5,0,0,0,0,0,0,null,520,1.8540459845919181E-4,4.7921609555078335E-4,0,0,4.9390321205054156E-31,0,0,0]
[530,1.4400324598851749E-2,3.8214080576694731E-2,1.5639387134035844E-38,0,6.7104340455245324E-28,0,0,0,null,530,1.4400388022066717E-2,3.8088187129129543E-2,1.2998690242197363E-38,0,5.285324090015284E-28,0,0,0,null,530,1.1139295737578533E-5,2.9314640081799725E-5,0,0,7.6609210033798637E-32,0,0,0,null,530,1.8488017440959086E-4,4.8736223591375454E-4,1.3578814838676506E-40,0,2.8218577276706499E-30,0,0,0]
[540,1.4356482975043825E-2,3.881245038652132E-2,3.8166878627397489E-38,0,8.5468148739626572E-28,0,0,0,null,540,1.4356550665653911E-2,3.8691753944932211E-2,3.2328675982007699E-38,0,9.5365823223794814E-28,0,0,0,null,540,1.1105390905740716E-5,2.9787585485334363E-5,0,0,2.9037645031412954E-31,0,0,0,null,540,1.8431742337007769E-4,4.9517815537086969E-4,3.649445958233537E-40,0,7.4106685972389166E-30,0,0,0]
[550,1.4309914775559103E-2,3.9385767497197341E-2,9.0536686366911431E-38,0,7.6038718201186305E-28,0,0,0,null,550,1.4309986363085813E-2,3.9270168063728836E-2,7.1946690506375452E-38,0,1.4236093421356764E-27,0,0,0,null,550,1.1069376252251698E-5,3.0240959954590972E-5,0,0,6.8207864943973489E-31,0,0,0,null,550,1.8371965767938287E-4,5.0266988230296243E-4,7.8189747811795552E-40,0,1.4777485224073852E-29,0,0,0]
[560,1.4260857833382226E-2,3.9934531903877239E-2,2.3413970625537835E-37,0,3.9692195643693548E-29,0,9.4603504717419371E-28,0,null,560,1.4260932976191241E-2,3.9823925602034869E-2,1.7413820755042077E-37,0,1.6964851696672558E-27,0,0,0,null,560,1.1031435805340307E-5,3.0675142433910912E-5,0,0,1.272289324941477E-30,0,0,0,null,560,1.8308993149674242E-4,5.0984373349537474E-4,1.7272999103052817E-39,0,2.4332781884793127E-29,0,0,0]
[570,1.4209531483591498E-2,4.0459259992364376E-2,6.4163125535990283E-37,0,0,0,1.8878108718444164E-26,0,null,570,1.4209609866591215E-2,4.0353539887229943E-2,4.7324510077767239E-37,0,1.3126573494966385E-27,0,6.974238706882122E-27,0,null,570,1.0991739279965079E-5,3.1090526169302412E-5,2.3365326819082859E-40,0,1.9816109324856941E-30,0,0,0,null,570,1.8243106143646493E-4,5.1670625754886821E-4,4.4882699899113514E-39,0,3.3200717587053043E-29,0,0,0]
[580,1.4156138038679471E-2,4.0960480831251339E-2,1.7201410320106819E-36,0,0,0,4.8352203311732968E-26,0,null,580,1.4156219371212369E-2,4.0859537654368373E-2,1.3091437801080784E-36,0,0,0,3.4854900505508687E-26,0,null,580,1.0950443219428708E-5,3.1487515652173032E-5,6.5880051522760629E-40,0,2.5426809081360387E-30,0,7.0784997577581363E-30,0,null,580,1.8174564551467985E-4,5.2326418479557821E-4,1.2648349919098828E-38,0,3.4892309461651743E-29,0,2.3133538847630347E-28,0]
[590,1.4100864143132922E-2,4.1438732898677E-2,4.314202043322076E-36,0,0,0,8.8603360879858858E-26,0,null,590,1.4100948157019981E-2,4.134245568751941E-2,3.4134592223490287E-36,0,0,0,7.7763359261403684E-26,0,null,590,1.0907692043481593E-5,3.1866523918716316E-5,1.8219600622504716E-39,0,2.4099437162370292E-30,0,3.7443036723849953E-29,0,null,590,1.8103608054381926E-4,5.2952438305157177E-4,3.4320488424177866E-38,0,1.8364893375529653E-29,0,7.6396122100724558E-28,0]
[600,1.4043882017093237E-2,4.1894561198496293E-2,1.0032565643708738E-35,0,0,0,1.3409965144722299E-25,0,null,600,1.4043968464857021E-2,4.1802837859372388E-2,8.2036652368854624E-36,0,0,0,1.3294162785701009E-25,0,null,600,1.0863619010707671E-5,3.2227970168062892E-5,4.6344362573930749E-39,0,7.1011903973173719E-31,0,8.4174826248987816E-29,0,null,600,1.8030457810337705E-4,5.3549381860032539E-4,8.558218476045826E-38,0,0,0,1.5353599310805418E-27,0]
[610,1.3985350598286057E-2,4.2328514725193563E-2,2.1777768122725612E-35,0,0,0,1.7282435466488908E-25,0,null,610,1.3985439251531557E-2,4.2241232527669009E-2,1.8259305777941614E-35,0,0,0,1.907644163812859E-25,0,null,610,1.0818347102059509E-5,3.2572277666021597E-5,1.0774199634751406E-38,0,0,0,1.4434264901636358E-28,0,null,610,1.795531792048625E-4,5.411795218623317E-4,1.9590473206706378E-37,0,0,0,2.4689891727897016E-27,0]
[620,1.3925416590695263E-2,4.2741144240708122E-2,4.4577414410866223E-35,0,0,0,1.8552261077494746E-25,0,null,620,1.3925507238561974E-2,4.2658190250711395E-2,3.8100237196672283E-35,0,0,0,2.329086357776461E-25,0,null,620,1.0771989832363144E-5,3.2899871904361486E-5,2.3197059855282004E-38,0,0,0,2.0768249933810539E-28,0,null,620,1.7878376775811759E-4,5.4658855725723567E-4,4.1717253295883231E-37,0,0,0,3.3669612788232195E-27,0]
[630,1.3864215427605533E-2,4.313300033029932E-2,8.6741830763797121E-35,0,0,0,1.4669686476200636E-25,0,null,630,1.386430787544685E-2,4.3054261788455971E-2,7.5368161008769165E-35,0,0,0,2.3209434133735378E-25,0,null,630,1.0724651995478714E-5,3.3211178988754778E-5,4.6985598939067104E-38,0,0,0,2.5467231097543864E-28,0,null,630,1.7799808293878836E-4,5.5172799681758313E-4,8.3829907910778632E-37,0,0,0,3.8877632110226134E-27,0]
[640,1.3801872156208648E-2,4.3504631707641968E-2,1.6107632413944321E-34,0,0,0,2.8016790252423244E-26,0,null,640,1.3801966224279734E-2,4.342999635868855E-2,1.4229708938810607E-34,0,0,0,1.543486548746493E-25,0,null,640,1.067643034877334E-5,3.3506624231052666E-5,9.0604064199002403E-38,0,0,0,2.5627972427363497E-28,0,null,640,1.7719773054801944E-4,5.5660489715425848E-4,1.6057811632407637E-36,0,0,0,3.5542883933112576E-27,0]
[650,1.3738502250337632E-2,4.3856583742493557E-2,2.8522109951861929E-34,0,2.0423130932848435E-26,0,0,0,null,650,1.3738597772641222E-2,4.3785940120966552E-2,2.5678406510043826E-34,0,0,0,0,0,null,650,1.0627414242054663E-5,3.3786630924060959E-5,1.6730340548218472E-37,0,0,0,1.7637528641411031E-28,0,null,650,1.763841934495436E-4,5.6122627941642257E-4,2.9444351415244512E-36,0,0,0,1.8062478838576169E-27,0]
[660,1.3674212357296765E-2,4.4189397186984572E-2,4.7910333079684386E-34,0,7.6550013900276364E-26,0,0,0,null,660,1.3674309180518823E-2,4.4122634863979507E-2,4.4132305693869711E-34,0,0,0,0,0,null,660,1.057768619538498E-5,3.405161927930638E-5,2.9569803446233897E-37,0,0,0,0,0,null,660,1.7555884116018662E-4,5.6559911192360359E-4,5.1599772407097279E-36,0,0,0,0,0]
[670,1.3609100984278156E-2,4.4503607079011555E-2,7.5602968865856439E-34,0,1.5914005403731724E-25,0,0,0,null,670,1.3609198966791532E-2,4.444061687416577E-2,7.1656450811013193E-34,0,4.9402559171389802E-26,0,0,0,null,670,1.0527322430266266E-5,3.4302005510114627E-5,4.9736921181004009E-37,0,0,0,0,0,null,670,1.7472293866464226E-4,5.6973029518236115E-4,8.5856697046498383E-36,0,0,0,0,0]
[680,1.3543259129408701E-2,4.4799741803366655E-2,1.1023860082226689E-33,0,2.6525534416913733E-25,0,0,0,null,680,1.354335814038201E-2,4.4740415965922355E-2,1.0845365023465428E-33,0,1.5709568884776647E-25,0,0,0,null,680,1.0476393357924903E-5,3.453820104421118E-5,7.8786637604995735E-37,0,0,0,0,0,null,680,1.7387765451928788E-4,5.7362664902633499E-4,1.3411361045760453E-35,0,0,0,0,0]
[690,1.3476770862068738E-2,4.5078322293416656E-2,1.4397282196205219E-33,0,3.8340918007974333E-25,0,0,0,null,690,1.3476870780628753E-2,4.5022554655736048E-2,1.4950615376484792E-33,0,3.1080363767111174E-25,0,0,0,null,690,1.0424964028317984E-5,3.4760611851743112E-5,1.1560010007842968E-36,0,8.8737766391003165E-30,0,0,0,null,690,1.7302406830446015E-4,5.7729490164954073E-4,1.9310394936173723E-35,0,1.4337444400801535E-27,0,0,0]
[700,1.3409713856612443E-2,4.5339861357648371E-2,1.5629722962574998E-33,0,4.9104304558694961E-25,0,0,0,null,700,1.3409814571076028E-2,4.5287547464250455E-2,1.7882991150486817E-33,0,5.0277453278102648E-25,0,0,0,null,700,1.0373094543163761E-5,3.4969637875960409E-5,1.525350282447858E-36,0,1.2842011037533125E-28,0,0,0,null,700,1.721631774782194E-4,5.8074168032220695E-4,2.4766296039544771E-35,0,3.8322335908400932E-27,0,0,0]
[710,1.3342159883448293E-2,4.5584863117271987E-2,1.0504433687590168E-33,0,5.5323122379368029E-25,0,0,0,null,710,1.3342261290610139E-2,4.5535900332107936E-2,1.6075689690912996E-33,0,7.0974733135762786E-25,0,0,0,null,710,1.0320840435873879E-5,3.5165672555146767E-5,1.6920478387122183E-36,0,3.1331777776634894E-28,0,0,0,null,710,1.7129590368283502E-4,5.8397350360367656E-4,2.6007794432885625E-35,0,7.1396949944244894E-27,0,0,0]
[720,1.3274175261045271E-2,4.5813822542394196E-2,0,0,5.2349889296155671E-25,0,0,0,null,720,1.327427726554694E-2,4.5768110136834392E-2,2.8095502449406689E-34,0,8.89153133761461E-25,0,0,0,null,720,1.0268253021355214E-5,3.5349102425683552E-5,1.2350742571377019E-36,0,5.6279770814361656E-28,0,0,0,null,720,1.7042309854896402E-4,5.8699677488466468E-4,1.5502424751739323E-35,0,1.1143830328865069E-26,0,0,0]
[730,1.3205821271942524E-2,4.6027225075541703E-2,0,0,3.4755652571129298E-25,0,0,0,null,730,1.3205923785668316E-2,4.5984664299260923E-2,0,0,9.7774154517537104E-25,0,0,0,null,730,1.0215379717880019E-5,3.5520306796993604E-5,0,0,8.5873149927068752E-28,0,0,0,null,730,1.6954554903861514E-4,5.8981777710780526E-4,0,0,1.5311355767125083E-26,0,0,0]
[740,1.313715454581541E-2,4.6225546332606809E-2,0,0,0,0,8.1737270423423956E-25,0,null,740,1.3137257487325353E-2,4.6186040469319754E-2,0,0,8.9406592707714683E-25,0,0,0,null,740,1.0162264343486372E-5,3.5679657490251698E-5,0,0,1.1593412276140916E-27,0,0,0,null,740,1.6866398236313788E-4,5.9244266853393111E-4,0,0,1.8722509739838892E-26,0,0,0]
[750,1.3068227412442032E-2,4.6409251872154604E-2,0,0,0,0,3.52629772252713E-24,0,null,750,1.3068330706502205E-2,4.6372706281997751E-2,0,0,5.4602887758998436E-25,0,1.9242164364534693E-24,0,null,750,1.010894738911619E-5,3.5827518633472941E-5,0,0,1.3949310232693357E-27,0,0,0,null,750,1.6777907051750314E-4,5.948774794311925E-4,0,0,2.0057776681544113E-26,0,0,0]
[760,1.299908822669372E-2,4.6578797025154613E-2,0,0,0,0,7.0579569949649798E-24,0,null,760,1.2999191803772616E-2,4.6545119175252954E-2,0,0,0,0,5.6042441435038409E-24,0,null,760,1.0055466270071704E-5,3.5964246506448219E-5,0,0,1.4675324055964258E-27,0,1.7826568505885747E-27,0,null,760,1.6689143445250729E-4,5.9712810958160241E-4,0,0,1.766355178092545E-26,0,4.542431834868792E-26,0]
[770,1.2929781668303171E-2,4.67346267779499E-2,0,0,0,0,1.12187000255472E-23,0,null,770,1.2929885464145882E-2,4.6703726262592088E-2,0,0,0,0,1.0234322486865506E-23,0,null,770,1.0001855557984838E-5,3.6090189429604057E-5,0,0,1.2563116717773799E-27,0,5.5687333459711045E-27,0,null,770,1.6600164792422774E-4,5.9920032650722494E-4,0,0,9.7178902583972663E-27,0,1.0806259708278011E-25,0]
[780,1.2860349017995515E-2,4.6877175702005815E-2,0,0,0,0,1.5640078403051624E-23,0,null,780,1.2860452973256326E-2,4.6848964253709748E-2,0,0,0,0,1.5505902389596304E-23,0,null,780,9.9481471944236439E-6,3.6205687691615021E-5,0,0,6.30154987367955E-28,0,1.0347306957346534E-26,0,null,780,1.6511024104098846E-4,6.0109976433019323E-4,0,0,0,0,1.8438489000946548E-25,0]
[790,1.2790828412245436E-2,4.7006867924710288E-2,0,0,0,0,1.9771367749179309E-23,0,null,790,1.2790932472097684E-2,4.6981259417265608E-2,0,0,0,0,2.0892397350552155E-23,0,null,790,9.8943706881059436E-6,3.6311073510919362E-5,0,0,0,0,1.5805219283237499E-26,0,null,790,1.6421770353395977E-4,6.028319231889262E-4,0,0,0,0,2.6851142310095158E-25,0]
[800,1.2721255078182878E-2,4.7124117136119602E-2,0,0,0,0,2.2894962464802077E-23,0,null,800,1.2721359191987941E-2,4.7101027580643856E-2,0,0,0,0,2.5650147909474983E-23,0,null,800,9.8405532965786728E-6,3.6406671027092951E-5,0,0,0,0,2.1406425552267716E-26,0,null,800,1.63324487774133E-4,6.044021691420029E-4,0,0,0,0,3.5114588145094211E-25,0]
[810,1.2651661550477478E-2,4.7229326627012527E-2,0,0,0,0,2.4168144107583317E-23,0,null,810,1.2651765671459234E-2,4.7208674161929198E-2,0,0,0,0,2.8848970100834076E-23,0,null,810,9.7867201940978645E-6,3.6492796318168262E-5,0,0,0,0,2.6393466128311632E-26,0,null,810,1.6243101155741327E-4,6.0581573449774171E-4,0,0,0,0,4.1974350740580094E-25,0]
[820,1.2582077871322251E-2,4.732288935423256E-2,0,0,0,0,2.2692025101028845E-23,0,null,820,1.2582181956297634E-2,4.7304594229942189E-2,0,0,0,0,2.9435244129864794E-23,0,null,820,9.732894626309966E-6,3.6569757440705699E-5,0,0,0,0,2.9819119641793913E-26,0,null,820,1.6153766067239947E-4,6.0707771851468474E-4,0,0,0,0,4.5915720468733394E-25,0]
[830,1.2512531775180757E-2,4.7405188029561313E-2,0,0,0,0,1.7605264682631893E-23,0,null,830,1.2512635784316569E-2,4.7389172588571803E-2,0,0,0,0,2.6326947875256434E-23,0,null,830,9.6790980532516703E-6,3.6637854489423387E-5,0,0,0,0,3.0611065153307474E-26,0,null,830,1.6064479127346601E-4,6.0819308842348851E-4,0,0,0,0,4.5278765330553706E-25,0]
[840,1.2443048859348806E-2,4.7476595228917104E-2,0,0,0,0,8.196785136836999E-24,0,null,840,1.2443152755838001E-2,4.7462783881991148E-2,0,0,0,0,1.8536051972842509E-23,0,null,840,9.6253502813242761E-6,3.6697379673878299E-5,0,0,0,0,2.7668740041863326E-26,0,null,840,1.5975273207021661E-4,6.0916668072551498E-4,0,0,0,0,3.8420543844202041E-25,0]
[850,1.2373652741529457E-2,4.753747351899925E-2,1.9645851711433028E-31,0,8.8093233076897425E-25,0,0,0,null,850,1.237375649145315E-2,4.7525792718019655E-2,0,0,0,0,5.3097112305493585E-24,0,null,850,9.571669585178831E-6,3.6748617409708138E-5,0,0,0,0,1.9987530968490687E-26,0,null,850,1.5886178635198228E-4,6.1000320273088895E-4,0,0,0,0,2.3915109137585299E-25,0]
[860,1.2304365205395748E-2,4.7588175598708635E-2,9.4043479255507829E-31,0,7.2195818876928811E-24,0,0,0,null,860,1.2304468777457053E-2,4.7578553806619378E-2,6.1524200396935741E-31,0,0,0,0,0,null,860,9.5180728203848584E-6,3.6791844422382469E-5,1.2845101907683997E-34,0,0,0,6.8014314469548791E-27,0,null,860,1.5797223385605641E-4,6.1070723430017826E-4,3.9745630310252218E-33,0,0,0,7.7598248059829948E-27,0]
[870,1.223520633512269E-2,4.7629044453071333E-2,2.1610401616209079E-30,0,1.5492388233758116E-23,0,0,0,null,870,1.2235309700487538E-2,4.762141211147615E-2,1.7194020912240761E-30,0,2.3731855185058291E-24,0,0,0,null,870,9.4645755275184492E-6,3.6827329861424516E-5,8.342002989383254E-34,0,0,0,0,0,null,870,1.5708433249580629E-4,6.1128322975630633E-4,1.6528864748082311E-32,0,0,0,0,0]
[880,1.2166194639772546E-2,4.7660413517613569E-2,3.9946189116339116E-30,0,2.5459331707783154E-23,0,0,0,null,880,1.2166297771857284E-2,4.7654703012362014E-2,3.4392569085700036E-30,0,1.306331257579711E-23,0,0,0,null,880,9.4111920284018859E-6,3.685533542361097E-5,2.0038194122057732E-33,0,0,0,0,0,null,880,1.5619831995835514E-4,6.1173551994379762E-4,3.6883041593884938E-32,0,0,0,0,0]
[890,1.2097347168247979E-2,4.76826068513772E-2,6.5553326344411199E-30,0,3.6600830200466261E-23,0,0,0,null,890,1.2097450042593879E-2,4.767875247649711E-2,5.9167846098661034E-30,0,2.6791514994661132E-23,0,0,0,null,890,9.3579355150361251E-6,3.6876115483504179E-5,3.7737128383966281E-33,0,0,0,0,0,null,890,1.5531441517963379E-4,6.1206831440593294E-4,6.7167634232392843E-32,0,5.478028214292799E-26,0,0,0]
[900,1.2028679615819077E-2,4.7695939316969214E-2,9.8959559228880113E-30,0,4.8090315788797667E-23,0,0,2.0279476403154884E-40,null,900,1.2028782209891323E-2,4.769387723732002E-2,9.2469693145873454E-30,0,4.3089559586880665E-23,0,0,1.3377709943840179E-40,null,900,9.3048181320494925E-6,3.6889917230052387E-5,6.2610676604515938E-33,0,4.3356110164875232E-27,0,0,0,null,900,1.544328197137146E-4,6.1228570366232736E-4,1.0909940152928741E-31,0,2.6853605877747167E-25,0,0,0]
[910,1.196020642235953E-2,4.7700716766019939E-2,1.3954086609244444E-29,0,5.8791950344607089E-23,0,0,3.1586349027431775E-40,null,910,1.1960308715458607E-2,4.7700384978870719E-2,1.3425516735418382E-29,0,6.104019039245237E-23,0,0,3.1305317068187414E-40,null,910,9.2518510527106549E-6,3.6896980807978177E-5,9.5264845920332872E-33,0,1.9978988501294935E-26,0,0,0,null,910,1.5355371899339709E-4,6.123916615616195E-4,1.6334132958493484E-31,0,5.4092695511152365E-25,0,0,0]
[920,1.189194086351231E-2,4.7697236229125674E-2,1.8484499845911537E-29,0,6.7289070094172353E-23,0,0,3.6881734844426638E-40,null,920,1.1892042836593853E-2,4.7698574524968652E-2,1.8280716360210236E-29,0,7.9245169563656259E-23,0,0,5.2427076873177958E-40,null,920,9.199044549456666E-6,3.6897539463063707E-5,1.3522479778679514E-32,0,3.9848137097469065E-26,0,0,0,null,920,1.5267728350078341E-4,6.1239004769973661E-4,2.2863735189234095E-31,0,8.6221288478130612E-25,0,0,0]
[930,1.1823895134995811E-2,4.768578610889157E-2,2.2981089327624442E-29,0,7.1946886926458871E-23,0,0,2.5332869583381875E-40,null,930,1.1823996770583439E-2,4.7688736031680702E-2,2.3391870969891271E-29,0,9.583504996665969E-23,0,0,6.6228248280645973E-40,null,930,9.1464080591279425E-6,3.6891819690328921E-5,1.8028468696061608E-32,0,6.3227714030371211E-26,0,0,0,null,930,1.5180366985072165E-4,6.1228460988280674E-4,3.0073900113683965E-31,0,1.2139883315810781E-24,0,0,0]
[940,1.1756080430590459E-2,4.7666646375033449E-2,2.6595326205116615E-29,0,7.1010292388698645E-23,0,0,0,null,940,1.175618171265067E-2,4.7671151182052715E-2,2.8000187853352859E-29,0,1.0852822229138153E-22,0,0,5.428804941826226E-40,null,940,9.0939502433107151E-6,3.6880041384123456E-5,2.2575414581699957E-32,0,8.8780378169922898E-26,0,0,0,null,940,1.5093302179161684E-4,6.1207898662148704E-4,3.7118474679670503E-31,0,1.5686601901553666E-24,0,0,0]
[950,1.1688507014507937E-2,4.7640088760986118E-2,2.8062232744086355E-29,0,6.2734504535916345E-23,0,0,0,null,950,1.1688607928351934E-2,4.7646093382490352E-2,3.0922236113230581E-29,0,1.1474321921986964E-22,0,0,0,null,950,9.0416790443300531E-6,3.6862417989807941E-5,2.6366631680994014E-32,0,1.1451068155247602E-25,0,0,0,null,950,1.5006547113483818E-4,6.1177670965001515E-4,4.2604765537885799E-31,0,1.8897355802910746E-24,0,0,0]
[960,1.1621184288268915E-2,4.7606376960853625E-2,2.5649159013336471E-29,0,4.5543017278002709E-23,0,0,0,null,960,1.1621284820414949E-2,4.7613827959694904E-2,3.0480708334036799E-29,0,1.1176386391157875E-22,0,0,0,null,960,8.9896017370100476E-6,3.683915665590883E-5,2.8205097398269982E-32,0,1.3778680929793634E-25,0,0,0,null,960,1.4920113861379862E-4,6.1138120645198846E-4,4.4482987936690114E-31,0,2.1330536283214801E-24,0,0,0]
[970,1.1554120852759166E-2,4.7565766826328959E-2,1.7146646513945216E-29,0,1.8204137157455526E-23,0,0,0,null,970,1.155422099093128E-2,4.757461235762897E-2,2.4471789892422489E-29,0,9.6951961123667907E-23,0,0,0,null,970,8.9377249766993815E-6,3.681045838653999E-5,2.6441715583234226E-32,0,1.5542961889068542E-25,0,0,0,null,970,1.4834013468062151E-4,6.1089580279108922E-4,3.997475215180378E-31,0,2.2490255477520759E-24,0,0,0]
[980,1.1487324565678214E-2,4.7518506562842525E-2,0,0,0,0,3.6113430728803075E-23,0,null,980,1.1487424298636124E-2,4.7528696333870663E-2,1.0192270073062361E-29,0,6.7997255296255946E-23,0,0,0,null,980,8.8860548436535945E-6,3.6776518193503063E-5,1.8962797615299125E-32,0,1.6387348512765837E-25,0,0,0,null,980,1.474825602437337E-4,6.1032372523319746E-4,2.5570833792766893E-31,0,2.1858628142819028E-24,0,0,0]
[990,1.142080259499121E-2,4.7464836924534883E-2,0,0,0,0,1.4037652252758564E-22,0,null,990,1.1420901912514415E-2,4.7476322154860029E-2,0,0,2.3189759471053785E-23,0,7.874219804994027E-23,0,null,990,8.8345968844813504E-6,3.6737525247586043E-5,3.2379589216504661E-33,0,1.5939746022885189E-25,0,0,0,null,990,1.4662850735473382E-4,6.0966810365689758E-4,0,0,1.893680489958779E-24,0,0,0]
[1000,1.1354561468050348E-2,4.7404991407360667E-2,0,0,0,0,2.6275355546854234E-22,6.2242369314984151E-39,null,1000,1.1354660360825955E-2,4.7417724789411107E-2,0,0,0,0,2.0908286828296491E-22,0,null,1000,8.7833561501218559E-6,3.6693663028678729E-5,0,0,1.3841867981055607E-25,0,6.9064500611516744E-26,0,null,1000,1.4577805983863445E-4,6.0893197374245066E-4,0,0,1.3292696532052121E-24,0,1.730268303180378E-24,0]
[]
[]
["Saved  21/03/2023: 10:14:07  Level Number: 5"]
[]
["BREAKTHROUGH RESULTS"]
[]
["Advanced"]
["Pollutant Linkage: Inert Restorati, Attenution Layer, Beenham Grange Formation",null,null,null,null,null,null,null,null,null,"Pollutant Linkage: Inert Restorati, Attenution Layer, Beenham Grange Formation, Groundwater ",null,null,null,null,null,null,null,null,null,"Pollutant Linkage: Inert Restorati, Attenution Layer, Beenham Grange Formation, River Enborne",null,null,null,null,null,null,null,null,null,"Pollutant Linkage: Inert Restorati, Attenution Layer, Beenham Grange Formation, Spring Ditch"]
["Concentrations in mg/L in Beenham Grange Formation",null,null,null,null,null,null,null,null,null,"Concentrations in mg/L in Groundwater ",null,null,null,null,null,null,null,null,null,"Concentrations in mg/L in River Enborne",null,null,null,null,null,null,null,null,null,"Concentrations in mg/L in Spring Ditch"]
[]
["Compared with EAL (GW) target concentration in mg/L",null,null,null,null,null,null,null,null,null,"Compared with EAL (GW) target concentration in mg/L",null,null,null,null,null,null,null,null,null,"Compared with EAL (River Enborne) target concentration in mg/L",null,null,null,null,null,null,null,null,null,"Compared with EAL (Spring Ditch) target concentration in mg/L"]
[null,0.39,4.8199999999999993E-2,3.2649999999999991E-4,1E-3,4.3649999999999991E-3,2.0000000000000002E-5,2E-3,2.0000000000000001E-4,null,null,0.39,4.8199999999999993E-2,3.2649999999999991E-4,1E-3,4.3649999999999991E-3,2.0000000000000002E-5,2E-3,2.0000000000000001E-4,null,null,0.39,2.76E-2,6.4999999999999994E-5,1E-3,4.4000000000000003E-3,2.0000000000000002E-5,1.75E-3,2.0000000000000001E-4,null,null,0.39,0.03,5.0000000000000002E-5,1E-3,3.5500000000000002E-3,2.0000000000000002E-5,1.5E-3,2.0000000000000001E-4]
[]
["Time(years)","Species1","Species2","Species3","Species4","Species5","Species6","Species7","Species8",null,"Time(years)","Species1","Species2","Species3","Species4","Species5","Species6","Species7","Species8",null,"Time(years)","Species1","Species2","Species3","Species4","Species5","Species6","Species7","Species8",null,"Time(years)","Species1","Species2","Species3","Species4","Species5","Species6","Species7","Species8"]
[null,"Ammoniacal Nitrogen","Barium","Cadmium","Total Chromium","Copper","Mercury","Molybdenum","Lead",null,null,"Ammoniacal Nitrogen","Barium","Cadmium","Total Chromium","Copper","Mercury","Molybdenum","Lead",null,null,"Ammoniacal Nitrogen","Barium","Cadmium","Total Chromium","Copper","Mercury","Molybdenum","Lead",null,null,"Ammoniacal Nitrogen","Barium","Cadmium","Total Chromium","Copper","Mercury","Molybdenum","Lead"]
[10,1.9176753035767084E-12,2.3528154640992319E-22,0,0,0,0,0,0,null,10,1.8517398094899134E-12,0,0,0,0,0,0,0,null,10,1.359458810211212E-15,5.1566687830634195E-26,0,0,0,0,0,0,null,10,2.2958918343941704E-14,2.8725633462689074E-25,0,0,0,0,0,0]
[20,2.4964755466582675E-7,1.8184771294196808E-15,0,0,0,0,0,0,null,20,2.4744129375361557E-7,1.1816712289902459E-16,0,0,0,0,0,0,null,20,1.8887313072611548E-10,3.2589338241051262E-21,0,0,0,0,0,0,null,20,3.1487000518534935E-9,1.8041686566412734E-19,0,0,0,0,0,0]
[30,1.3245880091967222E-5,7.1501106461082394E-11,0,0,0,0,0,0,null,30,1.3193269586050863E-5,1.8341564159664127E-11,0,0,0,0,0,0,null,30,1.0144701639383584E-8,2.4333118473602594E-15,0,0,0,0,0,0,null,30,1.6870875458128709E-7,7.052489509642158E-14,0,0,0,0,0,0]
[40,9.7822009131676995E-5,1.4608316784064376E-8,0,0,0,0,0,0,null,40,9.7602233469682611E-5,6.5610452223773618E-9,0,0,0,0,0,0,null,40,7.5244434751375513E-8,1.6563085204585389E-12,0,0,0,0,0,0,null,40,1.250249636556785E-6,3.9501691842250227E-11,0,0,0,0,0,0]
[50,3.2591634090016919E-4,3.6099003943723728E-7,0,0,0,0,0,0,null,50,3.254468850686777E-4,2.1381866924457961E-7,0,0,0,0,0,0,null,50,2.5120094025861991E-7,7.7024990217652333E-11,0,0,0,0,0,0,null,50,4.1722283388151664E-6,1.6435563895043285E-9,0,0,0,0,0,0]
[60,7.2700000202025256E-4,3.0898170608355557E-6,0,0,0,0,0,0,null,60,7.2627381651487561E-4,2.1380590763571909E-6,0,0,0,0,0,0,null,60,5.6095715608620627E-7,9.5410971836312033E-10,0,0,0,0,0,0,null,60,9.3149477365872317E-6,1.9007842046586388E-8,0,0,0,0,0,0]
[70,1.2873075622878262E-3,1.439708398273412E-5,0,0,0,0,0,0,null,70,1.2863668216924267E-3,1.0962189462224551E-5,0,0,0,0,0,0,null,70,9.9396030636157776E-7,5.6124231044645387E-9,0,0,0,0,0,0,null,70,1.6502945114480169E-5,1.0691157234914015E-7,0,0,0,0,0,0]
[80,1.9713309122148691E-3,4.5810185512216256E-5,0,0,0,0,0,0,null,80,1.9702353970703118E-3,3.7143882582803756E-5,0,0,0,0,0,0,null,80,1.5227776949626674E-6,2.0864870567690676E-8,0,0,0,0,0,0,null,80,2.5280802319438492E-5,3.8548488048988977E-7,0,0,0,0,0,0]
[90,2.7387913658622619E-3,1.1293472682064658E-4,0,0,0,0,0,0,null,90,2.7375997631564949E-3,9.5639527269431414E-5,0,0,0,0,0,0,null,90,2.1162502158863178E-6,5.7344522826571611E-8,0,0,0,0,0,0,null,90,3.5131373709864161E-5,1.0367447911815233E-6,0,0,0,0,0,0]
[100,3.5532451406856281E-3,2.3273114152713749E-4,0,0,0,0,0,0,null,100,3.5520071385547179E-3,2.0335838315116127E-4,0,0,0,0,0,0,null,100,2.7461698908738609E-6,1.2785900975064048E-7,0,0,0,0,0,0,null,100,4.5586544871438116E-5,2.2752430239932712E-6,0,0,0,0,0,0]
[110,4.3851320833119024E-3,4.2080947937844077E-4,0,0,0,0,0,0,null,110,4.3838864395679307E-3,3.7636280613037923E-4,0,0,0,0,0,0,null,110,3.3896497327215824E-6,2.4519679032002371E-7,0,0,0,0,0,0,null,110,5.6266527165544954E-5,4.3116058630167121E-6,0,0,0,0,0,0]
[120,5.2120354504414622E-3,6.8957847595747758E-4,0,0,0,0,0,0,null,120,5.2108107399859516E-3,6.27813575783484E-4,0,0,0,0,0,0,null,120,4.0293298820791996E-6,4.2032511413406019E-7,0,0,0,0,0,0,null,120,6.6883261767630375E-5,7.3237269932218776E-6,0,0,0,0,0,0]
[130,6.0178052267716641E-3,1.0473910901983019E-3,0,0,0,0,0,0,null,130,6.016621520384422E-3,9.6692111602468631E-4,0,0,0,0,0,0,null,130,4.6527012662956709E-6,6.6134244864408677E-7,0,0,0,0,0,0,null,130,7.7229188327846158E-5,1.1440701450433249E-5,0,0,0,0,0,0]
[140,6.7913662149025342E-3,1.4984737370604586E-3,0,0,0,0,0,0,null,140,6.7902368833868245E-3,1.3987369403959443E-3,0,0,0,0,0,0,null,140,5.2511838574929029E-6,9.7313546749959047E-7,0,0,0,0,0,0,null,140,8.716194586552905E-5,1.6738183964796123E-5,0,0,0,0,0,0]
[150,7.525567751112028E-3,2.0433427604349603E-3,0,0,0,0,0,0,null,150,7.5245010745355846E-3,1.9244920165908464E-3,0,0,0,0,0,0,null,150,5.8192365095654583E-6,1.3575298846715033E-6,0,0,0,0,0,0,null,150,9.6589599846404718E-5,2.3241552522771334E-5,0,0,0,0,0,0]
[160,8.2162027940944436E-3,2.6794563544314488E-3,0,0,0,0,0,0,null,160,8.2152032835061499E-3,2.5422163253137828E-3,0,0,0,0,0,0,null,160,6.3535976318121191E-6,1.8137175262571862E-6,0,0,0,0,0,0,null,160,1.0545804137272897E-4,3.0933320204730071E-5,0,0,0,0,0,0]
[170,8.8612209558929355E-3,3.4019291078111651E-3,0,0,0,0,0,0,null,170,8.8602903917698941E-3,3.2474504207366923E-3,0,0,0,0,0,0,null,170,6.8526758919619427E-6,2.338794308422534E-6,0,0,0,0,0,0,null,170,1.1374087640791723E-4,3.976215504813197E-5,0,0,0,0,0,0]
[180,9.4601186837892301E-3,4.2042076426941112E-3,0,0,0,0,0,0,null,180,9.4592569104403872E-3,4.0339342491346707E-3,0,0,0,0,0,0,null,180,7.3160780277010682E-6,2.9283036701696073E-6,0,0,0,0,0,0,null,180,1.2143159036031028E-4,4.9651852789753788E-5,0,0,0,0,0,0]
[190,1.0013476907496505E-2,5.0786574569425171E-3,0,0,0,0,0,0,null,190,1.0012682430183367E-2,4.8942143214163545E-3,0,0,0,0,0,0,null,190,7.7442508183790115E-6,3.5767279650464421E-6,0,0,0,0,0,0,null,190,1.285376071006009E-4,6.0509377541737307E-5,0,0,0,0,0,0]
[200,1.0522615720315882E-2,6.0170439059807866E-3,0,0,0,0,0,0,null,200,1.0521886148363817E-2,5.8201467019579926E-3,0,0,0,0,0,0,null,200,8.1382136704343146E-6,4.2779028654714889E-6,0,0,0,0,0,0,null,200,1.3507585163099743E-4,7.2231600655902302E-5,0,0,0,0,0,0]
[210,1.0989339438824399E-2,7.010908944094842E-3,0,0,0,0,0,0,null,210,1.0988671810984613E-2,6.8032944682042788E-3,0,0,0,0,0,0,null,210,8.4993611840268883E-6,5.025349503565207E-6,0,0,0,0,0,0,null,210,1.4106947401018444E-4,8.4710675549475538E-5,0,0,0,0,0,0]
[220,1.1415750298560913E-2,8.0518545374558149E-3,0,0,0,0,0,0,null,220,1.1415141319519951E-2,7.8352291894772403E-3,0,0,0,0,0,0,null,220,8.8293188680032261E-6,5.8125296576888929E-6,0,0,0,0,0,0,null,220,1.4654545520361467E-4,9.7838149309739669E-5,0,0,0,0,0,0]
[230,1.1804113712746849E-2,9.1317472414267891E-3,0,0,0,0,4.0266998086639027E-40,0,null,230,1.1803559923168613E-2,8.9077504956601369E-3,0,0,0,0,2.6046428197078383E-40,0,null,230,9.1298387840484387E-6,6.6330340956703778E-6,0,0,0,0,0,0,null,230,1.5153287550067146E-4,1.1150798387458616E-4,0,0,0,0,0,0]
[240,1.2156761979965756E-2,1.024285881890229E-2,0,0,0,0,0,0,null,240,1.2156259877132338E-2,1.001303869763538E-2,0,0,0,0,1.0232548346235316E-39,0,null,240,9.4027249655066049E-6,7.4807155991265033E-6,0,0,0,0,0,0,null,240,1.5606167699701201E-4,1.2561867870957495E-4,0,0,0,0,0,0]
[250,1.2476026500962491E-2,1.1377956553279752E-2,0,0,0,0,0,0,null,250,1.247557262287201E-2,1.1143754438010274E-2,0,0,0,0,0,0,null,250,9.649780913930514E-6,8.3497777927355888E-6,0,0,0,0,0,0,null,250,1.6016179242153155E-4,1.4007467806051175E-4,0,0,0,0,0,0]
[260,1.2764191032639226E-2,1.2530355020445397E-2,0,0,4.1689280714741373E-40,0,8.9365919369607764E-38,0,null,260,1.2763782015215063E-2,1.2293097546996389E-2,0,0,0,0,2.94068168559276E-38,0,null,260,9.8727733873200343E-6,9.2348296527110389E-6,0,0,0,0,0,0,null,260,1.6386254429717601E-4,1.5478722419971165E-4,0,0,0,0,0,0]
[270,1.3023460391702681E-2,1.3693939051085364E-2,0,0,1.3936606794684991E-39,0,5.8142366055966987E-37,0,null,270,1.3023093006298224E-2,1.3454835247865473E-2,0,0,5.8632013177779276E-40,0,3.773151335513679E-37,0,null,270,1.0073408153146646E-5,1.0130914025424519E-5,0,0,0,0,1.2803371522014733E-40,0,null,270,1.671922426367194E-4,1.6967479225697029E-4,0,0,0,0,3.1999487947478901E-39,0]
[280,1.3255940443742337E-2,1.4863165703173422E-2,0,0,0,0,3.9192518949102166E-36,0,null,280,1.3255611620305035E-2,1.4623307907470929E-2,0,0,8.0621999009980838E-39,0,1.6827014929028797E-36,0,null,280,1.0253314481432596E-5,1.1033516947285545E-5,0,0,0,0,8.1539926434670235E-40,0,null,280,1.7017792766417075E-4,1.8466321681840915E-4,0,0,0,0,1.4609973314977942E-38,0]
[290,1.3463626281633657E-2,1.6033051390392655E-2,0,0,5.2448575077718349E-39,0,2.8297101298348317E-35,0,null,290,1.3463333121499308E-2,1.5793418800099719E-2,0,0,0,0,1.2823409367092446E-35,0,null,290,1.0414035980258985E-5,1.1938563163147729E-5,0,0,0,0,3.0265068934390409E-39,0,null,290,1.7284521777710026E-4,1.9968559765114402E-4,0,0,2.1838459340289884E-40,0,7.1112703593924194E-38,0]
[300,1.3648396295677675E-2,1.7199148908485257E-2,0,0,2.8455952870997716E-37,0,1.5522159077410963E-34,0,null,300,1.3648136076954313E-2,1.6960612893548881E-2,0,0,0,0,8.7207307410078766E-35,0,null,300,1.0557025994457144E-5,1.2842402047116976E-5,0,0,0,0,2.4831634854411828E-38,0,null,300,1.7521823322543862E-4,2.1468205246041479E-4,0,0,0,0,5.8739912572591448E-37,0]
[310,1.3812010433481639E-2,1.8357517958510875E-2,0,0,1.4496171786680278E-36,0,6.584548409167212E-34,0,null,310,1.3811780611193727E-2,1.8120848471703952E-2,0,0,4.2659131215673627E-37,0,4.1959717406484742E-34,0,null,310,1.0683646249435551E-5,1.3741787143863315E-5,0,0,0,0,1.5881060318715032E-37,0,null,310,1.77319573636711E-4,2.2959936856954788E-4,0,0,0,0,3.3757924238726923E-36,0]
[320,1.3956111391604541E-2,1.9504691854939849E-2,0,0,7.2339382899649326E-36,0,2.2884023930317814E-33,0,null,320,1.3955909594219128E-2,1.9270564451945606E-2,0,0,2.4319918243638208E-36,0,1.5974916610421065E-33,0,null,320,1.0795167765950887E-5,1.4633851754454973E-5,0,0,0,0,6.9689524542726624E-37,0,null,320,1.791703332217911E-4,2.4439059254122457E-4,0,0,8.1612913012342018E-39,0,1.4008372261949565E-35,0]
[330,1.4082227811533298E-2,2.0637642392107615E-2,0,0,4.1724869319175577E-35,0,6.4669301562326693E-33,0,null,330,1.4082051835044919E-2,2.0406645503769784E-2,0,0,6.9279747119320124E-36,0,5.0927952441374735E-33,0,null,330,1.0892773327598481E-5,1.5516082362902148E-5,0,0,2.1991971306932363E-39,0,2.4557270885141269E-36,0,null,330,1.8079014174390411E-4,2.5901458659953708E-4,0,0,5.6354134637182685E-38,0,4.7978986283027785E-35,0]
[340,1.4191778798837651E-2,2.1753744289891411E-2,0,0,2.0464691796062793E-34,0,1.3595468591146244E-32,0,null,340,1.4191626599280912E-2,2.1526386491767854E-2,0,0,3.7283650557230336E-35,0,1.306736584252449E-32,0,null,340,1.097756097349746E-5,1.6386291210555404E-5,0,0,7.2516193312650904E-39,0,7.3883239181497982E-36,0,null,340,1.8219722249744044E-4,2.734355728107752E-4,0,0,1.4391507299745999E-37,0,1.3880665905652404E-34,0]
[350,1.4286079267730517E-2,2.2850740216875588E-2,0,0,8.0662655530731176E-34,0,1.4538191913717947E-32,0,null,350,1.428594895276976E-2,2.2627457319101315E-2,0,0,2.2246155277225436E-34,0,2.3328202272751073E-32,0,null,350,1.1050548130703535E-5,1.7242588949286087E-5,0,0,2.0376856465277757E-38,0,1.7946947546814112E-35,0,null,350,1.8340846090005535E-4,2.8762267990977634E-4,0,0,6.109112601873601E-37,0,3.1246415630244823E-34,0]
[360,1.436634574968541E-2,2.3926707069662646E-2,0,0,2.6735934726490447E-33,0,0,0,null,360,1.4366235569715389E-2,2.3707868908762534E-2,0,0,9.6518243892963311E-34,0,1.094655221288473E-32,0,null,360,1.111267610644841E-5,1.8083358018204373E-5,0,0,1.1557764738415843E-37,0,2.9353942904514949E-35,0,null,360,1.8443947905432044E-4,3.0154950304635779E-4,0,0,3.7285549318158802E-36,0,4.2267224785808272E-34,0]
[370,1.443370240637897E-2,2.4980023947967896E-2,0,0,7.6630547460115728E-33,0,0,0,null,370,1.4433610745468015E-2,2.4765940805917298E-2,0,0,3.2884036969607579E-33,0,0,0,null,370,1.1164814739077534E-5,1.8907227173380094E-5,0,0,6.061314321012237E-37,0,4.8255622893536108E-36,0,null,370,1.8530471294098702E-4,3.1519368326045073E-4,0,0,1.6827672197050111E-35,0,0,0]
[380,1.4489187062582084E-2,2.6009342088393776E-2,0,0,1.8748897508115822E-32,0,0,0,null,380,1.4489112429508736E-2,2.5800270696336072E-2,0,0,9.6705629795491994E-33,0,0,0,null,380,1.1207767064862144E-5,1.9713047439841957E-5,0,0,2.3220293099062922E-36,0,0,0,null,380,1.8601748987409947E-4,3.28536510918936E-4,0,0,5.7585141264567943E-35,0,0,0]
[390,1.4533757130621182E-2,2.701355689096388E-2,0,0,3.693020366248101E-32,0,0,0,null,390,1.4533698150136689E-2,2.6809705998257011E-2,0,0,2.5254795463499203E-32,0,0,0,null,390,1.1242273901236895E-5,2.0499869637486847E-5,0,0,7.143526050184637E-36,0,0,0,null,390,1.8659010456839991E-4,3.4156255545855448E-4,0,0,1.6659553929873516E-34,0,0,0]
[400,1.4568295339420313E-2,2.7991782080106598E-2,0,0,4.8792069971423285E-32,0,0,0,null,400,1.4568250743855088E-2,2.7793317585934875E-2,0,0,5.6444177194189525E-32,0,0,0,null,400,1.1269018279087797E-5,2.1266923547375649E-5,0,0,1.9258444856861591E-35,0,0,0,null,400,1.8703389270040161E-4,3.5425932241453219E-4,0,0,4.3128620297510537E-34,0,0,0]
[410,1.4593615211509304E-2,2.8943325976885256E-2,0,0,0,0,0,0,null,410,1.4593583832786578E-2,2.8750375633179674E-2,0,0,9.7963090101283503E-32,0,0,0,null,410,1.1288629680194718E-5,2.2013598724380215E-5,0,0,4.6655211875877123E-35,0,0,0,null,410,1.8735930123527414E-4,3.6661693774692005E-4,0,0,9.8496088030807236E-34,0,0,0]
[420,1.4610466253870594E-2,2.9867669815117844E-2,0,0,0,0,3.1950441120148827E-31,0,null,420,1.4610447015961064E-2,2.9680327517237728E-2,0,0,9.3961284270292255E-32,0,0,0,null,420,1.130168805340739E-5,2.2739426920252778E-5,0,0,9.7609359161408818E-35,0,0,0,null,420,1.8757595508099361E-4,3.7862785880908611E-4,0,0,1.8400535044622187E-33,0,0,0]
[430,1.4619538844448892E-2,3.0764448005137002E-2,0,0,0,0,1.7798396962109675E-29,0,null,430,1.4619530756293367E-2,3.0582777691715145E-2,0,0,0,0,5.7512414262960863E-30,0,null,430,1.1308727595428722E-5,2.344406605310356E-5,0,0,1.584194376610709E-34,0,0,0,null,430,1.8769271983582321E-4,3.9028661085702967E-4,0,0,2.2949038901136599E-33,0,0,0]
[440,1.4621468808100798E-2,3.1633430231440718E-2,0,0,0,0,5.9174905046164499E-29,0,null,440,1.4621470956995871E-2,3.1457469417643477E-2,0,0,0,0,3.9110479009424426E-29,0,null,440,1.1310240291384189E-5,2.4127285641528976E-5,0,0,1.3275942545552939E-34,0,8.1805061070702356E-33,0,null,440,1.8771776054821003E-4,4.0158954771879338E-4,0,0,0,0,2.4690460692382491E-31,0]
[450,1.461684168369452E-2,3.2474505261128814E-2,0,0,0,0,1.3204190135303648E-28,0,null,450,1.4616853229137536E-2,3.2304268230995171E-2,0,0,0,0,1.0970474902620071E-28,0,null,450,1.1306679216439567E-5,2.4788953611326593E-5,0,0,0,0,4.8804556161216669E-32,0,null,450,1.8765859651209482E-4,4.1253463508340247E-4,0,0,0,0,1.0142675536607927E-30,0]
[460,1.4606196690086096E-2,3.328766633665111E-2,0,0,0,0,2.2614921900998611E-28,0,null,460,1.4606216858057486E-2,3.3123147020478312E-2,0,0,0,0,2.2228201677269502E-28,0,null,460,1.1298461604531448E-5,2.5429024377948953E-5,0,0,0,0,1.3263581417732015E-31,0,null,460,1.8752215219520687E-4,4.231212547968731E-4,0,0,0,0,2.470008162187379E-30,0]
[470,1.4590030402264875E-2,3.4072998027063928E-2,0,0,0,0,2.9029249638999517E-28,0,null,470,1.4590058479942292E-2,3.3914172589439025E-2,0,0,0,0,3.4814642452306218E-28,0,null,470,1.1285971692756112E-5,2.6047528106830212E-5,0,0,0,0,2.6364245700571236E-31,0,null,470,1.8731480444627511E-4,4.3335002854210563E-4,0,0,0,0,4.5459677132412432E-30,0]
[480,1.4568800151557162E-2,3.4830664415609426E-2,0,0,0,0,2.0725353614078388E-28,0,null,480,1.4568835482422467E-2,3.4677493578740864E-2,0,0,0,0,3.922827185583041E-28,0,null,480,1.1269563352372018E-5,2.664456105549982E-5,0,0,0,0,4.0674492726175295E-31,0,null,480,1.870424261587361E-4,4.4322265931194343E-4,0,0,0,0,6.4365567431652621E-30,0]
[490,1.4542927165165828E-2,3.5560898506825769E-2,0,0,2.1037077511247974E-29,0,0,0,null,490,1.4542969144501802E-2,3.5413329632650946E-2,0,0,0,0,1.6431579190555508E-28,0,null,490,1.1249562518076211E-5,2.722027690485236E-5,0,0,0,0,4.5161510612067334E-31,0,null,490,1.8671042658741386E-4,4.5274178914557316E-4,0,0,0,0,6.0505003663071108E-30,0]
[500,1.4512799461016973E-2,3.6263992743000149E-2,0,0,9.0220573077753721E-29,0,0,0,null,500,1.4512847531737288E-2,3.6121961696103454E-2,0,0,0,0,0,0,null,500,1.1226269427931246E-5,2.7774878991698545E-5,0,0,0,0,1.8210045190242586E-31,0,null,500,1.8632378852322662E-4,4.6191087167789989E-4,0,0,0,0,0,0]
[510,1.4478774513941301E-2,3.694029052695183E-2,6.1554864528053874E-40,0,2.2213503704371005E-28,0,0,0,null,510,1.4478828162778467E-2,3.6803723338826928E-2,0,0,6.8960192953301265E-29,0,0,0,null,510,1.1199960686416527E-5,2.8308613359991385E-5,0,0,0,0,0,0,null,510,1.8588710253138188E-4,4.707340581407491E-4,0,0,0,0,0,0]
[520,1.4441181709237952E-2,3.7590178655671685E-2,4.9506799210275714E-39,0,4.255615920094578E-28,0,0,0,null,520,1.4441240463222401E-2,3.7458993009336375E-2,3.4027387760657185E-39,0,2.3426622738547062E-28,0,0,0,null,520,1.1170891162928992E-5,2.8821762553925095E-5,0,0,0,0,0,0,null,520,1.8540459845919181E-4,4.7921609555078335E-4,0,0,4.9390321205054156E-31,0,0,0]
[530,1.4400324598851749E-2,3.8214080576694731E-2,1.5639387134035844E-38,0,6.7104340455245324E-28,0,0,0,null,530,1.4400388022066717E-2,3.8088187129129543E-2,1.2998690242197363E-38,0,5.285324090015284E-28,0,0,0,null,530,1.1139295737578533E-5,2.9314640081799725E-5,0,0,7.6609210033798637E-32,0,0,0,null,530,1.8488017440959086E-4,4.8736223591375454E-4,1.3578814838676506E-40,0,2.8218577276706499E-30,0,0,0]
[540,1.4356482975043825E-2,3.881245038652132E-2,3.8166878627397489E-38,0,8.5468148739626572E-28,0,0,0,null,540,1.4356550665653911E-2,3.8691753944932211E-2,3.2328675982007699E-38,0,9.5365823223794814E-28,0,0,0,null,540,1.1105390905740716E-5,2.9787585485334363E-5,0,0,2.9037645031412954E-31,0,0,0,null,540,1.8431742337007769E-4,4.9517815537086969E-4,3.649445958233537E-40,0,7.4106685972389166E-30,0,0,0]
[550,1.4309914775559103E-2,3.9385767497197341E-2,9.0536686366911431E-38,0,7.6038718201186305E-28,0,0,0,null,550,1.4309986363085813E-2,3.9270168063728836E-2,7.1946690506375452E-38,0,1.4236093421356764E-27,0,0,0,null,550,1.1069376252251698E-5,3.0240959954590972E-5,0,0,6.8207864943973489E-31,0,0,0,null,550,1.8371965767938287E-4,5.0266988230296243E-4,7.8189747811795552E-40,0,1.4777485224073852E-29,0,0,0]
[560,1.4260857833382226E-2,3.9934531903877239E-2,2.3413970625537835E-37,0,3.9692195643693548E-29,0,9.4603504717419371E-28,0,null,560,1.4260932976191241E-2,3.9823925602034869E-2,1.7413820755042077E-37,0,1.6964851696672558E-27,0,0,0,null,560,1.1031435805340307E-5,3.0675142433910912E-5,0,0,1.272289324941477E-30,0,0,0,null,560,1.8308993149674242E-4,5.0984373349537474E-4,1.7272999103052817E-39,0,2.4332781884793127E-29,0,0,0]
[570,1.4209531483591498E-2,4.0459259992364376E-2,6.4163125535990283E-37,0,0,0,1.8878108718444164E-26,0,null,570,1.4209609866591215E-2,4.0353539887229943E-2,4.7324510077767239E-37,0,1.3126573494966385E-27,0,6.974238706882122E-27,0,null,570,1.0991739279965079E-5,3.1090526169302412E-5,2.3365326819082859E-40,0,1.9816109324856941E-30,0,0,0,null,570,1.8243106143646493E-4,5.1670625754886821E-4,4.4882699899113514E-39,0,3.3200717587053043E-29,0,0,0]
[580,1.4156138038679471E-2,4.0960480831251339E-2,1.7201410320106819E-36,0,0,0,4.8352203311732968E-26,0,null,580,1.4156219371212369E-2,4.0859537654368373E-2,1.3091437801080784E-36,0,0,0,3.4854900505508687E-26,0,null,580,1.0950443219428708E-5,3.1487515652173032E-5,6.5880051522760629E-40,0,2.5426809081360387E-30,0,7.0784997577581363E-30,0,null,580,1.8174564551467985E-4,5.2326418479557821E-4,1.2648349919098828E-38,0,3.4892309461651743E-29,0,2.3133538847630347E-28,0]
[590,1.4100864143132922E-2,4.1438732898677E-2,4.314202043322076E-36,0,0,0,8.8603360879858858E-26,0,null,590,1.4100948157019981E-2,4.134245568751941E-2,3.4134592223490287E-36,0,0,0,7.7763359261403684E-26,0,null,590,1.0907692043481593E-5,3.1866523918716316E-5,1.8219600622504716E-39,0,2.4099437162370292E-30,0,3.7443036723849953E-29,0,null,590,1.8103608054381926E-4,5.2952438305157177E-4,3.4320488424177866E-38,0,1.8364893375529653E-29,0,7.6396122100724558E-28,0]
[600,1.4043882017093237E-2,4.1894561198496293E-2,1.0032565643708738E-35,0,0,0,1.3409965144722299E-25,0,null,600,1.4043968464857021E-2,4.1802837859372388E-2,8.2036652368854624E-36,0,0,0,1.3294162785701009E-25,0,null,600,1.0863619010707671E-5,3.2227970168062892E-5,4.6344362573930749E-39,0,7.1011903973173719E-31,0,8.4174826248987816E-29,0,null,600,1.8030457810337705E-4,5.3549381860032539E-4,8.558218476045826E-38,0,0,0,1.5353599310805418E-27,0]
[610,1.3985350598286057E-2,4.2328514725193563E-2,2.1777768122725612E-35,0,0,0,1.7282435466488908E-25,0,null,610,1.3985439251531557E-2,4.2241232527669009E-2,1.8259305777941614E-35,0,0,0,1.907644163812859E-25,0,null,610,1.0818347102059509E-5,3.2572277666021597E-5,1.0774199634751406E-38,0,0,0,1.4434264901636358E-28,0,null,610,1.795531792048625E-4,5.411795218623317E-4,1.9590473206706378E-37,0,0,0,2.4689891727897016E-27,0]
[620,1.3925416590695263E-2,4.2741144240708122E-2,4.4577414410866223E-35,0,0,0,1.8552261077494746E-25,0,null,620,1.3925507238561974E-2,4.2658190250711395E-2,3.8100237196672283E-35,0,0,0,2.329086357776461E-25,0,null,620,1.0771989832363144E-5,3.2899871904361486E-5,2.3197059855282004E-38,0,0,0,2.0768249933810539E-28,0,null,620,1.7878376775811759E-4,5.4658855725723567E-4,4.1717253295883231E-37,0,0,0,3.3669612788232195E-27,0]
[630,1.3864215427605533E-2,4.313300033029932E-2,8.6741830763797121E-35,0,0,0,1.4669686476200636E-25,0,null,630,1.386430787544685E-2,4.3054261788455971E-2,7.5368161008769165E-35,0,0,0,2.3209434133735378E-25,0,null,630,1.0724651995478714E-5,3.3211178988754778E-5,4.6985598939067104E-38,0,0,0,2.5467231097543864E-28,0,null,630,1.7799808293878836E-4,5.5172799681758313E-4,8.3829907910778632E-37,0,0,0,3.8877632110226134E-27,0]
[640,1.3801872156208648E-2,4.3504631707641968E-2,1.6107632413944321E-34,0,0,0,2.8016790252423244E-26,0,null,640,1.3801966224279734E-2,4.342999635868855E-2,1.4229708938810607E-34,0,0,0,1.543486548746493E-25,0,null,640,1.067643034877334E-5,3.3506624231052666E-5,9.0604064199002403E-38,0,0,0,2.5627972427363497E-28,0,null,640,1.7719773054801944E-4,5.5660489715425848E-4,1.6057811632407637E-36,0,0,0,3.5542883933112576E-27,0]
[650,1.3738502250337632E-2,4.3856583742493557E-2,2.8522109951861929E-34,0,2.0423130932848435E-26,0,0,0,null,650,1.3738597772641222E-2,4.3785940120966552E-2,2.5678406510043826E-34,0,0,0,0,0,null,650,1.0627414242054663E-5,3.3786630924060959E-5,1.6730340548218472E-37,0,0,0,1.7637528641411031E-28,0,null,650,1.763841934495436E-4,5.6122627941642257E-4,2.9444351415244512E-36,0,0,0,1.8062478838576169E-27,0]
[660,1.3674212357296765E-2,4.4189397186984572E-2,4.7910333079684386E-34,0,7.6550013900276364E-26,0,0,0,null,660,1.3674309180518823E-2,4.4122634863979507E-2,4.4132305693869711E-34,0,0,0,0,0,null,660,1.057768619538498E-5,3.405161927930638E-5,2.9569803446233897E-37,0,0,0,0,0,null,660,1.7555884116018662E-4,5.6559911192360359E-4,5.1599772407097279E-36,0,0,0,0,0]
[670,1.3609100984278156E-2,4.4503607079011555E-2,7.5602968865856439E-34,0,1.5914005403731724E-25,0,0,0,null,670,1.3609198966791532E-2,4.444061687416577E-2,7.1656450811013193E-34,0,4.9402559171389802E-26,0,0,0,null,670,1.0527322430266266E-5,3.4302005510114627E-5,4.9736921181004009E-37,0,0,0,0,0,null,670,1.7472293866464226E-4,5.6973029518236115E-4,8.5856697046498383E-36,0,0,0,0,0]
[680,1.3543259129408701E-2,4.4799741803366655E-2,1.1023860082226689E-33,0,2.6525534416913733E-25,0,0,0,null,680,1.354335814038201E-2,4.4740415965922355E-2,1.0845365023465428E-33,0,1.5709568884776647E-25,0,0,0,null,680,1.0476393357924903E-5,3.453820104421118E-5,7.8786637604995735E-37,0,0,0,0,0,null,680,1.7387765451928788E-4,5.7362664902633499E-4,1.3411361045760453E-35,0,0,0,0,0]
[690,1.3476770862068738E-2,4.5078322293416656E-2,1.4397282196205219E-33,0,3.8340918007974333E-25,0,0,0,null,690,1.3476870780628753E-2,4.5022554655736048E-2,1.4950615376484792E-33,0,3.1080363767111174E-25,0,0,0,null,690,1.0424964028317984E-5,3.4760611851743112E-5,1.1560010007842968E-36,0,8.8737766391003165E-30,0,0,0,null,690,1.7302406830446015E-4,5.7729490164954073E-4,1.9310394936173723E-35,0,1.4337444400801535E-27,0,0,0]
[700,1.3409713856612443E-2,4.5339861357648371E-2,1.5629722962574998E-33,0,4.9104304558694961E-25,0,0,0,null,700,1.3409814571076028E-2,4.5287547464250455E-2,1.7882991150486817E-33,0,5.0277453278102648E-25,0,0,0,null,700,1.0373094543163761E-5,3.4969637875960409E-5,1.525350282447858E-36,0,1.2842011037533125E-28,0,0,0,null,700,1.721631774782194E-4,5.8074168032220695E-4,2.4766296039544771E-35,0,3.8322335908400932E-27,0,0,0]
[710,1.3342159883448293E-2,4.5584863117271987E-2,1.0504433687590168E-33,0,5.5323122379368029E-25,0,0,0,null,710,1.3342261290610139E-2,4.5535900332107936E-2,1.6075689690912996E-33,0,7.0974733135762786E-25,0,0,0,null,710,1.0320840435873879E-5,3.5165672555146767E-5,1.6920478387122183E-36,0,3.1331777776634894E-28,0,0,0,null,710,1.7129590368283502E-4,5.8397350360367656E-4,2.6007794432885625E-35,0,7.1396949944244894E-27,0,0,0]
[720,1.3274175261045271E-2,4.5813822542394196E-2,0,0,5.2349889296155671E-25,0,0,0,null,720,1.327427726554694E-2,4.5768110136834392E-2,2.8095502449406689E-34,0,8.89153133761461E-25,0,0,0,null,720,1.0268253021355214E-5,3.5349102425683552E-5,1.2350742571377019E-36,0,5.6279770814361656E-28,0,0,0,null,720,1.7042309854896402E-4,5.8699677488466468E-4,1.5502424751739323E-35,0,1.1143830328865069E-26,0,0,0]
[730,1.3205821271942524E-2,4.6027225075541703E-2,0,0,3.4755652571129298E-25,0,0,0,null,730,1.3205923785668316E-2,4.5984664299260923E-2,0,0,9.7774154517537104E-25,0,0,0,null,730,1.0215379717880019E-5,3.5520306796993604E-5,0,0,8.5873149927068752E-28,0,0,0,null,730,1.6954554903861514E-4,5.8981777710780526E-4,0,0,1.5311355767125083E-26,0,0,0]
[740,1.313715454581541E-2,4.6225546332606809E-2,0,0,0,0,8.1737270423423956E-25,0,null,740,1.3137257487325353E-2,4.6186040469319754E-2,0,0,8.9406592707714683E-25,0,0,0,null,740,1.0162264343486372E-5,3.5679657490251698E-5,0,0,1.1593412276140916E-27,0,0,0,null,740,1.6866398236313788E-4,5.9244266853393111E-4,0,0,1.8722509739838892E-26,0,0,0]
[750,1.3068227412442032E-2,4.6409251872154604E-2,0,0,0,0,3.52629772252713E-24,0,null,750,1.3068330706502205E-2,4.6372706281997751E-2,0,0,5.4602887758998436E-25,0,1.9242164364534693E-24,0,null,750,1.010894738911619E-5,3.5827518633472941E-5,0,0,1.3949310232693357E-27,0,0,0,null,750,1.6777907051750314E-4,5.948774794311925E-4,0,0,2.0057776681544113E-26,0,0,0]
[760,1.299908822669372E-2,4.6578797025154613E-2,0,0,0,0,7.0579569949649798E-24,0,null,760,1.2999191803772616E-2,4.6545119175252954E-2,0,0,0,0,5.6042441435038409E-24,0,null,760,1.0055466270071704E-5,3.5964246506448219E-5,0,0,1.4675324055964258E-27,0,1.7826568505885747E-27,0,null,760,1.6689143445250729E-4,5.9712810958160241E-4,0,0,1.766355178092545E-26,0,4.542431834868792E-26,0]
[770,1.2929781668303171E-2,4.67346267779499E-2,0,0,0,0,1.12187000255472E-23,0,null,770,1.2929885464145882E-2,4.6703726262592088E-2,0,0,0,0,1.0234322486865506E-23,0,null,770,1.0001855557984838E-5,3.6090189429604057E-5,0,0,1.2563116717773799E-27,0,5.5687333459711045E-27,0,null,770,1.6600164792422774E-4,5.9920032650722494E-4,0,0,9.7178902583972663E-27,0,1.0806259708278011E-25,0]
[780,1.2860349017995515E-2,4.6877175702005815E-2,0,0,0,0,1.5640078403051624E-23,0,null,780,1.2860452973256326E-2,4.6848964253709748E-2,0,0,0,0,1.5505902389596304E-23,0,null,780,9.9481471944236439E-6,3.6205687691615021E-5,0,0,6.30154987367955E-28,0,1.0347306957346534E-26,0,null,780,1.6511024104098846E-4,6.0109976433019323E-4,0,0,0,0,1.8438489000946548E-25,0]
[790,1.2790828412245436E-2,4.7006867924710288E-2,0,0,0,0,1.9771367749179309E-23,0,null,790,1.2790932472097684E-2,4.6981259417265608E-2,0,0,0,0,2.0892397350552155E-23,0,null,790,9.8943706881059436E-6,3.6311073510919362E-5,0,0,0,0,1.5805219283237499E-26,0,null,790,1.6421770353395977E-4,6.028319231889262E-4,0,0,0,0,2.6851142310095158E-25,0]
[800,1.2721255078182878E-2,4.7124117136119602E-2,0,0,0,0,2.2894962464802077E-23,0,null,800,1.2721359191987941E-2,4.7101027580643856E-2,0,0,0,0,2.5650147909474983E-23,0,null,800,9.8405532965786728E-6,3.6406671027092951E-5,0,0,0,0,2.1406425552267716E-26,0,null,800,1.63324487774133E-4,6.044021691420029E-4,0,0,0,0,3.5114588145094211E-25,0]
[810,1.2651661550477478E-2,4.7229326627012527E-2,0,0,0,0,2.4168144107583317E-23,0,null,810,1.2651765671459234E-2,4.7208674161929198E-2,0,0,0,0,2.8848970100834076E-23,0,null,810,9.7867201940978645E-6,3.6492796318168262E-5,0,0,0,0,2.6393466128311632E-26,0,null,810,1.6243101155741327E-4,6.0581573449774171E-4,0,0,0,0,4.1974350740580094E-25,0]
[820,1.2582077871322251E-2,4.732288935423256E-2,0,0,0,0,2.2692025101028845E-23,0,null,820,1.2582181956297634E-2,4.7304594229942189E-2,0,0,0,0,2.9435244129864794E-23,0,null,820,9.732894626309966E-6,3.6569757440705699E-5,0,0,0,0,2.9819119641793913E-26,0,null,820,1.6153766067239947E-4,6.0707771851468474E-4,0,0,0,0,4.5915720468733394E-25,0]
[830,1.2512531775180757E-2,4.7405188029561313E-2,0,0,0,0,1.7605264682631893E-23,0,null,830,1.2512635784316569E-2,4.7389172588571803E-2,0,0,0,0,2.6326947875256434E-23,0,null,830,9.6790980532516703E-6,3.6637854489423387E-5,0,0,0,0,3.0611065153307474E-26,0,null,830,1.6064479127346601E-4,6.0819308842348851E-4,0,0,0,0,4.5278765330553706E-25,0]
[840,1.2443048859348806E-2,4.7476595228917104E-2,0,0,0,0,8.196785136836999E-24,0,null,840,1.2443152755838001E-2,4.7462783881991148E-2,0,0,0,0,1.8536051972842509E-23,0,null,840,9.6253502813242761E-6,3.6697379673878299E-5,0,0,0,0,2.7668740041863326E-26,0,null,840,1.5975273207021661E-4,6.0916668072551498E-4,0,0,0,0,3.8420543844202041E-25,0]
[850,1.2373652741529457E-2,4.753747351899925E-2,1.9645851711433028E-31,0,8.8093233076897425E-25,0,0,0,null,850,1.237375649145315E-2,4.7525792718019655E-2,0,0,0,0,5.3097112305493585E-24,0,null,850,9.571669585178831E-6,3.6748617409708138E-5,0,0,0,0,1.9987530968490687E-26,0,null,850,1.5886178635198228E-4,6.1000320273088895E-4,0,0,0,0,2.3915109137585299E-25,0]
[860,1.2304365205395748E-2,4.7588175598708635E-2,9.4043479255507829E-31,0,7.2195818876928811E-24,0,0,0,null,860,1.2304468777457053E-2,4.7578553806619378E-2,6.1524200396935741E-31,0,0,0,0,0,null,860,9.5180728203848584E-6,3.6791844422382469E-5,1.2845101907683997E-34,0,0,0,6.8014314469548791E-27,0,null,860,1.5797223385605641E-4,6.1070723430017826E-4,3.9745630310252218E-33,0,0,0,7.7598248059829948E-27,0]
[870,1.223520633512269E-2,4.7629044453071333E-2,2.1610401616209079E-30,0,1.5492388233758116E-23,0,0,0,null,870,1.2235309700487538E-2,4.762141211147615E-2,1.7194020912240761E-30,0,2.3731855185058291E-24,0,0,0,null,870,9.4645755275184492E-6,3.6827329861424516E-5,8.342002989383254E-34,0,0,0,0,0,null,870,1.5708433249580629E-4,6.1128322975630633E-4,1.6528864748082311E-32,0,0,0,0,0]
[880,1.2166194639772546E-2,4.7660413517613569E-2,3.9946189116339116E-30,0,2.5459331707783154E-23,0,0,0,null,880,1.2166297771857284E-2,4.7654703012362014E-2,3.4392569085700036E-30,0,1.306331257579711E-23,0,0,0,null,880,9.4111920284018859E-6,3.685533542361097E-5,2.0038194122057732E-33,0,0,0,0,0,null,880,1.5619831995835514E-4,6.1173551994379762E-4,3.6883041593884938E-32,0,0,0,0,0]
[890,1.2097347168247979E-2,4.76826068513772E-2,6.5553326344411199E-30,0,3.6600830200466261E-23,0,0,0,null,890,1.2097450042593879E-2,4.767875247649711E-2,5.9167846098661034E-30,0,2.6791514994661132E-23,0,0,0,null,890,9.3579355150361251E-6,3.6876115483504179E-5,3.7737128383966281E-33,0,0,0,0,0,null,890,1.5531441517963379E-4,6.1206831440593294E-4,6.7167634232392843E-32,0,5.478028214292799E-26,0,0,0]
[900,1.2028679615819077E-2,4.7695939316969214E-2,9.8959559228880113E-30,0,4.8090315788797667E-23,0,0,2.0279476403154884E-40,null,900,1.2028782209891323E-2,4.769387723732002E-2,9.2469693145873454E-30,0,4.3089559586880665E-23,0,0,1.3377709943840179E-40,null,900,9.3048181320494925E-6,3.6889917230052387E-5,6.2610676604515938E-33,0,4.3356110164875232E-27,0,0,0,null,900,1.544328197137146E-4,6.1228570366232736E-4,1.0909940152928741E-31,0,2.6853605877747167E-25,0,0,0]
[910,1.196020642235953E-2,4.7700716766019939E-2,1.3954086609244444E-29,0,5.8791950344607089E-23,0,0,3.1586349027431775E-40,null,910,1.1960308715458607E-2,4.7700384978870719E-2,1.3425516735418382E-29,0,6.104019039245237E-23,0,0,3.1305317068187414E-40,null,910,9.2518510527106549E-6,3.6896980807978177E-5,9.5264845920332872E-33,0,1.9978988501294935E-26,0,0,0,null,910,1.5355371899339709E-4,6.123916615616195E-4,1.6334132958493484E-31,0,5.4092695511152365E-25,0,0,0]
[920,1.189194086351231E-2,4.7697236229125674E-2,1.8484499845911537E-29,0,6.7289070094172353E-23,0,0,3.6881734844426638E-40,null,920,1.1892042836593853E-2,4.7698574524968652E-2,1.8280716360210236E-29,0,7.9245169563656259E-23,0,0,5.2427076873177958E-40,null,920,9.199044549456666E-6,3.6897539463063707E-5,1.3522479778679514E-32,0,3.9848137097469065E-26,0,0,0,null,920,1.5267728350078341E-4,6.1239004769973661E-4,2.2863735189234095E-31,0,8.6221288478130612E-25,0,0,0]
[930,1.1823895134995811E-2,4.768578610889157E-2,2.2981089327624442E-29,0,7.1946886926458871E-23,0,0,2.5332869583381875E-40,null,930,1.1823996770583439E-2,4.7688736031680702E-2,2.3391870969891271E-29,0,9.583504996665969E-23,0,0,6.6228248280645973E-40,null,930,9.1464080591279425E-6,3.6891819690328921E-5,1.8028468696061608E-32,0,6.3227714030371211E-26,0,0,0,null,930,1.5180366985072165E-4,6.1228460988280674E-4,3.0073900113683965E-31,0,1.2139883315810781E-24,0,0,0]
[940,1.1756080430590459E-2,4.7666646375033449E-2,2.6595326205116615E-29,0,7.1010292388698645E-23,0,0,0,null,940,1.175618171265067E-2,4.7671151182052715E-2,2.8000187853352859E-29,0,1.0852822229138153E-22,0,0,5.428804941826226E-40,null,940,9.0939502433107151E-6,3.6880041384123456E-5,2.2575414581699957E-32,0,8.8780378169922898E-26,0,0,0,null,940,1.5093302179161684E-4,6.1207898662148704E-4,3.7118474679670503E-31,0,1.5686601901553666E-24,0,0,0]
[950,1.1688507014507937E-2,4.7640088760986118E-2,2.8062232744086355E-29,0,6.2734504535916345E-23,0,0,0,null,950,1.1688607928351934E-2,4.7646093382490352E-2,3.0922236113230581E-29,0,1.1474321921986964E-22,0,0,0,null,950,9.0416790443300531E-6,3.6862417989807941E-5,2.6366631680994014E-32,0,1.1451068155247602E-25,0,0,0,null,950,1.5006547113483818E-4,6.1177670965001515E-4,4.2604765537885799E-31,0,1.8897355802910746E-24,0,0,0]
[960,1.1621184288268915E-2,4.7606376960853625E-2,2.5649159013336471E-29,0,4.5543017278002709E-23,0,0,0,null,960,1.1621284820414949E-2,4.7613827959694904E-2,3.0480708334036799E-29,0,1.1176386391157875E-22,0,0,0,null,960,8.9896017370100476E-6,3.683915665590883E-5,2.8205097398269982E-32,0,1.3778680929793634E-25,0,0,0,null,960,1.4920113861379862E-4,6.1138120645198846E-4,4.4482987936690114E-31,0,2.1330536283214801E-24,0,0,0]
[970,1.1554120852759166E-2,4.7565766826328959E-2,1.7146646513945216E-29,0,1.8204137157455526E-23,0,0,0,null,970,1.155422099093128E-2,4.757461235762897E-2,2.4471789892422489E-29,0,9.6951961123667907E-23,0,0,0,null,970,8.9377249766993815E-6,3.681045838653999E-5,2.6441715583234226E-32,0,1.5542961889068542E-25,0,0,0,null,970,1.4834013468062151E-4,6.1089580279108922E-4,3.997475215180378E-31,0,2.2490255477520759E-24,0,0,0]
[980,1.1487324565678214E-2,4.7518506562842525E-2,0,0,0,0,3.6113430728803075E-23,0,null,980,1.1487424298636124E-2,4.7528696333870663E-2,1.0192270073062361E-29,0,6.7997255296255946E-23,0,0,0,null,980,8.8860548436535945E-6,3.6776518193503063E-5,1.8962797615299125E-32,0,1.6387348512765837E-25,0,0,0,null,980,1.474825602437337E-4,6.1032372523319746E-4,2.5570833792766893E-31,0,2.1858628142819028E-24,0,0,0]
[990,1.142080259499121E-2,4.7464836924534883E-2,0,0,0,0,1.4037652252758564E-22,0,null,990,1.1420901912514415E-2,4.7476322154860029E-2,0,0,2.3189759471053785E-23,0,7.874219804994027E-23,0,null,990,8.8345968844813504E-6,3.6737525247586043E-5,3.2379589216504661E-33,0,1.5939746022885189E-25,0,0,0,null,990,1.4662850735473382E-4,6.0966810365689758E-4,0,0,1.893680489958779E-24,0,0,0]
[1000,1.1354561468050348E-2,4.7404991407360667E-2,0,0,0,0,2.6275355546854234E-22,6.2242369314984151E-39,null,1000,1.1354660360825955E-2,4.7417724789411107E-2,0,0,0,0,2.0908286828296491E-22,0,null,1000,8.7833561501218559E-6,3.6693663028678729E-5,0,0,1.3841867981055607E-25,0,6.9064500611516744E-26,0,null,1000,1.4577805983863445E-4,6.0893197374245066E-4,0,0,1.3292696532052121E-24,0,1.730268303180378E-24,0]
[]
[]
["Saved  22/03/2023: 12:03:01  Level Number: 5"]
[]
["BREAKTHROUGH RESULTS"]
[]
["Advanced"]
["Pollutant Linkage: Inert Restorati, Attenution Layer, Beenham Grange Formation",null,null,null,null,null,null,null,null,null,"Pollutant Linkage: Inert Restorati, Attenution Layer, Beenham Grange Formation, Groundwater ",null,null,null,null,null,null,null,null,null,"Pollutant Linkage: Inert Restorati, Attenution Layer, Beenham Grange Formation, River Enborne",null,null,null,null,null,null,null,null,null,"Pollutant Linkage: Inert Restorati, Attenution Layer, Beenham Grange Formation, Spring Ditch"]
["Concentrations in mg/L in Beenham Grange Formation",null,null,null,null,null,null,null,null,null,"Concentrations in mg/L in Groundwater ",null,null,null,null,null,null,null,null,null,"Concentrations in mg/L in River Enborne",null,null,null,null,null,null,null,null,null,"Concentrations in mg/L in Spring Ditch"]
[]
["Compared with EAL (GW) target concentration in mg/L",null,null,null,null,null,null,null,null,null,"Compared with EAL (GW) target concentration in mg/L",null,null,null,null,null,null,null,null,null,"Compared with EAL (River Enborne) target concentration in mg/L",null,null,null,null,null,null,null,null,null,"Compared with EAL (Spring Ditch) target concentration in mg/L"]
[null,0.39,4.8199999999999993E-2,3.2649999999999991E-4,1E-3,4.3649999999999991E-3,2.0000000000000002E-5,2E-3,2.0000000000000001E-4,null,null,0.39,4.8199999999999993E-2,3.2649999999999991E-4,1E-3,4.3649999999999991E-3,2.0000000000000002E-5,2E-3,2.0000000000000001E-4,null,null,0.39,2.76E-2,6.4999999999999994E-5,1E-3,4.4000000000000003E-3,2.0000000000000002E-5,1.75E-3,2.0000000000000001E-4,null,null,0.39,0.03,5.0000000000000002E-5,1E-3,3.5500000000000002E-3,2.0000000000000002E-5,1.5E-3,2.0000000000000001E-4]
[]
["Time(years)","Species1","Species2","Species3","Species4","Species5","Species6","Species7","Species8",null,"Time(years)","Species1","Species2","Species3","Species4","Species5","Species6","Species7","Species8",null,"Time(years)","Species1","Species2","Species3","Species4","Species5","Species6","Species7","Species8",null,"Time(years)","Species1","Species2","Species3","Species4","Species5","Species6","Species7","Species8"]
[null,"Ammoniacal Nitrogen","Barium","Cadmium","Total Chromium","Copper","Mercury","Molybdenum","Lead",null,null,"Ammoniacal Nitrogen","Barium","Cadmium","Total Chromium","Copper","Mercury","Molybdenum","Lead",null,null,"Ammoniacal Nitrogen","Barium","Cadmium","Total Chromium","Copper","Mercury","Molybdenum","Lead",null,null,"Ammoniacal Nitrogen","Barium","Cadmium","Total Chromium","Copper","Mercury","Molybdenum","Lead"]
[10,"","","","","","","","",null,10,"","","","","","","","",null,10,"","","","","","","","",null,10,1.4702632389328437E-13,0,0,0,0,0,0,0]
[20,"","","","","","","","",null,20,"","","","","","","","",null,20,"","","","","","","","",null,20,8.927431944339794E-9,2.5815966891309081E-18,0,0,0,0,0,0]
[30,"","","","","","","","",null,30,"","","","","","","","",null,30,"","","","","","","","",null,30,3.6178036348133091E-7,4.44719468757116E-13,0,0,0,0,0,0]
[40,"","","","","","","","",null,40,"","","","","","","","",null,40,"","","","","","","","",null,40,2.3189263897771632E-6,1.6435689679080471E-10,0,0,0,0,0,0]
[50,"","","","","","","","",null,50,"","","","","","","","",null,50,"","","","","","","","",null,50,7.0646906636265918E-6,5.3274380134284105E-9,0,0,0,0,0,0]
[60,"","","","","","","","",null,60,"","","","","","","","",null,60,"","","","","","","","",null,60,1.479706134260813E-5,5.215999718860669E-8,0,0,0,0,0,0]
[70,"","","","","","","","",null,70,"","","","","","","","",null,70,"","","","","","","","",null,70,2.4984608614842961E-5,2.6041721237796711E-7,0,0,0,0,0,0]
[80,"","","","","","","","",null,80,"","","","","","","","",null,80,"","","","","","","","",null,80,3.684359219236707E-5,8.5837668952918356E-7,0,0,0,0,0,0]
[90,"","","","","","","","",null,90,"","","","","","","","",null,90,"","","","","","","","",null,90,4.9622053116575036E-5,2.1519807889168739E-6,0,0,0,0,0,0]
[100,"","","","","","","","",null,100,"","","","","","","","",null,100,"","","","","","","","",null,100,6.2709291931267638E-5,4.4625549797950011E-6,0,0,0,0,0,0]
[110,"","","","","","","","",null,110,"","","","","","","","",null,110,"","","","","","","","",null,110,7.5653609153676071E-5,8.0695063960206755E-6,0,0,0,0,0,0]
[120,"","","","","","","","",null,120,"","","","","","","","",null,120,"","","","","","","","",null,120,8.8143168145769443E-5,1.3175734129774775E-5,0,0,0,0,0,0]
[130,"","","","","","","","",null,130,"","","","","","","","",null,130,"","","","","","","","",null,130,9.9976890012904582E-5,1.9896166769778055E-5,0,0,0,0,0,0]
[140,"","","","","","","","",null,140,"","","","","","","","",null,140,"","","","","","","","",null,140,1.1103646975983673E-4,2.8262502475929979E-5,0,0,0,0,0,0]
[150,"","","","","","","","",null,150,"","","","","","","","",null,150,"","","","","","","","",null,150,1.2126313262937486E-4,3.8236600817192599E-5,0,0,0,0,0,0]
[160,"","","","","","","","",null,160,"","","","","","","","",null,160,"","","","","","","","",null,160,1.3063961562652355E-4,4.972690719085885E-5,0,0,0,0,0,0]
[170,"","","","","","","","",null,170,"","","","","","","","",null,170,"","","","","","","","",null,170,1.3917672977150369E-4,6.2604509651048915E-5,0,0,0,0,0,0]
[180,"","","","","","","","",null,180,"","","","","","","","",null,180,"","","","","","","","",null,180,1.4690358206904817E-4,7.6717133801419452E-5,0,0,0,0,0,0]
[190,"","","","","","","","",null,190,"","","","","","","","",null,190,"","","","","","","","",null,190,1.5386058646496209E-4,9.1900473155008688E-5,0,0,0,0,0,0]
[200,"","","","","","","","",null,200,"","","","","","","","",null,200,"","","","","","","","",null,200,1.6009454368861887E-4,1.0798686260601997E-4,0,0,0,0,0,0]
[210,"","","","","","","","",null,210,"","","","","","","","",null,210,"","","","","","","","",null,210,1.656552303565582E-4,1.248115951258767E-4,0,0,0,0,0,0]
[220,"","","","","","","","",null,220,"","","","","","","","",null,220,"","","","","","","","",null,220,1.7059307669624454E-4,1.4221728653402533E-4,0,0,0,0,0,0]
[230,"","","","","","","","",null,230,"","","","","","","","",null,230,"","","","","","","","",null,230,1.7495762275299766E-4,1.6005669763898277E-4,0,0,0,0,0,0]
[240,"","","","","","","","",null,240,"","","","","","","","",null,240,"","","","","","","","",null,240,1.7879652707522532E-4,1.7819438050074835E-4,0,0,0,0,0,0]
[250,"","","","","","","","",null,250,"","","","","","","","",null,250,"","","","","","","","",null,250,1.8215496439976571E-4,1.9650745611000475E-4,0,0,0,0,2.5198713157737304E-39,0]
[260,"","","","","","","","",null,260,"","","","","","","","",null,260,"","","","","","","","",null,260,1.8507529468364685E-4,2.1488577005295058E-4,0,0,0,0,1.6720813049134805E-38,0]
[270,"","","","","","","","",null,270,"","","","","","","","",null,270,"","","","","","","","",null,270,1.8759691913417185E-4,2.3323161796172677E-4,0,0,2.6826484884680179E-40,0,8.1947378838670895E-38,0]
[280,"","","","","","","","",null,280,"","","","","","","","",null,280,"","","","","","","","",null,280,1.8975626298064959E-4,2.5145918635159311E-4,0,0,0,0,7.924723408591939E-37,0]
[290,"","","","","","","","",null,290,"","","","","","","","",null,290,"","","","","","","","",null,290,1.9158684210615623E-4,2.6949381706900722E-4,0,0,0,0,5.0812348084851324E-36,0]
[300,"","","","","","","","",null,300,"","","","","","","","",null,300,"","","","","","","","",null,300,1.9311938316661969E-4,2.8727117418972132E-4,0,0,1.4857581122079514E-38,0,2.2634616617040003E-35,0]
[310,"","","","","","","","",null,310,"","","","","","","","",null,310,"","","","","","","","",null,310,1.9438197581973454E-4,3.0473636958994708E-4,0,0,9.199955833501278E-38,0,8.1806051045728778E-35,0]
[320,"","","","","","","","",null,320,"","","","","","","","",null,320,"","","","","","","","",null,320,1.9540024214777211E-4,3.2184308630156007E-4,0,0,2.5103240885805382E-37,0,2.405053842047243E-34,0]
[330,"","","","","","","","",null,330,"","","","","","","","",null,330,"","","","","","","","",null,330,1.9619751299101206E-4,3.3855272600246316E-4,0,0,1.4548303780906289E-36,0,5.000164515168627E-34,0]
[340,"","","","","","","","",null,340,"","","","","","","","",null,340,"","","","","","","","",null,340,1.9679500422376057E-4,3.5483359760998692E-4,0,0,9.2331063666647793E-36,0,3.6763579749786858E-34,0]
[350,"","","","","","","","",null,350,"","","","","","","","",null,350,"","","","","","","","",null,350,1.972119883741632E-4,3.7066015714032455E-4,0,0,4.0431333336823943E-35,0,0,0]
[360,"","","","","","","","",null,360,"","","","","","","","",null,360,"","","","","","","","",null,360,1.9746595866431294E-4,3.8601230413949232E-4,0,0,1.3651436005382802E-34,0,0,0]
[370,"","","","","","","","",null,370,"","","","","","","","",null,370,"","","","","","","","",null,370,1.9757278373944368E-4,4.0087473658730353E-4,0,0,3.9654516773028274E-34,0,0,0]
[380,"","","","","","","","",null,380,"","","","","","","","",null,380,"","","","","","","","",null,380,1.9754685217918949E-4,4.1523636384740189E-4,0,0,1.0128277420539641E-33,0,0,0]
[390,"","","","","","","","",null,390,"","","","","","","","",null,390,"","","","","","","","",null,390,1.9740120646002073E-4,4.2908977569593154E-4,0,0,2.1312147657848428E-33,0,0,0]
[400,"","","","","","","","",null,400,"","","","","","","","",null,400,"","","","","","","","",null,400,1.9714766642556729E-4,4.4243076449227862E-4,0,0,3.078465284156711E-33,0,0,0]
[410,"","","","","","","","",null,410,"","","","","","","","",null,410,"","","","","","","","",null,410,1.9679694257638386E-4,4.5525789699409075E-4,0,0,3.6385459481312333E-34,0,3.0506845180918646E-31,0]
[420,"","","","","","","","",null,420,"","","","","","","","",null,420,"","","","","","","","",null,420,1.963587396547116E-4,4.6757213204851484E-4,0,0,0,0,1.3880645427676916E-30,0]
[430,"","","","","","","","",null,430,"","","","","","","","",null,430,"","","","","","","","",null,430,1.9584185109302726E-4,4.7937648031857484E-4,0,0,0,0,3.5066947981526749E-30,0]
[440,"","","","","","","","",null,440,"","","","","","","","",null,440,"","","","","","","","",null,440,1.9525424494440985E-4,4.9067570226882446E-4,0,0,0,0,6.4669874128869429E-30,0]
[450,"","","","","","","","",null,450,"","","","","","","","",null,450,"","","","","","","","",null,450,1.9460314192822837E-4,5.0147604078444293E-4,0,0,0,0,8.681641089703695E-30,0]
[460,"","","","","","","","",null,460,"","","","","","","","",null,460,"","","","","","","","",null,460,1.9389508622030431E-4,5.1178498500483588E-4,0,0,0,0,6.1834355837655161E-30,0]
[470,"","","","","","","","",null,470,"","","","","","","","",null,470,"","","","","","","","",null,470,1.9313600959197584E-4,5.2161106218797651E-4,0,0,0,0,0,0]
[480,"","","","","","","","",null,480,"","","","","","","","",null,480,"","","","","","","","",null,480,1.9233128947903139E-4,5.3096365467012146E-4,0,0,0,0,0,0]
[490,"","","","","","","","",null,490,"","","","","","","","",null,490,"","","","","","","","",null,490,1.9148580152073929E-4,5.3985283923592235E-4,1.0284468327988266E-40,0,1.7678513788499525E-30,0,0,0]
[500,"","","","","","","","",null,500,"","","","","","","","",null,500,"","","","","","","","",null,500,1.9060396707655836E-4,5.4828924645835013E-4,3.5646466537850191E-40,0,6.5358253347123588E-30,0,0,0]
[510,"","","","","","","","",null,510,"","","","","","","","",null,510,"","","","","","","","",null,510,1.8968979618476801E-4,5.5628393779894481E-4,8.3510889201332473E-40,0,1.5279662820106908E-29,0,0,0]
[520,"","","","","","","","",null,520,"","","","","","","","",null,520,"","","","","","","","",null,520,1.8874692639569003E-4,5.6384829847936214E-4,1.890391795893309E-39,0,2.7998618507258253E-29,0,0,0]
[530,"","","","","","","","",null,530,"","","","","","","","",null,530,"","","","","","","","",null,530,1.8777865786971722E-4,5.7099394433595503E-4,5.1352248306771523E-39,0,4.1559923227609287E-29,0,0,0]
[540,"","","","","","","","",null,540,"","","","","","","","",null,540,"","","","","","","","",null,540,1.8678798509924154E-4,5.777326410564234E-4,1.5640361694911692E-38,0,4.7241020430621848E-29,0,2.6876977498932529E-28,0]
[550,"","","","","","","","",null,550,"","","","","","","","",null,550,"","","","","","","","",null,550,1.8577762558312407E-4,5.8407623436817352E-4,4.578098471660043E-38,0,2.8646916284542528E-29,0,1.0032205728850274E-27,0]
[560,"","","","","","","","",null,560,"","","","","","","","",null,560,"","","","","","","","",null,560,1.8475004574234979E-4,5.9003658990033241E-4,1.2134237047552912E-37,0,0,0,2.0925144270558892E-27,0]
[570,"","","","","","","","",null,570,"","","","","","","","",null,570,"","","","","","","","",null,570,1.8370748435318928E-4,5.9562554158408142E-4,2.9148323944629583E-37,0,0,0,3.403313847988505E-27,0]
[580,"","","","","","","","",null,580,"","","","","","","","",null,580,"","","","","","","","",null,580,1.82651973735364E-4,6.0085484757818098E-4,6.4593006299413655E-37,0,0,0,4.5884506668460907E-27,0]
[590,"","","","","","","","",null,590,"","","","","","","","",null,590,"","","","","","","","",null,590,1.8158535891376576E-4,6.0573615282182047E-4,1.3434300495492002E-36,0,0,0,5.0521872775108297E-27,0]
[600,"","","","","","","","",null,600,"","","","","","","","",null,600,"","","","","","","","",null,600,1.8050931495277168E-4,6.1028095741621938E-4,2.6505054982419806E-36,0,0,0,3.9808897902413652E-27,0]
[610,"","","","","","","","",null,610,"","","","","","","","",null,610,"","","","","","","","",null,610,1.7942536264378234E-4,6.1450059012839312E-4,4.9728180681786542E-36,0,0,0,4.6711801766966175E-28,0]
[620,"","","","","","","","",null,620,"","","","","","","","",null,620,"","","","","","","","",null,620,1.783348827006986E-4,6.184061863880369E-4,8.828437892144927E-36,0,0,0,0,0]
[630,"","","","","","","","",null,630,"","","","","","","","",null,630,"","","","","","","","",null,630,1.7723912861445135E-4,6.2200867022372424E-4,1.466410993875235E-35,0,0,0,0,0]
[640,"","","","","","","","",null,640,"","","","","","","","",null,640,"","","","","","","","",null,640,1.7613923829320579E-4,6.253187396450115E-4,2.2361572979345246E-35,0,8.4489543131626444E-28,0,0,0]
[650,"","","","","","","","",null,650,"","","","","","","","",null,650,"","","","","","","","",null,650,1.7503624460883598E-4,6.2834685503661638E-4,3.023876194186343E-35,0,3.7101488065152301E-27,0,0,0]
[660,"","","","","","","","",null,660,"","","","","","","","",null,660,"","","","","","","","",null,660,1.7393108495185433E-4,6.3110323017824088E-4,3.3345218373671843E-35,0,7.9864683529162853E-27,0,0,0]
[670,"","","","","","","","",null,670,"","","","","","","","",null,670,"","","","","","","","",null,670,1.7282460989460956E-4,6.33597825552026E-4,2.0915870103248222E-35,0,1.3473703649338019E-26,0,0,0]
[680,"","","","","","","","",null,680,"","","","","","","","",null,680,"","","","","","","","",null,680,1.7171759104700414E-4,6.3584034363439756E-4,0,0,1.9454615289514207E-26,0,0,0]
[690,"","","","","","","","",null,690,"","","","","","","","",null,690,"","","","","","","","",null,690,1.7061072818077324E-4,6.378402259101005E-4,0,0,2.4553876492940023E-26,0,0,0]
[700,"","","","","","","","",null,700,"","","","","","","","",null,700,"","","","","","","","",null,700,1.6950465569484015E-4,6.3960665137086363E-4,0,0,2.6689432069691332E-26,0,5.9470422806151191E-27,0]
[710,"","","","","","","","",null,710,"","","","","","","","",null,710,"","","","","","","","",null,710,1.6839994848332705E-4,6.4114853629485631E-4,0,0,2.3175013533198635E-26,0,7.4322180731339392E-26,0]
[720,"","","","","","","","",null,720,"","","","","","","","",null,720,"","","","","","","","",null,720,1.6729712726332651E-4,6.4247453512472109E-4,0,0,1.1021913063832707E-26,0,1.6658652021043983E-25,0]
[730,"","","","","","","","",null,730,"","","","","","","","",null,730,"","","","","","","","",null,730,1.6619666341434434E-4,6.4359304228058087E-4,0,0,0,0,2.7715773851544238E-25,0]
[740,"","","","","","","","",null,740,"","","","","","","","",null,740,"","","","","","","","",null,740,1.6509898337394531E-4,6.4451219477208613E-4,0,0,0,0,3.9480256615804234E-25,0]
[750,"","","","","","","","",null,750,"","","","","","","","",null,750,"","","","","","","","",null,750,1.6400447263453517E-4,6.4523987548090211E-4,0,0,0,0,5.0243441294743302E-25,0]
[760,"","","","","","","","",null,760,"","","","","","","","",null,760,"","","","","","","","",null,760,1.6291347937483791E-4,6.4578371700598728E-4,0,0,0,0,5.7777764308795161E-25,0]
[770,"","","","","","","","",null,770,"","","","","","","","",null,770,"","","","","","","","",null,770,1.618263177625863E-4,6.4615110597757294E-4,0,0,0,0,5.9501682279298203E-25,0]
[780,"","","","","","","","",null,780,"","","","","","","","",null,780,"","","","","","","","",null,780,1.6074327096142772E-4,6.4634918775325712E-4,0,0,0,0,5.2742777300422103E-25,0]
[790,"","","","","","","","",null,790,"","","","","","","","",null,790,"","","","","","","","",null,790,1.5966459386310106E-4,6.4638487142419285E-4,0,0,0,0,3.5084748575930961E-25,0]
[800,"","","","","","","","",null,800,"","","","","","","","",null,800,"","","","","","","","",null,800,1.5859051557696256E-4,6.462648350665977E-4,4.1478525222668406E-33,0,0,0,4.769977212849186E-26,0]
[810,"","","","","","","","",null,810,"","","","","","","","",null,810,"","","","","","","","",null,810,1.5752124169638205E-4,6.4599553118324876E-4,2.0901313210631918E-32,0,0,0,0,0]
[820,"","","","","","","","",null,820,"","","","","","","","",null,820,"","","","","","","","",null,820,1.5645695636165767E-4,6.455831922847706E-4,4.9062378904588136E-32,0,0,0,0,0]
[830,"","","","","","","","",null,830,"","","","","","","","",null,830,"","","","","","","","",null,830,1.5539782414079236E-4,6.4503383656931462E-4,9.1958039630910919E-32,0,5.6174279801362864E-26,0,0,0]
[840,"","","","","","","","",null,840,"","","","","","","","",null,840,"","","","","","","","",null,840,1.5434399174157781E-4,6.4435327366386117E-4,1.5213861652106338E-31,0,3.5859545208604896E-25,0,0,0]
[850,"","","","","","","","",null,850,"","","","","","","","",null,850,"","","","","","","","",null,850,1.5329558957460931E-4,6.4354711039264149E-4,2.3016839838722807E-31,0,7.5071927036692484E-25,0,0,0]
[860,"","","","","","","","",null,860,"","","","","","","","",null,860,"","","","","","","","",null,860,1.5225273317601211E-4,6.4262075655188071E-4,3.2297918656662322E-31,0,1.2158886451689747E-24,0,0,0]
[870,"","","","","","","","",null,870,"","","","","","","","",null,870,"","","","","","","","",null,870,1.5121552450582604E-4,6.4157943065681325E-4,4.2183928626765377E-31,0,1.7220239356361098E-24,0,0,0]
[880,"","","","","","","","",null,880,"","","","","","","","",null,880,"","","","","","","","",null,880,1.5018405313332249E-4,6.4042816565209595E-4,5.1009475861438295E-31,0,2.2208032980335126E-24,0,0,0]
[890,"","","","","","","","",null,890,"","","","","","","","",null,890,"","","","","","","","",null,890,1.4915839731588639E-4,6.391718145595187E-4,5.6096965630494556E-31,0,2.6485432670573385E-24,0,0,0]
[900,"","","","","","","","",null,900,"","","","","","","","",null,900,"","","","","","","","",null,900,1.481386249888529E-4,6.3781505605635456E-4,5.3585683265060454E-31,0,2.9290463780815501E-24,0,0,0]
[910,"","","","","","","","",null,910,"","","","","","","","",null,910,"","","","","","","","",null,910,1.4712479466240296E-4,6.3636239996201047E-4,3.8367312191893138E-31,0,2.9785098358655914E-24,0,0,0]
[920,"","","","","","","","",null,920,"","","","","","","","",null,920,"","","","","","","","",null,920,1.4611695624501862E-4,6.348181926349026E-4,4.1967968648583028E-32,0,2.7123828873319027E-24,0,0,0]
[930,"","","","","","","","",null,930,"","","","","","","","",null,930,"","","","","","","","",null,930,1.4511515179492629E-4,6.3318662226266923E-4,0,0,2.053839874519506E-24,0,1.9214731379216815E-24,0]
[940,"","","","","","","","",null,940,"","","","","","","","",null,940,"","","","","","","","",null,940,1.4411941620586573E-4,6.3147172404135192E-4,0,0,9.4332290379095994E-25,0,4.745671542398906E-24,0]
[950,"","","","","","","","",null,950,"","","","","","","","",null,950,"","","","","","","","",null,950,1.4312977783387763E-4,6.2967738524029001E-4,0,0,0,0,7.9742661147793627E-24,0]
[960,"","","","","","","","",null,960,"","","","","","","","",null,960,"","","","","","","","",null,960,1.4214625906954834E-4,6.2780735014462551E-4,0,0,0,0,1.1458589592085023E-23,3.1795082152978117E-40]
[970,"","","","","","","","",null,970,"","","","","","","","",null,970,"","","","","","","","",null,970,1.4116887686213892E-4,6.258652248784573E-4,0,0,0,0,1.5004691902817265E-23,1.0165495789099555E-39]
[980,"","","","","","","","",null,980,"","","","","","","","",null,980,"","","","","","","","",null,980,1.401976431979354E-4,6.2385448209844512E-4,0,0,0,0,1.8381252990877521E-23,2.1141172081452664E-39]
[990,"","","","","","","","",null,990,"","","","","","","","",null,990,"","","","","","","","",null,990,1.3923256554001034E-4,6.2177846556550577E-4,0,0,0,0,2.1331742882932724E-23,3.6348746083642401E-39]
[1000,"","","","","","","","",null,1000,"","","","","","","","",null,1000,"","","","","","","","",null,1000,1.3827364722469862E-4,6.1964039458579554E-4,0,0,0,0,2.3590743959651766E-23,5.5805225292766997E-39]
[]
[]
["Saved  29/03/2023: 15:47:53  Level Number: 5"]
[]
["BREAKTHROUGH RESULTS"]
[]
["Advanced"]
["Pollutant Linkage: Inert Restorati, Attenution Layer, Beenham Grange Formation",null,null,null,null,"Pollutant Linkage: Inert Restorati, Attenution Layer, Beenham Grange Formation, Groundwater ",null,null,null,null,"Pollutant Linkage: Inert Restorati, Attenution Layer, Beenham Grange Formation, River Enborne",null,null,null,null,"Pollutant Linkage: Inert Restorati, Attenution Layer, Beenham Grange Formation, Spring Ditch"]
["Concentrations in mg/L in Beenham Grange Formation",null,null,null,null,"Concentrations in mg/L in Groundwater ",null,null,null,null,"Concentrations in mg/L in River Enborne",null,null,null,null,"Concentrations in mg/L in Spring Ditch"]
[]
["Compared with EAL (GW) target concentration in mg/L",null,null,null,null,"Compared with EAL (GW) target concentration in mg/L",null,null,null,null,"Compared with EAL (River Enborne) target concentration in mg/L",null,null,null,null,"Compared with EAL (Spring Ditch) target concentration in mg/L"]
[null,0.39,1E-3,2.0000000000000001E-4,null,null,0.39,1E-3,2.0000000000000001E-4,null,null,0.39,1E-3,2.0000000000000001E-4,null,null,0.39,1E-3,2.0000000000000001E-4]
[]
["Time(years)","Species1","Species2","Species3",null,"Time(years)","Species1","Species2","Species3",null,"Time(years)","Species1","Species2","Species3",null,"Time(years)","Species1","Species2","Species3"]
[null,"Ammoniacal Nitrogen","Copper","Lead",null,null,"Ammoniacal Nitrogen","Copper","Lead",null,null,"Ammoniacal Nitrogen","Copper","Lead",null,null,"Ammoniacal Nitrogen","Copper","Lead"]
[10,"","","",null,10,"","","",null,10,"","","",null,10,1.4702632389328437E-13,0,0]
[20,"","","",null,20,"","","",null,20,"","","",null,20,8.927431944339794E-9,0,0]
[30,"","","",null,30,"","","",null,30,"","","",null,30,3.6178036348133091E-7,0,0]
[40,"","","",null,40,"","","",null,40,"","","",null,40,2.3189263897771632E-6,0,0]
[50,"","","",null,50,"","","",null,50,"","","",null,50,7.0646906636265918E-6,0,0]
[60,"","","",null,60,"","","",null,60,"","","",null,60,1.479706134260813E-5,0,0]
[70,"","","",null,70,"","","",null,70,"","","",null,70,2.4984608614842961E-5,0,0]
[80,"","","",null,80,"","","",null,80,"","","",null,80,3.684359219236707E-5,0,0]
[90,"","","",null,90,"","","",null,90,"","","",null,90,4.9622053116575036E-5,0,0]
[100,"","","",null,100,"","","",null,100,"","","",null,100,6.2709291931267638E-5,0,0]
[110,"","","",null,110,"","","",null,110,"","","",null,110,7.5653609153676071E-5,0,0]
[120,"","","",null,120,"","","",null,120,"","","",null,120,8.8143168145769443E-5,0,0]
[130,"","","",null,130,"","","",null,130,"","","",null,130,9.9976890012904582E-5,0,0]
[140,"","","",null,140,"","","",null,140,"","","",null,140,1.1103646975983673E-4,0,0]
[150,"","","",null,150,"","","",null,150,"","","",null,150,1.2126313262937486E-4,0,0]
[160,"","","",null,160,"","","",null,160,"","","",null,160,1.3063961562652355E-4,0,0]
[170,"","","",null,170,"","","",null,170,"","","",null,170,1.3917672977150369E-4,0,0]
[180,"","","",null,180,"","","",null,180,"","","",null,180,1.4690358206904817E-4,0,0]
[190,"","","",null,190,"","","",null,190,"","","",null,190,1.5386058646496209E-4,0,0]
[200,"","","",null,200,"","","",null,200,"","","",null,200,1.6009454368861887E-4,0,0]
[210,"","","",null,210,"","","",null,210,"","","",null,210,1.656552303565582E-4,0,0]
[220,"","","",null,220,"","","",null,220,"","","",null,220,1.7059307669624454E-4,0,0]
[230,"","","",null,230,"","","",null,230,"","","",null,230,1.7495762275299766E-4,0,0]
[240,"","","",null,240,"","","",null,240,"","","",null,240,1.7879652707522532E-4,0,0]
[250,"","","",null,250,"","","",null,250,"","","",null,250,1.8215496439976571E-4,0,0]
[260,"","","",null,260,"","","",null,260,"","","",null,260,1.8507529468364685E-4,0,0]
[270,"","","",null,270,"","","",null,270,"","","",null,270,1.8759691913417185E-4,2.6826484884680179E-40,0]
[280,"","","",null,280,"","","",null,280,"","","",null,280,1.8975626298064959E-4,0,0]
[290,"","","",null,290,"","","",null,290,"","","",null,290,1.9158684210615623E-4,0,0]
[300,"","","",null,300,"","","",null,300,"","","",null,300,1.9311938316661969E-4,1.4857581122079514E-38,0]
[310,"","","",null,310,"","","",null,310,"","","",null,310,1.9438197581973454E-4,9.199955833501278E-38,0]
[320,"","","",null,320,"","","",null,320,"","","",null,320,1.9540024214777211E-4,2.5103240885805382E-37,0]
[330,"","","",null,330,"","","",null,330,"","","",null,330,1.9619751299101206E-4,1.4548303780906289E-36,0]
[340,"","","",null,340,"","","",null,340,"","","",null,340,1.9679500422376057E-4,9.2331063666647793E-36,0]
[350,"","","",null,350,"","","",null,350,"","","",null,350,1.972119883741632E-4,4.0431333336823943E-35,0]
[360,"","","",null,360,"","","",null,360,"","","",null,360,1.9746595866431294E-4,1.3651436005382802E-34,0]
[370,"","","",null,370,"","","",null,370,"","","",null,370,1.9757278373944368E-4,3.9654516773028274E-34,0]
[380,"","","",null,380,"","","",null,380,"","","",null,380,1.9754685217918949E-4,1.0128277420539641E-33,0]
[390,"","","",null,390,"","","",null,390,"","","",null,390,1.9740120646002073E-4,2.1312147657848428E-33,0]
[400,"","","",null,400,"","","",null,400,"","","",null,400,1.9714766642556729E-4,3.078465284156711E-33,0]
[410,"","","",null,410,"","","",null,410,"","","",null,410,1.9679694257638386E-4,3.6385459481312333E-34,0]
[420,"","","",null,420,"","","",null,420,"","","",null,420,1.963587396547116E-4,0,0]
[430,"","","",null,430,"","","",null,430,"","","",null,430,1.9584185109302726E-4,0,0]
[440,"","","",null,440,"","","",null,440,"","","",null,440,1.9525424494440985E-4,0,0]
[450,"","","",null,450,"","","",null,450,"","","",null,450,1.9460314192822837E-4,0,0]
[460,"","","",null,460,"","","",null,460,"","","",null,460,1.9389508622030431E-4,0,0]
[470,"","","",null,470,"","","",null,470,"","","",null,470,1.9313600959197584E-4,0,0]
[480,"","","",null,480,"","","",null,480,"","","",null,480,1.9233128947903139E-4,0,0]
[490,"","","",null,490,"","","",null,490,"","","",null,490,1.9148580152073929E-4,1.7678513788499525E-30,0]
[500,"","","",null,500,"","","",null,500,"","","",null,500,1.9060396707655836E-4,6.5358253347123588E-30,0]
[510,"","","",null,510,"","","",null,510,"","","",null,510,1.8968979618476801E-4,1.5279662820106908E-29,0]
[520,"","","",null,520,"","","",null,520,"","","",null,520,1.8874692639569003E-4,2.7998618507258253E-29,0]
[530,"","","",null,530,"","","",null,530,"","","",null,530,1.8777865786971722E-4,4.1559923227609287E-29,0]
[540,"","","",null,540,"","","",null,540,"","","",null,540,1.8678798509924154E-4,4.7241020430621848E-29,0]
[550,"","","",null,550,"","","",null,550,"","","",null,550,1.8577762558312407E-4,2.8646916284542528E-29,0]
[560,"","","",null,560,"","","",null,560,"","","",null,560,1.8475004574234979E-4,0,0]
[570,"","","",null,570,"","","",null,570,"","","",null,570,1.8370748435318928E-4,0,0]
[580,"","","",null,580,"","","",null,580,"","","",null,580,1.82651973735364E-4,0,0]
[590,"","","",null,590,"","","",null,590,"","","",null,590,1.8158535891376576E-4,0,0]
[600,"","","",null,600,"","","",null,600,"","","",null,600,1.8050931495277168E-4,0,0]
[610,"","","",null,610,"","","",null,610,"","","",null,610,1.7942536264378234E-4,0,0]
[620,"","","",null,620,"","","",null,620,"","","",null,620,1.783348827006986E-4,0,0]
[630,"","","",null,630,"","","",null,630,"","","",null,630,1.7723912861445135E-4,0,0]
[640,"","","",null,640,"","","",null,640,"","","",null,640,1.7613923829320579E-4,8.4489543131626444E-28,0]
[650,"","","",null,650,"","","",null,650,"","","",null,650,1.7503624460883598E-4,3.7101488065152301E-27,0]
[660,"","","",null,660,"","","",null,660,"","","",null,660,1.7393108495185433E-4,7.9864683529162853E-27,0]
[670,"","","",null,670,"","","",null,670,"","","",null,670,1.7282460989460956E-4,1.3473703649338019E-26,0]
[680,"","","",null,680,"","","",null,680,"","","",null,680,1.7171759104700414E-4,1.9454615289514207E-26,0]
[690,"","","",null,690,"","","",null,690,"","","",null,690,1.7061072818077324E-4,2.4553876492940023E-26,0]
[700,"","","",null,700,"","","",null,700,"","","",null,700,1.6950465569484015E-4,2.6689432069691332E-26,0]
[710,"","","",null,710,"","","",null,710,"","","",null,710,1.6839994848332705E-4,2.3175013533198635E-26,0]
[720,"","","",null,720,"","","",null,720,"","","",null,720,1.6729712726332651E-4,1.1021913063832707E-26,0]
[730,"","","",null,730,"","","",null,730,"","","",null,730,1.6619666341434434E-4,0,0]
[740,"","","",null,740,"","","",null,740,"","","",null,740,1.6509898337394531E-4,0,0]
[750,"","","",null,750,"","","",null,750,"","","",null,750,1.6400447263453517E-4,0,0]
[760,"","","",null,760,"","","",null,760,"","","",null,760,1.6291347937483791E-4,0,0]
[770,"","","",null,770,"","","",null,770,"","","",null,770,1.618263177625863E-4,0,0]
[780,"","","",null,780,"","","",null,780,"","","",null,780,1.6074327096142772E-4,0,0]
[790,"","","",null,790,"","","",null,790,"","","",null,790,1.5966459386310106E-4,0,0]
[800,"","","",null,800,"","","",null,800,"","","",null,800,1.5859051557696256E-4,0,0]
[810,"","","",null,810,"","","",null,810,"","","",null,810,1.5752124169638205E-4,0,0]
[820,"","","",null,820,"","","",null,820,"","","",null,820,1.5645695636165767E-4,0,0]
[830,"","","",null,830,"","","",null,830,"","","",null,830,1.5539782414079236E-4,5.6174279801362864E-26,0]
[840,"","","",null,840,"","","",null,840,"","","",null,840,1.5434399174157781E-4,3.5859545208604896E-25,0]
[850,"","","",null,850,"","","",null,850,"","","",null,850,1.5329558957460931E-4,7.5071927036692484E-25,0]
[860,"","","",null,860,"","","",null,860,"","","",null,860,1.5225273317601211E-4,1.2158886451689747E-24,0]
[870,"","","",null,870,"","","",null,870,"","","",null,870,1.5121552450582604E-4,1.7220239356361098E-24,0]
[880,"","","",null,880,"","","",null,880,"","","",null,880,1.5018405313332249E-4,2.2208032980335126E-24,0]
[890,"","","",null,890,"","","",null,890,"","","",null,890,1.4915839731588639E-4,2.6485432670573385E-24,0]
[900,"","","",null,900,"","","",null,900,"","","",null,900,1.481386249888529E-4,2.9290463780815501E-24,0]
[910,"","","",null,910,"","","",null,910,"","","",null,910,1.4712479466240296E-4,2.9785098358655914E-24,0]
[920,"","","",null,920,"","","",null,920,"","","",null,920,1.4611695624501862E-4,2.7123828873319027E-24,0]
[930,"","","",null,930,"","","",null,930,"","","",null,930,1.4511515179492629E-4,2.053839874519506E-24,0]
[940,"","","",null,940,"","","",null,940,"","","",null,940,1.4411941620586573E-4,9.4332290379095994E-25,0]
[950,"","","",null,950,"","","",null,950,"","","",null,950,1.4312977783387763E-4,0,0]
[960,"","","",null,960,"","","",null,960,"","","",null,960,1.4214625906954834E-4,0,3.1795082152978117E-40]
[970,"","","",null,970,"","","",null,970,"","","",null,970,1.4116887686213892E-4,0,1.0165495789099555E-39]
[980,"","","",null,980,"","","",null,980,"","","",null,980,1.401976431979354E-4,0,2.1141172081452664E-39]
[990,"","","",null,990,"","","",null,990,"","","",null,990,1.3923256554001034E-4,0,3.6348746083642401E-39]
[1000,"","","",null,1000,"","","",null,1000,"","","",null,1000,1.3827364722469862E-4,0,5.5805225292766997E-39]
[]
[]
["Saved  29/03/2023: 16:00:39  Level Number: 5"]
[]
["BREAKTHROUGH RESULTS"]
[]
["Advanced"]
["Pollutant Linkage: Inert Restorati, Attenution Layer, Beenham Grange Formation",null,null,null,null,"Pollutant Linkage: Inert Restorati, Attenution Layer, Beenham Grange Formation, Groundwater ",null,null,null,null,"Pollutant Linkage: Inert Restorati, Attenution Layer, Beenham Grange Formation, River Enborne",null,null,null,null,"Pollutant Linkage: Inert Restorati, Attenution Layer, Beenham Grange Formation, Spring Ditch"]
["Concentrations in mg/L in Beenham Grange Formation",null,null,null,null,"Concentrations in mg/L in Groundwater ",null,null,null,null,"Concentrations in mg/L in River Enborne",null,null,null,null,"Concentrations in mg/L in Spring Ditch"]
[]
["Compared with EAL (GW) target concentration in mg/L",null,null,null,null,"Compared with EAL (GW) target concentration in mg/L",null,null,null,null,"Compared with EAL (River Enborne) target concentration in mg/L",null,null,null,null,"Compared with EAL (Spring Ditch) target concentration in mg/L"]
[null,0.39,1E-3,2.0000000000000001E-4,null,null,0.39,1E-3,2.0000000000000001E-4,null,null,0.39,1E-3,2.0000000000000001E-4,null,null,0.39,1E-3,2.0000000000000001E-4]
[]
["Time(years)","Species1","Species2","Species3",null,"Time(years)","Species1","Species2","Species3",null,"Time(years)","Species1","Species2","Species3",null,"Time(years)","Species1","Species2","Species3"]
[null,"Ammoniacal Nitrogen","Copper","Lead",null,null,"Ammoniacal Nitrogen","Copper","Lead",null,null,"Ammoniacal Nitrogen","Copper","Lead",null,null,"Ammoniacal Nitrogen","Copper","Lead"]
[10,1.3659304006155002E-12,0,0,null,10,1.3221290505387852E-12,0,0,null,10,9.6538269105331997E-15,0,0,null,10,1.4702632389328437E-13,0,0]
[20,7.9007511415990137E-8,0,0,null,20,7.8357525441043309E-8,0,0,null,20,5.9330407906915513E-10,0,0,null,20,8.927431944339794E-9,0,0]
[30,3.1726505568041582E-6,0,0,null,30,3.1609454783148524E-6,0,0,null,30,2.4098318499094379E-8,0,0,null,30,3.6178036348133091E-7,0,0]
[40,2.0270408931793556E-5,0,0,null,40,2.0228234668664234E-5,0,0,null,40,1.5458925899349857E-7,0,0,null,40,2.3189263897771632E-6,0,0]
[50,6.1661545072656191E-5,0,0,null,50,6.1579610613643647E-5,0,0,null,50,4.7113913770262634E-7,0,0,null,50,7.0646906636265918E-6,0,0]
[60,1.2904427335975438E-4,0,0,null,60,1.2892591426770842E-4,0,0,null,60,9.8700888700689017E-7,0,0,null,60,1.479706134260813E-5,0,0]
[70,2.1778032504161512E-4,0,0,null,70,2.1763497158508324E-4,0,0,null,70,1.6667576867921152E-6,0,0,null,70,2.4984608614842961E-5,0,0]
[80,3.2104536299985267E-4,0,0,null,80,3.2088340249227871E-4,0,0,null,80,2.4580873849758614E-6,0,0,null,80,3.684359219236707E-5,0,0]
[90,4.32296445539501E-4,0,0,null,90,4.3212685406341696E-4,0,0,null,90,3.3108116086262825E-6,0,0,null,90,4.9622053116575036E-5,0,0]
[100,5.462216275366799E-4,0,0,null,100,5.4605130083110057E-4,0,0,null,100,4.1841681708822416E-6,0,0,null,100,6.2709291931267638E-5,0,0]
[110,6.5889286432959803E-4,0,0,null,110,6.5872671101604313E-4,0,0,null,110,5.0480058882644038E-6,0,0,null,110,7.5653609153676071E-5,0,0]
[120,7.6759890805801223E-4,0,0,null,120,7.6744020056395096E-4,0,0,null,120,5.8815084817048001E-6,0,0,null,120,8.8143168145769443E-5,0,0]
[130,8.705918807773832E-4,0,0,null,130,8.7044264042011714E-4,0,0,null,130,6.6712524189457868E-6,0,0,null,130,9.9976890012904582E-5,0,0]
[140,9.6684377337113699E-4,0,0,null,140,9.6670510702840577E-4,0,0,null,140,7.4093392649266384E-6,0,0,null,140,1.1103646975983673E-4,0,0]
[150,1.0558442484084592E-3,0,0,null,150,1.0557166163533199E-3,0,0,null,150,8.0918442832001242E-6,0,0,null,150,1.2126313262937486E-4,0,0]
[160,1.1374439203853998E-3,0,0,null,160,1.1373273390834664E-3,0,0,null,160,8.7176137475396508E-6,0,0,null,160,1.3063961562652355E-4,0,0]
[170,1.2117374883676721E-3,0,0,null,170,1.2116316795362458E-3,0,0,null,170,9.2873679856617898E-6,0,0,null,170,1.3917672977150369E-4,0,0]
[180,1.278978702170902E-3,0,0,null,180,1.2788832001457357E-3,0,0,null,180,9.8030486954212957E-6,0,0,null,180,1.4690358206904817E-4,0,0]
[190,1.3395195856446248E-3,0,0,null,190,1.3394338134921884E-3,0,0,null,190,1.0267352420393639E-5,0,0,null,190,1.5386058646496209E-4,0,0]
[200,1.3937676528899992E-3,0,0,null,200,1.3936909755655677E-3,0,0,null,200,1.0683402121643336E-5,0,0,null,200,1.6009454368861887E-4,0,0]
[210,1.4421562498718513E-3,0,0,null,210,1.4420880107430412E-3,0,0,null,210,1.1054519492269275E-5,0,0,null,210,1.656552303565582E-4,0,0]
[220,1.4851243630182747E-3,0,0,null,220,1.4850639084479334E-3,0,0,null,220,1.138406993757165E-5,0,0,null,220,1.7059307669624454E-4,0,0]
[230,1.5231031975999553E-3,0,0,null,230,1.5230498930251513E-3,0,0,null,230,1.1675359519452724E-5,0,0,null,230,1.7495762275299766E-4,0,0]
[240,1.5565075604136696E-3,0,0,null,240,1.5564608004140263E-3,0,0,null,240,1.1931568779273049E-5,0,0,null,240,1.7879652707522532E-4,0,0]
[250,1.5857306250951695E-3,2.1144625444145953E-40,0,null,250,1.5856898392478031E-3,0,0,null,250,1.2155712527028268E-5,0,0,null,250,1.8215496439976571E-4,0,0]
[260,1.6111410569020581E-3,0,0,null,260,1.6111057127163541E-3,1.0716567484798526E-39,0,null,260,1.2350617743402796E-5,0,0,null,260,1.8507529468364685E-4,0,0]
[270,1.633081763460318E-3,8.9435850817785997E-40,0,null,270,1.6330513673144529E-3,0,0,null,270,1.2518913964469866E-5,0,0,null,270,1.8759691913417185E-4,2.6826484884680179E-40,0]
[280,1.6518697474716504E-3,4.7448501723630574E-38,0,null,280,1.6518438442110113E-3,0,0,null,280,1.2663032126855659E-5,0,0,null,280,1.8975626298064959E-4,0,0]
[290,1.6677966884796559E-3,2.5991694651202586E-37,0,null,290,1.6677748601440668E-3,7.796503582802297E-38,0,null,290,1.278520901096068E-5,0,0,null,290,1.9158684210615623E-4,0,0]
[300,1.6811299895838126E-3,1.5407790910919561E-36,0,null,300,1.6811118535950849E-3,4.2750549467509638E-37,0,null,300,1.2887495254892398E-5,0,0,null,300,1.9311938316661969E-4,1.4857581122079514E-38,0]
[310,1.6921141031993896E-3,9.8615823641802595E-36,0,null,310,1.6920993102395143E-3,1.3754060775484445E-36,0,null,310,1.2971765512056588E-5,4.2042755680147647E-39,0,null,310,1.9438197581973454E-4,9.199955833501278E-38,0]
[320,1.7009720061729769E-3,5.0004695368707683E-35,0,null,320,1.7009602379142771E-3,9.4655600831895456E-36,0,null,320,1.3039729756805462E-5,1.3144983186744897E-38,0,null,320,1.9540024214777211E-4,2.5103240885805382E-37,0]
[330,1.707906734830062E-3,2.0051481563081821E-34,0,null,330,1.7078977016266649E-3,5.8057029381266297E-35,0,null,330,1.3092945051657564E-5,4.8174714508960988E-38,0,null,330,1.9619751299101206E-4,1.4548303780906289E-36,0]
[340,1.7131029193795163E-3,6.7130087204192939E-34,0,null,340,1.713096357993979E-3,2.4902963291858713E-34,0,null,340,1.3132827310977894E-5,3.2500272298613185E-37,0,null,340,1.9679500422376057E-4,9.2331063666647793E-36,0]
[350,1.7167282776888481E-3,1.8948597754255009E-33,0,null,350,1.7167239491022804E-3,8.5124850109085826E-34,0,null,350,1.3160662754121949E-5,1.6669657712017853E-36,0,null,350,1.972119883741632E-4,4.0431333336823943E-35,0]
[360,1.7189350430202931E-3,4.3035306868160902E-33,0,null,360,1.7189327303540395E-3,2.5226259598282415E-33,0,null,360,1.3177618852855133E-5,6.2004751690419614E-36,0,null,360,1.9746595866431294E-4,1.3651436005382802E-34,0]
[370,1.7198613106814021E-3,6.7694416457772165E-33,0,null,370,1.7198608172464978E-3,6.4134010097269339E-33,0,null,370,1.3184754657488501E-5,1.8959941465922564E-35,0,null,370,1.9757278373944368E-4,3.9654516773028274E-34,0]
[380,1.7196322957177209E-3,1.9000048922880395E-33,0,null,380,1.719633443202369E-3,1.27904913972221E-32,0,null,380,1.3183030441189519E-5,5.1084598270619736E-35,0,null,380,1.9754685217918949E-4,1.0128277420539641E-33,0]
[390,1.7183614987707784E-3,0,0,null,390,1.7183641255647086E-3,1.523233662630055E-32,0,null,390,1.3173316640288007E-5,1.1909184783272916E-34,0,null,390,1.9740120646002073E-4,2.1312147657848428E-33,0]
[400,1.7161517806106026E-3,0,0,null,400,1.7161557402645365E-3,0,0,null,400,1.3156402094437623E-5,2.1716920970653047E-34,0,null,400,1.9714766642556729E-4,3.078465284156711E-33,0]
[410,1.7130963480595212E-3,0,0,null,410,1.7131015078743236E-3,0,0,null,410,1.3133001607345912E-5,2.1963347461836589E-34,0,null,410,1.9679694257638386E-4,3.6385459481312333E-34,0]
[420,1.7092796554437567E-3,0,0,null,420,1.7092858951818098E-3,0,0,null,420,1.3103762859845744E-5,0,0,null,420,1.963587396547116E-4,0,0]
[430,1.7047782265334497E-3,0,0,null,430,1.7047854372459923E-3,0,0,null,430,1.3069272713216763E-5,0,0,null,430,1.9584185109302726E-4,0,0]
[440,1.6996614023502758E-3,0,0,null,440,1.6996694853115436E-3,0,0,null,440,1.3030062944081995E-5,0,0,null,440,1.9525424494440985E-4,0,0]
[450,1.6939920203508008E-3,4.4809350287841864E-33,0,null,450,1.6940008860903332E-3,0,0,null,450,1.2986615452998321E-5,0,0,null,450,1.9460314192822837E-4,0,0]
[460,1.6878270304720262E-3,6.3009979245894855E-30,0,null,460,1.6878365978966006E-3,0,0,null,460,1.2939366988971192E-5,0,0,null,460,1.9389508622030431E-4,0,0]
[470,1.6812180532910438E-3,2.0864056908958637E-29,0,null,470,1.6812282488918129E-3,2.3986762004970629E-30,0,null,470,1.2888713429916695E-5,0,0,null,470,1.9313600959197584E-4,0,0]
[480,1.6742118853640003E-3,4.6705542214635855E-29,0,null,480,1.6742226424961053E-3,1.9321024156200274E-29,0,null,480,1.2835013658169557E-5,0,0,null,480,1.9233128947903139E-4,0,0]
[490,1.6668509564352328E-3,8.2253002795425808E-29,0,null,490,1.6668622146685549E-3,5.4913038011993225E-29,0,null,490,1.2778593066861927E-5,1.8992944570228955E-32,0,null,490,1.9148580152073929E-4,1.7678513788499525E-30,0]
[500,1.6591737429456929E-3,1.1493624286022671E-28,0,null,500,1.6591854474748452E-3,1.1344073326664894E-28,0,null,500,1.2719746731097515E-5,2.4186672846704259E-31,0,null,500,1.9060396707655836E-4,6.5358253347123588E-30,0]
[510,1.6512151418688835E-3,1.1348998621741869E-28,0,null,510,1.6512272429847546E-3,1.8720133964680646E-28,0,null,510,1.2658742274967613E-5,7.2063257598750583E-31,0,null,510,1.8968979618476801E-4,1.5279662820106908E-29,0]
[520,1.6430068086548573E-3,2.2497704878107354E-29,0,null,520,1.6430192612616799E-3,2.4345000051797587E-28,0,null,520,1.2595822463242352E-5,1.5326016133467098E-30,0,null,520,1.8874692639569003E-4,2.7998618507258253E-29,0]
[530,1.6345774626581242E-3,0,0,null,530,1.6345902258396031E-3,2.1058763355994304E-28,0,null,530,1.2531207543748542E-5,2.6206544271388061E-30,0,null,530,1.8777865786971722E-4,4.1559923227609287E-29,0]
[540,1.6259531631999413E-3,0,0,null,540,1.6259661998266836E-3,0,0,null,540,1.2465097364491417E-5,3.6270111769879587E-30,0,null,540,1.8678798509924154E-4,4.7241020430621848E-29,0]
[550,1.6171575590918424E-3,0,0,null,550,1.6171708354669162E-3,0,0,null,550,1.2397673287278664E-5,3.7010315808620703E-30,0,null,550,1.8577762558312407E-4,2.8646916284542528E-29,0]
[560,1.6082121141695548E-3,0,0,null,560,1.6082255997079456E-3,0,0,null,560,1.2329099917354736E-5,1.3662080073847187E-30,0,null,560,1.8475004574234979E-4,0,0]
[570,1.5991363112183687E-3,0,0,null,570,1.5991499781562947E-3,0,0,null,570,1.2259526667311126E-5,0,0,null,570,1.8370748435318928E-4,0,0]
[580,1.5899478363493309E-3,0,0,null,580,1.5899616594832512E-3,0,0,null,580,1.2189089171106605E-5,0,0,null,580,1.82651973735364E-4,0,0]
[590,1.5806627457580994E-3,0,0,null,590,1.580676702205797E-3,0,0,null,590,1.2117910562892078E-5,0,0,null,590,1.8158535891376576E-4,0,0]
[600,1.5712956165758614E-3,1.9206984784097302E-28,0,null,600,1.5713096855626163E-3,0,0,null,600,1.2046102633994768E-5,0,0,null,600,1.8050931495277168E-4,0,0]
[610,1.5618596833800779E-3,6.8700461560372725E-27,0,null,610,1.5618738460461807E-3,0,0,null,610,1.1973766879691364E-5,0,0,null,610,1.7942536264378234E-4,0,0]
[620,1.5523669617359796E-3,1.7714814948878848E-26,0,null,620,1.5523812009553333E-3,1.8352962267209297E-27,0,null,620,1.1900995446770975E-5,0,0,null,620,1.783348827006986E-4,0,0]
[630,1.5428283600555884E-3,3.2651714959675229E-26,0,null,630,1.5428426602841917E-3,1.5474229255534619E-26,0,null,630,1.1827871991328328E-5,0,0,null,630,1.7723912861445135E-4,0,0]
[640,1.5332537808999348E-3,5.0202906484098672E-26,0,null,640,1.5332681280267148E-3,3.6782729817366547E-26,0,null,640,1.1754472455640019E-5,0,0,null,640,1.7613923829320579E-4,8.4489543131626444E-28,0]
[650,1.5236522127547545E-3,6.6941521522762299E-26,0,null,650,1.523666593971895E-3,6.5182248476464738E-26,0,null,650,1.1680865772046684E-5,1.0171131891550208E-28,0,null,650,1.7503624460883598E-4,3.7101488065152301E-27,0]
[660,1.5140318131832179E-3,7.7159796412323337E-26,0,null,660,1.5140462168679271E-3,9.740343420729213E-26,0,null,660,1.1607114500586544E-5,3.5276275967656011E-28,0,null,660,1.7393108495185433E-4,7.9864683529162853E-27,0]
[670,1.5043999842164761E-3,7.295426970427499E-26,0,null,670,1.5044143998234095E-3,1.2660955956608593E-25,0,null,670,1.1533275407208899E-5,7.1679887566924004E-28,0,null,670,1.7282460989460956E-4,1.3473703649338019E-26,0]
[680,1.4947634407158135E-3,4.4919222135567538E-26,0,null,680,1.4947778586801813E-3,1.4197745125744022E-25,0,null,680,1.1459399988033783E-5,1.1723547988301065E-27,0,null,680,1.7171759104700414E-4,1.9454615289514207E-26,0]
[690,1.4851282723709802E-3,0,0,null,690,1.4851426840202812E-3,1.2908043287258542E-25,0,null,690,1.1385534944806847E-5,1.6551013881960404E-27,0,null,690,1.7061072818077324E-4,2.4553876492940023E-26,0]
[700,1.4754999999677541E-3,0,0,null,700,1.4755143974411267E-3,7.1372306216712733E-26,0,null,700,1.1311722616426932E-5,2.0474983897042868E-27,0,null,700,1.6950465569484015E-4,2.6689432069691332E-26,0]
[710,1.465883626448254E-3,0,0,null,710,1.4658980026231495E-3,0,0,null,710,1.1238001370495609E-5,2.1762782245901094E-27,0,null,710,1.6839994848332705E-4,2.3175013533198635E-26,0]
[720,1.4562836832829127E-3,0,0,null,720,1.4562980317101367E-3,0,0,null,720,1.1164405958981167E-5,1.8222853033114614E-27,0,null,720,1.6729712726332651E-4,1.1021913063832707E-26,0]
[730,1.4467042725751058E-3,0,0,null,730,1.4467185874194469E-3,0,0,null,730,1.1090967841093766E-5,7.4624235397675918E-28,0,null,730,1.6619666341434434E-4,0,0]
[740,1.4371491053281941E-3,0,0,null,740,1.4371633813108459E-3,0,0,null,740,1.1017715476740877E-5,0,0,null,740,1.6509898337394531E-4,0,0]
[750,1.4276215362119624E-3,0,0,null,750,1.4276357685653609E-3,0,0,null,750,1.0944674593178126E-5,0,0,null,750,1.6400447263453517E-4,0,0]
[760,1.4181245951748447E-3,0,0,null,760,1.4181387795930015E-3,0,0,null,760,1.0871868427410492E-5,0,0,null,760,1.6291347937483791E-4,0,0]
[770,1.4086610161886122E-3,0,0,null,770,1.4086751487873217E-3,0,0,null,770,1.0799317946673795E-5,0,0,null,770,1.618263177625863E-4,0,0]
[780,1.3992332634026653E-3,0,0,null,780,1.3992473406855945E-3,0,0,null,780,1.072704204894399E-5,0,0,null,780,1.6074327096142772E-4,0,0]
[790,1.3898435549351458E-3,6.7158533256160385E-26,0,null,790,1.3898575737568118E-3,0,0,null,790,1.0655057745459338E-5,0,0,null,790,1.5966459386310106E-4,0,0]
[800,1.3804938845292667E-3,1.0101690059200195E-24,0,null,800,1.3805078420647257E-3,0,0,null,800,1.0583380326747799E-5,0,0,null,800,1.5859051557696256E-4,0,0]
[810,1.3711860412771457E-3,2.2660482389559411E-24,0,null,810,1.3711999349918713E-3,2.5037128531737444E-25,0,null,810,1.0512023513936187E-5,0,0,null,810,1.5752124169638205E-4,0,0]
[820,1.3619216275790806E-3,3.7912376000259597E-24,0,null,820,1.3619354552068365E-3,1.8999731058596207E-24,0,null,820,1.0440999596393831E-5,0,0,null,820,1.5645695636165767E-4,0,0]
[830,1.3527020755011677E-3,5.4893686642391712E-24,0,null,830,1.3527158350214476E-3,4.0571816060805878E-24,0,null,830,1.0370319557266493E-5,0,0,null,830,1.5539782414079236E-4,5.6174279801362864E-26,0]
[840,1.3435286616864071E-3,7.2062625802892108E-24,0,null,840,1.3435423512954887E-3,6.6340804236267026E-24,0,null,840,1.0299993187794276E-5,5.2041329102214317E-27,0,null,840,1.5434399174157781E-4,3.5859545208604896E-25,0]
[850,1.3344025209415767E-3,8.7305661319773512E-24,0,null,850,1.3344161390428275E-3,9.4552615117341872E-24,0,null,850,1.0230029191489993E-5,2.9939973191350206E-26,0,null,850,1.5329558957460931E-4,7.5071927036692484E-25,0]
[860,1.3253246586361234E-3,9.8012458889409279E-24,0,null,860,1.3253382038147939E-3,1.2252198891782124E-23,0,null,860,1.0160435279232571E-5,6.1883015915768377E-26,0,null,860,1.5225273317601211E-4,1.2158886451689747E-24,0]
[870,1.3162959619888795E-3,1.0122609293716922E-23,0,null,870,1.3163094330023929E-3,1.4667247445914358E-23,0,null,870,1.0091218255845306E-5,9.9668114300521669E-26,0,null,870,1.5121552450582604E-4,1.7220239356361098E-24,0]
[880,1.3073172103856008E-3,9.3868146121317314E-24,0,null,880,1.3073306061420259E-3,1.6268919008111566E-23,0,null,880,1.0022384099205587E-5,1.4069673284038603E-25,0,null,880,1.5018405313332249E-4,2.2208032980335126E-24,0]
[890,1.2983890847738863E-3,7.3030318853373922E-24,0,null,890,1.2984024043250018E-3,1.6579113040612792E-23,0,null,890,9.9539380322560161E-6,1.8107410772240474E-25,0,null,890,1.4915839731588639E-4,2.6485432670573385E-24,0]
[900,1.2895121762674239E-3,3.6316003309258364E-24,0,null,900,1.2895254187903404E-3,1.5111796964156873E-23,0,null,900,9.885884589033116E-6,2.1568145093742746E-25,0,null,900,1.481386249888529E-4,2.9290463780815501E-24,0]
[910,1.2806869939585449E-3,0,0,null,910,1.2807001587511041E-3,1.1421350598950862E-23,0,null,910,9.818227674589322E-6,2.3840418106921688E-25,0,null,910,1.4712479466240296E-4,2.9785098358655914E-24,0]
[920,1.2719139720882076E-3,0,0,null,920,1.271927058552106E-3,5.1575365209461162E-24,0,null,920,9.7509706199413845E-6,2.4252355369432082E-25,0,null,920,1.4611695624501862E-4,2.7123828873319027E-24,0]
[930,1.2631934765737647E-3,0,7.9188691864514949E-40,null,930,1.2632064842096873E-3,0,0,null,930,9.6841162321483356E-6,2.2126280448460222E-25,0,null,930,1.4511515179492629E-4,2.053839874519506E-24,0]
[940,1.2545258109847102E-3,0,2.8108469780405608E-39,null,940,1.254538739382487E-3,0,3.4020267898339119E-40,null,940,9.6176668401448276E-6,1.6846150804760917E-25,0,null,940,1.4411941620586573E-4,9.4332290379095994E-25,0]
[950,1.2459112219959411E-3,0,6.391948640313992E-39,null,950,1.2459240708278217E-3,0,2.9093221484259624E-39,null,950,9.5516243365312831E-6,7.9335017037664825E-26,0,null,950,1.4312977783387763E-4,0,0]
[960,1.2373499043687821E-3,0,1.2085533388151579E-38,null,960,1.2373626733763212E-3,0,7.5568533033303033E-39,null,960,9.485990215802402E-6,0,0,null,960,1.4214625906954834E-4,0,3.1795082152978117E-40]
[970,1.2288420055095587E-3,0,2.0629395815126635E-38,null,970,1.2288546945074105E-3,0,1.4786798851328251E-38,null,970,9.420765609323961E-6,0,0,null,970,1.4116887686213892E-4,0,1.0165495789099555E-39]
[980,1.2203876296365064E-3,0,3.3326897673053823E-38,null,980,1.2204002384985293E-3,0,2.5025824486064549E-38,null,980,9.3559513172056488E-6,0,1.1036740556528802E-40,null,980,1.401976431979354E-4,0,2.1141172081452664E-39]
[990,1.2119868416007663E-3,0,5.2874494233228151E-38,null,990,1.2119993702590108E-3,0,3.8932574073386945E-38,null,990,9.2915478376749858E-6,0,2.1048091349986138E-40,null,990,1.3923256554001034E-4,0,3.6348746083642401E-39]
[1000,1.2036396703438636E-3,0,8.4872947253522398E-38,null,1000,1.2036521187797653E-3,0,5.8257577190794119E-38,null,1000,9.2275553936102676E-6,0,3.4209090689067677E-40,null,1000,1.3827364722469862E-4,0,5.5805225292766997E-39]
[]
[]
["Saved  27/03/2024: 21:12:03  Level Number: 5"]
[]
["BREAKTHROUGH RESULTS"]
[]
["Advanced"]
["Pollutant Linkage: Inert Restorati, Attenution Layer, Beenham Grange Formation",null,null,null,null,null,null,null,null,null,"Pollutant Linkage: Inert Restorati, Attenution Layer, Beenham Grange Formation, Groundwater "]
["Concentrations in mg/L in Beenham Grange Formation",null,null,null,null,null,null,null,null,null,"Concentrations in mg/L in Groundwater "]
[]
["Compared with EAL (GW) target concentration in mg/L",null,null,null,null,null,null,null,null,null,"Compared with EAL (GW) target concentration in mg/L"]
[null,4.82E-2,1E-3,2.0000000000000002E-5,1E-3,2.9999999999999997E-4,2.0000000000000002E-5,2E-3,1E-3,null,null,4.82E-2,1E-3,2.0000000000000002E-5,1E-3,2.9999999999999997E-4,2.0000000000000002E-5,2E-3,1E-3]
[]
["Time(years)","Species1","Species2","Species3","Species4","Species5","Species6","Species7","Species8",null,"Time(years)","Species1","Species2","Species3","Species4","Species5","Species6","Species7","Species8"]
[null,"Barium","Copper","Lead","Total Chromium","Cadmium","Mercury","Molybdenum","Antimony",null,null,"Barium","Copper","Lead","Total Chromium","Cadmium","Mercury","Molybdenum","Antimony"]
[10,1.6559652633350426E-5,0,0,0,0,0,0,0,null,10,1.8665233929760805E-6,0,0,0,0,0,0,0]
[20,3.4112500065442328E-3,0,0,0,0,0,0,0,null,20,1.9459905304966287E-3,0,0,0,0,0,0,0]
[30,1.7211847447061279E-2,0,0,0,0,0,0,0,null,30,1.3790182267921232E-2,0,0,0,0,0,0,0]
[40,3.4404474820638645E-2,0,0,0,0,0,4.782271568936099E-39,0,null,40,3.1034627641300078E-2,0,0,0,0,0,0,0]
[50,4.7861947907615332E-2,0,0,0,0,0,2.2418953791257439E-34,1.1164105619996338E-39,null,50,4.5519742588673952E-2,0,0,0,0,0,1.5409392033234951E-35,4.67590458532906E-40]
[60,5.5982290888148538E-2,5.0950103747595858E-33,0,0,0,0,1.4978146183401779E-31,4.3093192601393237E-36,null,60,5.470226129923475E-2,1.4261998114266865E-35,0,0,0,0,7.816964232477673E-32,2.9139987296267783E-36]
[70,5.9692715574283621E-2,3.2895294489083989E-31,0,0,0,0,0,8.4981750899741244E-33,null,70,5.9208101303288123E-2,5.2093481828453261E-32,0,0,0,0,0,6.538417422787362E-33]
[80,6.0384365079282715E-2,0,0,0,3.5746772547431977E-40,0,2.3810386795427268E-27,0,null,80,6.0418296336938966E-2,4.1085766070995606E-30,0,0,0,0,5.9207473489519915E-28,0]
[90,5.9210311086668313E-2,4.2486485452567403E-27,0,0,4.9469005094425974E-38,0,0,0,null,90,5.9553977223988669E-2,0,0,0,0,0,1.3157126876219603E-27,0]
[100,5.6972891197004528E-2,0,0,0,1.3382380794778782E-35,0,4.5172218329651212E-25,8.3196389600862919E-28,null,100,5.7486906332528682E-2,9.5992333247269686E-27,0,0,2.631346507049973E-36,0,0,7.8846779398337462E-28]
[110,5.4186550660988972E-2,0,0,0,1.1777747898790497E-33,0,5.3359003094376364E-25,0,null,110,5.4783578545701338E-2,3.764906882308983E-26,0,0,5.4022839552160982E-34,0,4.1501460643326456E-24,0]
[120,5.1165657754844614E-2,4.2483891617418055E-24,0,0,1.3624079396961984E-32,0,0,0,null,120,5.1793163156592228E-2,0,0,0,1.3918588371660684E-32,0,0,0]
[130,4.8095577883170537E-2,0,0,0,0,0,4.9417875952305243E-23,4.6994188934529146E-25,null,130,4.8723015512659798E-2,6.6954483786415649E-24,0,0,0,0,0,4.4417761694627657E-25]
[140,4.5081804608175749E-2,0,0,0,0,0,2.3089680751673897E-22,2.2509190854497457E-25,null,140,4.5692082010597476E-2,4.1058298624352158E-23,0,0,0,0,3.3454927290390598E-22,6.2658060094097774E-25]
[150,4.2181598548209312E-2,1.5907033520274108E-22,0,0,1.8840661172854031E-29,0,0,0,null,150,4.2765681529181233E-2,0,0,0,0,0,5.0888933769241215E-22,0]
[160,3.9423609537528319E-2,6.8841289618694725E-22,3.5242830482759419E-39,0,1.9751188514387541E-28,0,0,0,null,160,3.9977212479258291E-2,0,0,0,1.7064788595121851E-28,0,0,0]
[170,3.6819782088290169E-2,0,0,0,0,0,1.2538073319496099E-21,6.6904369015913382E-23,null,170,3.7341373143408692E-2,1.6999102758771744E-21,3.4174840866014392E-38,0,4.0556623741320445E-28,0,0,6.5607125386250226E-23]
[180,3.4372479989252108E-2,0,1.2991529032475348E-36,0,0,0,9.0587585062183367E-21,1.036966019332559E-22,null,180,3.4862092590610412E-2,4.9362280136484157E-21,0,0,0,0,7.8246033286244206E-21,1.2827100026999193E-22]
[190,3.2078709527126915E-2,0,1.7461528535314284E-35,0,0,0,9.7468083624152826E-21,0,null,190,3.2537240231155506E-2,0,4.1761256938937436E-36,0,0,0,2.5181778316403601E-20,0]
[200,2.9932603831970009E-2,1.1746866091489166E-20,3.1042498796451949E-34,0,3.1716556930333823E-26,0,4.6647122624464671E-21,0,null,200,3.0361400524116251E-2,0,2.3334546880119758E-35,0,7.0786211105181031E-27,0,1.0304369306574136E-20,0]
[210,2.79268732217599E-2,3.1138764795735366E-20,3.033589395980762E-33,0,1.3878698903799379E-25,0,1.0880255209534497E-19,0,null,210,2.8327495556764625E-2,0,4.5820229064358441E-34,0,1.3900674010770338E-25,0,0,0]
[220,2.6053643864677768E-2,2.6743839168037372E-20,1.8397825999692927E-32,0,9.5069741561402897E-26,0,9.2337063559877702E-19,1.7335107267438472E-21,null,220,2.6427725421596281E-2,6.2639961512656059E-20,5.208232124480078E-33,0,2.6428441576052461E-25,0,1.5895187677724539E-20,1.5854179046965218E-21]
[230,2.4304935942746023E-2,1.0871779780792797E-20,6.7048276381006148E-32,0,0,0,5.1194873406152412E-18,4.8174519273074327E-21,null,230,2.4654106243904503E-2,1.7742882133509139E-19,3.1386396818469598E-32,0,0,0,7.361252657041354E-19,5.0809381091131089E-21]
[240,2.2672930047679476E-2,1.9935242327148566E-19,4.3646750645497095E-32,0,0,0,2.3508594798766731E-17,5.154910375170787E-21,null,240,2.2998771694686622E-2,1.4060086213711332E-19,1.3337462742164452E-31,0,0,0,4.3064447844311444E-18,5.784547359768236E-21]
[250,2.1150109629278158E-2,1.5125802119463096E-18,0,0,0,0,9.5210710530968451E-17,1.7624312747811614E-21,null,250,2.1454135956097523E-2,0,2.6602657081672376E-31,0,0,0,1.9475514196714731E-17,1.253416003176634E-21]
[260,1.9729331265224047E-2,7.3623386281769812E-18,0,0,3.4336769099254841E-24,0,3.4692354491398599E-16,9.2456176491590037E-21,null,260,2.0012975906443013E-2,0,0,0,2.1645269903724082E-25,0,7.8180084915673067E-17,2.1808019762436401E-21]
[270,1.8403853230482322E-2,2.9628559134458407E-17,0,0,1.4316882407203867E-23,0,1.1499035903623076E-15,9.0526481521356877E-20,null,270,1.8668466542951664E-2,0,0,0,1.3076891785056118E-23,0,2.8464991749988326E-16,5.8756593627879835E-20]
[280,1.7167340289491913E-2,1.0649072761544157E-16,0,0,2.2300842099330765E-23,0,3.499631223339407E-15,4.5843342457254052E-19,null,280,1.7414189652612582E-2,2.866591771510331E-18,0,0,2.9469880308659532E-23,0,9.4623221957070662E-16,3.3993800245448293E-19]
[290,1.6013855234891655E-2,3.5043949135405369E-16,6.5681047523868909E-29,0,9.4379325076613548E-24,0,9.862740161804624E-15,1.7947399880822114E-18,null,290,1.6244127483389541E-2,1.3575869096412981E-17,0,0,2.8457968892555678E-23,0,2.8921865966936579E-15,1.3873571824311358E-18]
[300,1.4937843338317207E-2,1.0667742748082315E-15,4.1348978975419325E-28,0,0,0,2.5934368027563515E-14,6.1669606361705444E-18,null,300,1.5152648307626387E-2,4.8212366131187518E-17,3.5593342651860486E-30,0,0,0,8.1908356982918515E-15,4.862276822608636E-18]
[310,1.3934113303798063E-2,3.024693461856323E-15,1.1265895900766052E-27,0,0,0,6.4055075342666363E-14,1.9425427512589388E-17,null,310,1.4134487893492559E-2,1.5621360111570698E-16,4.8643331214373257E-28,0,0,0,2.1650646338822175E-14,1.5535226949883366E-17]
[320,1.299781680845578E-2,8.0368287976947507E-15,1.6333747475859102E-27,0,0,0,1.4947676464304423E-13,5.6980776094044848E-17,null,320,1.3184729222146323E-2,4.7634952741745411E-16,1.8338285788802079E-27,0,0,0,5.3764437535878254E-14,4.6154115544972496E-17]
[330,1.2124427816263326E-2,2.0124580223598909E-14,0,0,0,0,3.3126136831290439E-13,1.5678675127127723E-16,null,330,1.2298781783407741E-2,1.3680778605333701E-15,3.7909630340499237E-27,0,0,0,1.2615506830068981E-13,1.2852686112252113E-16]
[340,1.1309722328552818E-2,4.7734718564067693E-14,0,3.7858786432500441E-40,7.714176502379372E-23,0,7.0035126771321005E-13,4.0675978737487396E-16,null,340,1.1472361201767997E-2,3.6998353640316194E-15,3.485191478119507E-27,1.1544228951369699E-40,0,0,2.8112734144742272E-13,3.3720391514144964E-16]
[350,1.0549758929587431E-2,1.0774777962024621E-13,0,2.106078881050807E-39,4.3480832240834541E-22,0,1.418255383593969E-12,9.9953508874187687E-16,null,350,1.0701469601373999E-2,9.445591857135692E-15,0,2.2930332819926452E-39,3.4795985139469676E-22,0,5.9763505332613993E-13,8.3728135398514368E-16]
[360,9.8408603000050849E-3,2.3240020902286791E-13,0,0,8.3617448563832121E-22,0,2.7608177631017091E-12,2.3363723892190598E-15,null,360,9.9823769124719637E-3,2.2853650802035603E-14,0,2.4272873851459329E-39,8.9476448780543826E-22,0,1.2168284523605744E-12,1.9760095967860513E-15]
[370,9.1795957712122074E-3,4.8074555018537217E-13,0,0,1.0805795813148872E-21,0,5.1826234111344996E-12,5.2153331556798684E-15,null,370,9.31160321042049E-3,5.2623799007763601E-14,0,0,1.3481619317739703E-21,0,2.3813304252691517E-12,4.4502065317672425E-15]
[380,8.5627649317373978E-3,9.5691357074955025E-13,2.0143909883725594E-26,0,9.681586960916198E-22,0,9.4086779647953021E-12,1.1157793114862723E-14,null,380,8.685902107350079E-3,1.1577848927710927E-13,0,0,1.3956793042953043E-21,0,4.4934533323124522E-12,9.5991650192641887E-15]
[390,7.9873822621459763E-3,1.8381883790962632E-12,2.1969311171452086E-25,1.8590200379073004E-37,4.7122906856051899E-22,0,1.6560989642945713E-11,2.2953138420507407E-14,null,390,8.1022451789738471E-3,2.4425840334603852E-13,0,1.0942546469953733E-37,8.0586833410717495E-22,0,8.198647456722312E-12,1.9897039005047122E-14]
[400,7.4506627608167605E-3,3.416803310415622E-12,5.658722235451607E-25,8.2224458531554825E-37,1.3729399028158122E-25,0,2.83284942391832E-11,4.5535150926998095E-14,null,400,7.5578073909188699E-3,4.9572720467201833E-13,1.6407752813560411E-25,6.9339405401153077E-37,0,0,1.4501487021884259E-11,3.9750669333797664E-14]
[410,6.9500085076047192E-3,6.1603143999031271E-12,9.5385122787839718E-25,2.3935021613424011E-36,8.3629894573590651E-22,0,4.7189309967894648E-11,8.7345806372434485E-14,null,410,7.0499534738159104E-3,9.7064357862127599E-13,7.4462301986187569E-25,1.9728135616801757E-36,0,0,2.492236342312344E-11,7.6749241155462124E-14]
[420,6.4829961175880491E-3,1.0796425432302369E-11,1.08273947438785E-24,7.7810993117627701E-36,5.9534485778505325E-21,0,7.6694512667848168E-11,1.6239317753014281E-13,null,420,6.5762251992104595E-3,1.8383514584102613E-12,1.6131732614195201E-24,5.4685102124468266E-36,0,0,4.1703680595676528E-11,1.4356135206640455E-13]
[430,6.047365025366438E-3,1.8429144542444203E-11,4.5410168066824579E-25,3.0139073615481147E-35,2.1738005158060255E-20,0,1.2182242488111682E-10,2.9326941064124477E-13,null,430,6.1343294975047657E-3,3.3757418857185734E-12,2.4021132946749082E-24,2.0604260275799209E-35,5.8177465596708587E-21,0,6.8074655334480468E-11,2.607327094551367E-13]
[440,5.6410065544795643E-3,3.069409569155357E-11,0,1.1068354119115645E-34,6.1635370327484223E-20,0,1.8941177920271844E-10,5.1546116985520486E-13,null,440,5.7221273701314451E-3,6.0229308185786875E-12,2.2988007296465654E-24,8.1188243951180694E-35,2.509039797687231E-20,0,1.0858375235354673E-10,4.6070275984918999E-13]
[450,5.2619537140488485E-3,4.9961624420108401E-11,0,3.5079206294556579E-34,1.5362995146862113E-19,0,2.8868103741144799E-10,8.83356621030112E-13,null,450,5.3376235415461045E-3,1.0461343162101791E-11,1.4341568282930048E-25,2.7495457895084287E-34,7.2505785505130751E-20,0,1.6950728749860954E-10,7.9342933358047768E-13]
[460,4.9083716837876939E-3,7.9596962703616766E-11,0,9.6863639067935587E-34,3.5493315662901514E-19,0,4.3183963906883423E-10,1.4784273502112046E-12,null,460,4.9789568062662574E-3,1.772055047184629E-11,0,7.9341835382641111E-34,1.7937920418567537E-19,0,2.5934179512800154E-10,1.3340843999395833E-12]
[470,4.5785489319451486E-3,1.242870939177568E-10,0,2.4002728828247232E-33,7.7963632611483815E-19,0,6.347950582457915E-10,2.4201373809300081E-12,null,470,4.6443910204777023E-3,2.9321125844885759E-11,0,2.0244434779206294E-33,4.0937191352558305E-19,0,3.8938638567921275E-10,2.1933581808699192E-12]
[480,4.2708889338649988E-3,1.9044403620415432E-10,0,5.44406793843424E-33,1.6488555469655921E-18,0,9.1795732810956153E-10,3.8802010251015261E-12,null,480,4.3323067006891371E-3,4.7461596889971939E-11,0,4.7112001937315723E-33,8.8889511724330407E-19,0,5.7441955053366356E-10,3.5309795979677866E-12]
[490,3.9839024430959229E-3,2.8669400367370483E-10,0,1.1317237533543296E-32,3.3786932727861669E-18,0,1.3071402304908921E-9,6.1008727920461237E-12,null,490,4.0411931845096604E-3,7.5258237308436771E-11,0,1.0108218417582366E-32,1.8618797873440104E-18,0,8.3347275969253015E-10,5.5731244776260066E-12]
[500,3.7162002848092081E-3,4.2446128755759348E-10,8.1493063885249766E-24,2.1174578387799823E-32,6.7300056546865955E-18,0,1.834555732931053E-9,9.4180020919481044E-12,null,500,3.7696413202390699E-3,1.1704688304993001E-10,0,1.9772872397538466E-32,3.7852528368106141E-18,0,1.1907008180075053E-9,8.6344352005347526E-12]
[510,3.4664866298527749E-3,6.1865471761289413E-10,3.7095551317180844E-23,3.4147176695008891E-32,1.3056552974958039E-17,0,2.5398955865075461E-9,1.4289619323247455E-11,null,510,3.5163366438826175E-3,1.787561402553039E-10,0,3.4112855220650242E-32,7.4905886474458958E-18,0,1.6763463854490547E-9,1.314541281193914E-11]
[520,3.2335527240812093E-3,8.8846322843307018E-10,7.5961279848751668E-23,4.2492593117808202E-32,2.4705918217302744E-17,0,3.4714913716012666E-9,2.1330834882141855E-11,null,520,3.2800530188005048E-3,2.6836122923708113E-10,2.9701781448036585E-23,4.8234264164679833E-32,1.4450616301027199E-17,0,2.3277934213719616E-9,1.9685961657279098E-11]
[530,3.0162710362020826E-3,1.2582653923117539E-9,1.1703013879470017E-22,2.24161609896803E-32,4.5652140890444314E-17,0,4.6875417885759573E-9,3.1355826055349191E-11,null,530,3.0596466992431738E-3,3.9642725422730972E-10,9.5390547894912002E-23,4.3392973249664548E-32,2.7207877830047116E-17,0,3.1907016791789411E-9,2.9025864611879745E-11]
[540,2.8135898003429677E-3,1.7586558307072461E-9,1.4665264717131577E-22,0,8.2472095240652217E-17,0,6.2573937200236992E-9,4.5427656807796038E-11,null,540,2.8540507944081134E-3,5.7674988968845175E-10,1.7752354617359775E-22,0,5.0048410591148596E-17,0,4.3202118502685803E-9,4.2172941918297148E-11]
[550,2.6245279253517381E-3,2.427589232789868E-9,1.4649687610270713E-22,0,1.4582121124412604E-16,0,8.2628616125460566E-9,6.4916621184048153E-11,null,550,2.6622701043889987E-3,8.2710033310176185E-10,2.5710144033856528E-22,0,9.0037653168420231E-17,0,5.7822086212021524E-9,6.0429597374830573E-11]
[560,2.4481702451583892E-3,3.3116403537122663E-9,9.6850647279899722E-23,0,2.5262031396252676E-16,0,1.0799568096358151E-8,9.1567722360846624E-11,null,560,2.4833763025830266E-3,1.1700799089540466E-9,3.0410869693807312E-22,0,1.5858083097954432E-16,0,7.6546268410659422E-9,8.545838189713384E-11]
[570,2.2836630888414221E-3,4.4673759047684889E-9,0,0,4.2923634712254511E-16,0,1.3978287522082897E-8,1.2757779719710383E-10,null,570,2.3165034418279264E-3,1.6340879508948347E-9,2.8138242513102509E-22,0,2.7372799264968885E-16,0,1.0028784258856833E-8,1.1935710699373181E-10]
[580,2.1302101493230054E-3,5.9628317529515421E-9,0,0,7.1602775142236644E-16,0,1.7926273271771953E-8,1.7568267218201605E-10,null,580,2.1608437635772153E-3,2.254404582815634E-9,1.523377986113659E-22,0,4.6351684353273377E-16,0,1.3010722930031989E-8,1.6474392103662027E-10]
[590,1.9870686280184587E-3,7.8790863888219229E-9,0,0,1.1737323795802674E-15,0,2.2788549305818838E-8,2.3925459352316075E-10,null,590,2.015643787638478E-3,3.0743878189631171E-9,0,0,7.7073674513744321E-16,0,1.6722540438023808E-8,2.2485262175879362E-10]
[600,1.853545638853045E-3,1.0311919266346151E-8,0,0,1.892303915253551E-15,0,2.8729146435025503E-8,3.2241001495211797E-10,null,600,1.8802006636031267E-3,4.1467820694291258E-9,0,0,1.2596067833070307E-15,0,2.1303691545852503E-8,3.0363832225309442E-10]
[610,1.7289948558094877E-3,1.3373540428428557E-8,0,0,3.0029533389387973E-15,0,3.5932264240868435E-8,4.3012765538480229E-10,null,610,1.7538587711548679E-3,5.5351327360958695E-9,0,0,2.0249914785260453E-15,0,2.6912240785620703E-8,4.0589341851555167E-10]
[620,1.6128133821967699E-3,1.7194375861999204E-8,0,0,4.694326095019973E-15,0,4.4603340379334012E-8,5.6837655895185384E-10,null,620,1.636006543395789E-3,7.315299182441739E-9,0,0,3.204930979920342E-15,0,3.3726046797046524E-8,5.3737362830354347E-10]
[630,1.5044388345767726E-3,2.1924891322853918E-8,0,3.2896739705299045E-30,7.2339437142989301E-15,0,5.497001015810071E-8,7.4425370640998576E-10,null,630,1.5260735095392469E-3,9.5770560243536133E-9,0,0,4.9974394251198015E-15,0,4.1943859916211028E-8,7.0493368803407175E-10]
[640,1.4033466191045996E-3,2.7737435969530463E-8,0,3.2156267209140378E-29,1.0996260496167676E-14,0,6.7282940730235642E-8,9.6613054390297911E-10,null,640,1.4235275319127885E-3,1.2425770480369814E-8,0,2.0162658066934016E-29,7.6827259342243881E-15,0,5.1786315558846129E-8,9.1667211097733498E-10]
[650,1.3090473924415201E-3,3.4828086073868896E-8,0,8.7489383248869476E-29,1.6498930437050035E-14,0,8.1816525952306723E-8,1.2438076167062121E-9,null,650,1.3278722299261067E-3,1.5984141494965047E-8,0,6.9672054623892838E-29,1.1652217107719393E-14,0,6.3496807297935426E-8,1.1820842303819165E-9]
[660,1.2210846929478589E-3,4.3418468349991918E-8,5.7238569453191503E-22,1.7866180918600249E-28,2.4449145053809637E-14,0,9.8869429860614503E-8,1.5886763259749473E-9,null,660,1.2386445781822294E-3,2.0393984556569715E-8,0,1.5593034603336596E-28,1.7446006801891042E-14,0,7.7342225157042662E-8,1.5122225794707437E-9]
[670,1.1390327317849897E-3,5.3757542069962966E-8,1.7715847356157685E-21,3.106965868933932E-28,3.5802186373139873E-14,0,1.1876496877513982E-7,2.0138866692950041E-9,null,670,1.1554126642319249E-3,2.5818044613441693E-8,0,2.8738043947317631E-28,2.5800626408469585E-14,0,9.3613546479368133E-8,1.9198635002203153E-9]
[680,1.0624943308820232E-3,6.6123319110886349E-8,3.1905887230300719E-21,4.7735768899255395E-28,5.1834637557090305E-14,0,1.4185132419647514E-7,2.5345196842443877E-9,null,680,1.0777735987257655E-3,3.2441818276421971E-8,1.5109679992701374E-21,4.6323249898892505E-28,3.7709314050286786E-14,0,1.1262626873736735E-7,2.4196787278132748E-9]
[690,9.9109900148590261E-4,8.0824501394024984E-8,4.6838919673797916E-21,6.5159266948250246E-28,7.4235001996963427E-14,0,1.685015808683093E-7,3.1677631909554496E-9,null,690,1.0053515649381679E-3,4.0475365609603555E-8,3.7987776239699572E-21,6.638270402864125E-28,5.4497260344172366E-14,0,1.3472067576845303E-7,3.0284105704824214E-9]
[700,9.2450114998338356E-4,9.8202015813673239E-8,6.0530425883620047E-21,7.7431938691455669E-28,1.0521479505613609E-13,0,1.9911358659192481E-7,3.9330893270186395E-9,null,700,9.3779599948797779E-4,5.0155091260082691E-8,6.3970990189679495E-21,8.3856473114412462E-28,7.7914617177704274E-14,0,1.602619311100872E-7,3.7650491974552906E-9]
[710,8.6237840521745585E-4,1.1863042768800594E-7,7.0649517143609191E-21,7.4387937994710415E-28,1.4764348513133932E-13,0,2.3410963255856821E-7,4.8524322876205736E-9,null,710,8.7477989518805498E-4,6.17454744692168E-8,9.0069245712258806E-21,8.9338637078669484E-28,1.1025036904628714E-13,0,1.8963999431647274E-7,4.6510104626093053E-9]
[720,8.0443005786191737E-4,1.4251921496696105E-7,7.4808968029462947E-21,4.1003578892105906E-28,2.0521096594358128E-13,0,2.7393595507393917E-7,5.9503646266296851E-9,null,720,8.1599821853353552E-4,7.5540727634703059E-8,1.1242770348057372E-20,6.8144995678569758E-28,1.544704779989557E-13,0,2.2326935832680399E-7,5.7103126294420628E-9]
[730,7.503756056247801E-4,1.7031388687073357E-7,7.0955318000122428E-21,0,2.8262153317421783E-13,0,3.1906206155479346E-7,7.2542704409403616E-9,null,730,7.6116643339511967E-4,9.1866363542260133E-8,1.2668697536199926E-20,2.3682358106143562E-30,2.1438401671359547E-13,0,2.6158860808369981E-7,6.9697503246701716E-9]
[740,6.9995339404103668E-4,2.0249693227142851E-7,5.784869981355655E-21,0,3.8582360870293471E-13,0,3.6997988555415949E-7,8.7945137507519684E-9,null,740,7.1001912241363131E-4,1.1108065213814435E-7,1.2849198728293469E-20,0,2.9484129285427515E-13,0,3.0505980263681046E-7,8.4590640332872024E-9]
[750,6.5291935153542627E-4,2.3958858493308598E-7,3.5625559315271067E-21,0,5.2227969769056151E-13,0,4.2720277729753713E-7,1.060460040209613E-8,null,750,6.6230870446337534E-4,1.3357594874405566E-7,1.1411316622810208E-20,0,4.0196823462559806E-13,0,3.5416768488255922E-7,1.0211103456837427E-8]
[760,6.0904580669266602E-4,2.8214739465448949E-7,6.4505329204186971E-22,0,7.0128127060059361E-13,0,4.9126433777109144E-7,1.2721331853907979E-8,null,760,6.178042338341839E-4,1.5977987689481994E-7,8.1133058629952234E-21,0,5.4344154525702406E-13,0,4.0941872486341313E-7,1.2261983088153389E-8]
[770,5.6812038661340316E-4,3.3077059537804624E-7,0,0,9.3431342727942385E-13,0,5.6271710578250612E-7,1.5184949268960771E-8,null,770,5.7629028356244417E-4,1.9015635047392208E-7,2.9150473726603464E-21,0,7.2880933608287111E-13,0,4.7134000416088687E-7,1.4651228408632561E-8]
[780,5.2994498958679431E-4,3.8609426340098751E-7,0,0,1.2354743171831307E-12,0,6.4213110860837161E-7,1.8039266404429558E-8,null,780,5.3756590326466103E-4,2.2520642149783883E-7,0,0,9.6986210729689226E-13,0,5.4047795035231235E-7,1.7421911186730819E-8]
[790,4.9433482509423374E-4,4.4879326091828346E-7,0,0,1.6219543531312957E-12,0,7.3009228784557709E-7,2.1331789891843234E-8,null,790,5.0144364500358176E-4,2.6546894172129935E-7,0,0,1.2810590561954588E-12,0,6.1739693175362765E-7,2.0620772446902408E-8]
[800,4.6111751964827719E-4,5.1958096220853278E-7,0,0,2.1145802607263412E-12,0,8.2720081289786909E-7,2.5113825605660278E-8,null,800,4.6774865637038012E-4,3.1152102816613132E-7,0,0,1.6800147492545345E-12,1.1679500349519476E-40,7.0267772373391386E-7,2.4298331784684639E-8]
[810,4.3013228286694412E-4,5.9920876181581474E-7,9.3053093599147865E-21,0,2.7384289478156021E-12,0,9.3406929515664232E-7,2.9440569942457436E-8,null,810,4.3631783484365875E-4,3.6397832468081069E-7,0,0,2.1880511919542545E-12,0,7.9691585876185603E-7,2.8508981823832772E-8]
[820,4.0122912889984909E-4,6.8846536605637258E-7,3.17026882018884E-20,0,3.5235160550831138E-12,0,1.0513209163822995E-6,3.4371184966475627E-8,null,820,4.0699903750296716E-4,4.2349505368225349E-7,0,0,2.8308202650007714E-12,0,9.0071987303125223E-7,3.3311066743089068E-8]
[830,3.7426815008866489E-4,7.8817587106623391E-7,7.1957296938312714E-20,0,4.5055638580779226E-12,0,1.1795874850684133E-6,3.9968856519714243E-8,null,830,3.7965034506216416E-4,4.9076385428349228E-7,0,0,3.6390013646105301E-12,0,1.0147094630181584E-6,3.8766943941012481E-8]
[840,3.4911884001641703E-4,8.9920063238534395E-7,1.3924438305266593E-19,2.1495679930671962E-26,5.7268529318435423E-12,0,1.319507434684562E-6,4.6300834543612556E-8,null,840,3.5413937402574728E-4,5.6651540504112237E-7,0,9.689874071474684E-27,4.6490788859790499E-12,0,1.1395135656528755E-6,4.4943028055006779E-8]
[850,3.2565946165123087E-4,1.022433932729221E-6,2.4687542428505341E-19,6.2432564337187246E-26,7.2371616620516867E-12,6.7673928312071547E-40,1.4717237776576419E-6,5.3438455012383279E-8,null,850,3.3034263689264053E-4,6.5151783153751622E-7,1.1111170062555892E-20,4.8375287094951648E-26,5.9042039222099445E-12,0,1.2757683759562361E-6,5.1909816703022557E-8]
[860,3.0377645887829524E-4,1.1588024561178503E-6,4.141664371648813E-19,1.1930164328536556E-25,9.0947972925136839E-12,2.5178651105089977E-39,1.6368820287774625E-6,6.1457143033123073E-8,null,860,3.0814494450087567E-4,7.4657590092094272E-7,5.9362146971060456E-20,1.0426614038918997E-25,7.4551442162008453E-12,0,1.4241153160017577E-6,5.9741897471211142E-8]
[870,2.8336390557832968E-4,1.3092635779035246E-6,6.6909525137897468E-19,1.9171865557863555E-25,1.13677217405718E-11,5.6845980573991373E-39,1.8156281114142144E-6,7.0436396822910127E-8,null,870,2.8743884752012835E-4,8.5253000734071625E-7,1.3862993616110212E-19,1.7790956814318455E-25,9.3613260017396854E-12,7.6617265998185442E-40,1.5851989689360114E-6,6.8517935826038621E-8]
[880,2.6432299325222233E-4,1.4748034814581411E-6,1.052031755291312E-18,2.7645635715727783E-25,1.4134774892612916E-11,1.041916987093602E-38,2.0086062595265196E-6,8.0459752426344234E-8,null,880,2.6812411644442692E-4,9.7025495391680561E-7,2.6251920407703237E-19,2.6712617486376551E-25,1.1691970904901238E-11,4.6826139570580465E-39,1.7596649915316815E-6,7.8320643783127123E-8]
[890,2.4656155299801317E-4,1.6564351133416242E-6,1.6209113497356059E-18,3.6653125704793414E-25,1.748699751620741E-11,1.6990881237455337E-38,2.2164569279330741E-6,9.1614729186677406E-8,null,890,2.5010725693167939E-4,1.1006585384591703E-6,4.5056209318117476E-19,3.6598185629970165E-25,1.4527330551308583E-11,1.1198096959760529E-38,1.948158018375074E-6,8.9236729315634708E-8]
[900,2.2999360993562675E-4,1.8551959896752547E-6,2.4583306996949177E-18,4.5044832839323926E-25,2.1529055298430715E-11,2.6204296435175134E-38,2.4398147227318845E-6,1.0399275612830462E-7,null,900,2.3330105780126431E-4,1.2446799515900092E-6,7.3091687954115623E-19,4.6386883013423074E-25,1.7960020943441006E-11,2.0076311347707926E-38,2.1513195703157278E-6,1.0135682663075688E-7]
[910,2.1453896530077029E-4,2.0721458671875264E-6,3.6811812559842461E-18,5.1177515913300967E-25,2.6380764847807639E-11,4.0569439104761505E-38,2.6793063630924518E-6,1.1768907954657772E-7,null,910,2.1762416692771341E-4,1.403287997213653E-6,1.14415929200437E-18,5.4487346852914087E-25,2.2096458040285474E-11,3.0373303046012477E-38,2.3697859792442756E-6,1.1477540758253988E-7]
[920,2.0012281057264159E-4,2.3083642929880147E-6,5.4536055697320943E-18,5.2923113365586629E-25,3.2178721786724777E-11,6.6414275538082494E-38,2.9355486849304717E-6,1.3280265223152188E-7,null,920,2.0300069992890349E-4,1.577479146418032E-6,1.7485338997559334E-18,5.876307437572045E-25,2.705839529535181E-11,4.1129782463026138E-38,2.6041863406289486E-6,1.2959067462144403E-7]
[930,1.8667536313723277E-4,2.5649480475617282E-6,8.0042705583278002E-18,4.7747076867559342E-25,3.9078030319285677E-11,1.1716724257307137E-37,3.2091466962143602E-6,1.4943600487409234E-7,null,930,1.8935987083194415E-4,1.7682754368757473E-6,2.6271395204218147E-18,5.6586701323730994E-25,3.2984563195140776E-11,5.3309449615946835E-38,2.8551405045444342E-6,1.4590443580497681E-7]
[940,1.7413152953432752E-4,2.8430084957674001E-6,1.1649207825164203E-17,3.2870875312171581E-25,4.7254132894076666E-11,2.1793586947161828E-37,3.5006916928595103E-6,1.6769510031632463E-7,null,940,1.766356499662139E-4,1.9767222306402676E-6,3.8976563893732475E-18,4.4980890180006711E-25,4.0032410095836097E-11,7.3433496265007775E-38,3.1232571151815007E-6,1.6382196250839859E-7]
[950,1.6243059091883196E-4,3.1436688607768696E-6,1.6821781953694854E-17,5.5275276551195055E-26,5.6904737800038529E-11,4.1140157438802012E-37,3.8107594433502451E-6,1.8768917140948865E-7,null,950,1.6476644547409105E-4,2.203885843906134E-6,5.7253894343105903E-18,2.0858272388613089E-25,4.8379942888918715E-11,1.191424537425272E-37,3.4091317080434498E-6,1.8345183057934167E-7]
[960,1.5151590792870332E-4,3.4680614359153257E-6,2.4111722315110485E-17,0,6.8251841744669663E-11,7.6501609950076928E-37,4.139908449401594E-6,2.0953054333670492E-7,null,960,1.5369480342310057E-4,2.4508510628230063E-6,8.3406077236190282E-18,0,5.8227665244501708E-11,2.265721810627722E-37,3.7133448732278249E-6,2.0490574577468807E-7]
[970,1.4133464743337843E-4,3.8173247492648246E-6,3.4315602132094988E-17,0,8.1543843675164124E-11,1.379608598858901E-36,4.4886782891412286E-6,2.3333444133815279E-7,null,970,1.4336713086393231E-4,2.7187185598283563E-6,1.2061412076371924E-17,0,6.98006103924714E-11,4.5907073031484576E-37,4.0364604923678796E-6,2.2829835440193602E-7]
[980,1.3183752617079765E-4,4.1926006956840604E-6,4.8501680992100273E-17,0,9.7057745322823606E-11,2.3998539934516794E-36,4.8575880484653283E-6,2.5921878484782344E-7,null,980,1.3373343575625321E-4,3.0086022251976511E-6,1.7323668824033661E-17,0,8.3350464614092345E-11,9.165884120218993E-37,4.3790240559787699E-6,2.5374704016032567E-7]
[990,1.2297857330089454E-4,4.595031650586109E-6,6.8092655176113878E-17,0,1.1510143318691458E-10,4.0275930381152345E-36,5.247134845407501E-6,2.873039691107686E-7,null,990,1.247470862766803E-4,3.3216264286115657E-6,2.4719916496901699E-17,0,9.9157776838492248E-11,1.7452602759574977E-36,4.741561067125443E-6,2.8137170823921188E-7]
[1000,1.1471490615408612E-4,5.0257575794146266E-6,9.4970596369550067E-17,0,1.3601603593360482E-10,6.5395768311646122E-36,5.6577924515635133E-6,3.1771263539906897E-7,null,1000,1.1636458303941618E-4,3.6589232255165399E-6,3.5049593330513867E-17,0,1.1753424897719129E-10,3.1474449562621313E-36,5.1245755365113269E-6,3.1129455778263244E-7]
[]
[]
["Saved  28/03/2024: 12:06:39  Level Number: 5"]
[]
["BREAKTHROUGH RESULTS"]
[]
["Advanced"]
["Pollutant Linkage: Inert Restorati, Attenution Layer, Beenham Grange Formation",null,null,null,null,null,null,null,null,null,"Pollutant Linkage: Inert Restorati, Attenution Layer, Beenham Grange Formation, Groundwater "]
["Concentrations in mg/L in Beenham Grange Formation",null,null,null,null,null,null,null,null,null,"Concentrations in mg/L in Groundwater "]
[]
["Compared with EAL (GW) target concentration in mg/L",null,null,null,null,null,null,null,null,null,"Compared with EAL (GW) target concentration in mg/L"]
[null,4.5999999999999999E-2,4.235E-3,2.0000000000000002E-5,5.0000000000000001E-4,2.5999999999999998E-4,2.0000000000000002E-5,1E-3,1E-3,null,null,4.5999999999999999E-2,4.235E-3,2.0000000000000002E-5,5.0000000000000001E-4,2.5999999999999998E-4,2.0000000000000002E-5,1E-3,1E-3]
[]
["Time(years)","Species1","Species2","Species3","Species4","Species5","Species6","Species7","Species8",null,"Time(years)","Species1","Species2","Species3","Species4","Species5","Species6","Species7","Species8"]
[null,"Barium","Copper","Lead","Total Chromium","Cadmium","Mercury","Molybdenum","Antimony",null,null,"Barium","Copper","Lead","Total Chromium","Cadmium","Mercury","Molybdenum","Antimony"]
[10,0,0,0,0,0,0,0,0,null,10,1.3768179288862854E-29,0,0,0,0,0,0,0]
[20,6.0165648279773546E-22,0,0,0,0,0,0,0,null,20,0,0,0,0,0,0,0,0]
[30,1.631876103585447E-19,0,0,0,0,0,0,0,null,30,5.1678940650588506E-19,0,0,0,0,0,0,0]
[40,6.0043395623602885E-15,0,0,0,0,0,4.782271568936099E-39,0,null,40,1.320068090485187E-15,0,0,0,0,0,0,0]
[50,4.1138853856377298E-12,0,0,0,0,0,2.2418953791257439E-34,1.1164105619996338E-39,null,50,1.4940265328233444E-12,0,0,0,0,0,1.5409392033234951E-35,4.67590458532906E-40]
[60,3.203167710413425E-10,5.0950103747595858E-33,0,0,0,0,1.4978146183401779E-31,4.3093192601393237E-36,null,60,1.5603728245110254E-10,1.4261998114266865E-35,0,0,0,0,7.816964232477673E-32,2.9139987296267783E-36]
[70,7.1777285653302071E-9,3.2895294489083989E-31,0,0,0,0,0,8.4981750899741244E-33,null,70,4.2032663607709621E-9,5.2093481828453261E-32,0,0,0,0,0,6.538417422787362E-33]
[80,7.3726663011661385E-8,0,0,0,3.5746772547431977E-40,0,2.3810386795427268E-27,0,null,80,4.8803522471143586E-8,4.1085766070995606E-30,0,0,0,0,5.9207473489519915E-28,0]
[90,4.497255985046219E-7,4.2486485452567403E-27,0,0,4.9469005094425974E-38,0,0,0,null,90,3.2427328058754537E-7,0,0,0,0,0,1.3157126876219603E-27,0]
[100,1.9033504034843591E-6,0,0,0,1.3382380794778782E-35,0,4.5172218329651212E-25,8.3196389600862919E-28,null,100,1.4601077978539505E-6,9.5992333247269686E-27,0,0,2.631346507049973E-36,0,0,7.8846779398337462E-28]
[110,6.1714825752304761E-6,0,0,0,1.1777747898790497E-33,0,5.3359003094376364E-25,0,null,110,4.9585197683659121E-6,3.764906882308983E-26,0,0,5.4022839552160982E-34,0,4.1501460643326456E-24,0]
[120,1.637944441874543E-5,4.2483891617418055E-24,0,0,1.3624079396961984E-32,0,0,0,null,120,1.3635218197093807E-5,0,0,0,1.3918588371660684E-32,0,0,0]
[130,3.7253821267684085E-5,0,0,0,0,0,4.9417875952305243E-23,4.6994188934529146E-25,null,130,3.1885451242391764E-5,6.6954483786415649E-24,0,0,0,0,0,4.4417761694627657E-25]
[140,7.5033373279072391E-5,0,0,0,0,0,2.3089680751673897E-22,2.2509190854497457E-25,null,140,6.5658958942750321E-5,4.1058298624352158E-23,0,0,0,0,3.3454927290390598E-22,6.2658060094097774E-25]
[150,1.3709268754791366E-4,1.5907033520274108E-22,0,0,1.8840661172854031E-29,0,0,0,null,150,1.2213711961625519E-4,0,0,0,0,0,5.0888933769241215E-22,0]
[160,2.3137113394405235E-4,6.8841289618694725E-22,3.5242830482759419E-39,0,1.9751188514387541E-28,0,0,0,null,160,2.0919273683998887E-4,0,0,0,1.7064788595121851E-28,0,0,0]
[170,3.6572712225876137E-4,0,0,0,0,0,1.2538073319496099E-21,6.6904369015913382E-23,null,170,3.3475049529392331E-4,1.6999102758771744E-21,3.4174840866014392E-38,0,4.0556623741320445E-28,0,0,6.5607125386250226E-23]
[180,5.4732526579676056E-4,0,1.2991529032475348E-36,0,0,0,9.0587585062183367E-21,1.036966019332559E-22,null,180,5.0616041114421098E-4,4.9362280136484157E-21,0,0,0,0,7.8246033286244206E-21,1.2827100026999193E-22]
[190,7.8213155361153426E-4,0,1.7461528535314284E-35,0,0,0,9.7468083624152826E-21,0,null,190,7.2966675330960894E-4,0,4.1761256938937436E-36,0,0,0,2.5181778316403601E-20,0]
[200,1.0745554495167591E-3,1.1746866091489166E-20,3.1042498796451949E-34,0,3.1716556930333823E-26,0,4.6647122624464671E-21,0,null,200,1.0100185261813282E-3,0,2.3334546880119758E-35,0,7.0786211105181031E-27,0,1.0304369306574136E-20,0]
[210,1.4272474516943195E-3,3.1138764795735366E-20,3.033589395980762E-33,0,1.3878698903799379E-25,0,1.0880255209534497E-19,0,null,210,1.3502356014135648E-3,0,4.5820229064358441E-34,0,1.3900674010770338E-25,0,0,0]
[220,1.8410395671273141E-3,2.6743839168037372E-20,1.8397825999692927E-32,0,9.5069741561402897E-26,0,9.2337063559877702E-19,1.7335107267438472E-21,null,220,1.7515215290316371E-3,6.2639961512656059E-20,5.208232124480078E-33,0,2.6428441576052461E-25,0,1.5895187677724539E-20,1.5854179046965218E-21]
[230,2.3150041941783846E-3,1.0871779780792797E-20,6.7048276381006148E-32,0,0,0,5.1194873406152412E-18,4.8174519273074327E-21,null,230,2.2133003420753776E-3,1.7742882133509139E-19,3.1386396818469598E-32,0,0,0,7.361252657041354E-19,5.0809381091131089E-21]
[240,2.8466021886115844E-3,1.9935242327148566E-19,4.3646750645497095E-32,0,0,0,2.3508594798766731E-17,5.154910375170787E-21,null,240,2.733348642236838E-3,1.4060086213711332E-19,1.3337462742164452E-31,0,0,0,4.3064447844311444E-18,5.784547359768236E-21]
[250,3.4318911335597881E-3,1.5125802119463096E-18,0,0,0,0,9.5210710530968451E-17,1.7624312747811614E-21,null,250,3.3079936519074919E-3,0,2.6602657081672376E-31,0,0,0,1.9475514196714731E-17,1.253416003176634E-21]
[260,4.0657680122542349E-3,7.3623386281769812E-18,0,0,3.4336769099254841E-24,0,3.4692354491398599E-16,9.2456176491590037E-21,null,260,3.9323506309871152E-3,0,0,0,2.1645269903724082E-25,0,7.8180084915673067E-17,2.1808019762436401E-21]
[270,4.7422250500948797E-3,2.9628559134458407E-17,0,0,1.4316882407203867E-23,0,1.1499035903623076E-15,9.0526481521356877E-20,null,270,4.6005774354914717E-3,0,0,0,1.3076891785056118E-23,0,2.8464991749988326E-16,5.8756593627879835E-20]
[280,5.4546024046510551E-3,1.0649072761544157E-16,0,0,2.2300842099330765E-23,0,3.499631223339407E-15,4.5843342457254052E-19,null,280,5.3061288968450524E-3,2.866591771510331E-18,0,0,2.9469880308659532E-23,0,9.4623221957070662E-16,3.3993800245448293E-19]
[290,6.1958260069939599E-3,3.5043949135405369E-16,6.5681047523868909E-29,0,9.4379325076613548E-24,0,9.862740161804624E-15,1.7947399880822114E-18,null,290,6.0419984178392214E-3,1.3575869096412981E-17,0,0,2.8457968892555678E-23,0,2.8921865966936579E-15,1.3873571824311358E-18]
[300,6.9586228681722453E-3,1.0667742748082315E-15,4.1348978975419325E-28,0,0,0,2.5934368027563515E-14,6.1669606361705444E-18,null,300,6.8009383323201335E-3,4.8212366131187518E-17,3.5593342651860486E-30,0,0,0,8.1908356982918515E-15,4.862276822608636E-18]
[310,7.7357094373824284E-3,3.024693461856323E-15,1.1265895900766052E-27,0,0,0,6.4055075342666363E-14,1.9425427512589388E-17,null,310,7.5756540025207365E-3,1.5621360111570698E-16,4.8643331214373257E-28,0,0,0,2.1650646338822175E-14,1.5535226949883366E-17]
[320,8.5199511350737521E-3,8.0368287976947507E-15,1.6333747475859102E-27,0,0,0,1.4947676464304423E-13,5.6980776094044848E-17,null,320,8.3589693116419873E-3,4.7634952741745411E-16,1.8338285788802079E-27,0,0,0,5.3764437535878254E-14,4.6154115544972496E-17]
[330,9.3044930546910681E-3,2.0124580223598909E-14,0,0,0,0,3.3126136831290439E-13,1.5678675127127723E-16,null,330,9.1439632091170984E-3,1.3680778605333701E-15,3.7909630340499237E-27,0,0,0,1.2615506830068981E-13,1.2852686112252113E-16]
[340,1.0082863131406172E-2,4.7734718564067693E-14,0,3.7858786432500441E-40,7.714176502379372E-23,0,7.0035126771321005E-13,4.0675978737487396E-16,null,340,9.924078378290329E-3,3.6998353640316194E-15,3.485191478119507E-27,1.1544228951369699E-40,0,0,2.8112734144742272E-13,3.3720391514144964E-16]
[350,1.0849049922661327E-2,1.0774777962024621E-13,0,2.106078881050807E-39,4.3480832240834541E-22,0,1.418255383593969E-12,9.9953508874187687E-16,null,350,1.069320402845055E-2,9.445591857135692E-15,0,2.2930332819926452E-39,3.4795985139469676E-22,0,5.9763505332613993E-13,8.3728135398514368E-16]
[360,1.1597557635450659E-2,2.3240020902286791E-13,0,0,8.3617448563832121E-22,0,2.7608177631017091E-12,2.3363723892190598E-15,null,360,1.1445735368955883E-2,2.2853650802035603E-14,0,2.4272873851459329E-39,8.9476448780543826E-22,0,1.2168284523605744E-12,1.9760095967860513E-15]
[370,1.2323441258368031E-2,4.8074555018537217E-13,0,0,1.0805795813148872E-21,0,5.1826234111344996E-12,5.2153331556798684E-15,null,370,1.2176612594764517E-2,5.2623799007763601E-14,0,0,1.3481619317739703E-21,0,2.3813304252691517E-12,4.4502065317672425E-15]
[380,1.3022324687279891E-2,9.5691357074955025E-13,2.0143909883725594E-26,0,9.681586960916198E-22,0,9.4086779647953021E-12,1.1157793114862723E-14,null,380,1.2881342277837346E-2,1.1577848927710927E-13,0,0,1.3956793042953043E-21,0,4.4934533323124522E-12,9.5991650192641887E-15]
[390,1.3690404632088593E-2,1.8381883790962632E-12,2.1969311171452086E-25,1.8590200379073004E-37,4.7122906856051899E-22,0,1.6560989642945713E-11,2.2953138420507407E-14,null,390,1.3556003980570198E-2,2.4425840334603852E-13,0,1.0942546469953733E-37,8.0586833410717495E-22,0,8.198647456722312E-12,1.9897039005047122E-14]
[400,1.4324442905262705E-2,3.416803310415622E-12,5.658722235451607E-25,8.2224458531554825E-37,1.3729399028158122E-25,0,2.83284942391832E-11,4.5535150926998095E-14,null,400,1.4197244735065052E-2,4.9572720467201833E-13,1.6407752813560411E-25,6.9339405401153077E-37,0,0,1.4501487021884259E-11,3.9750669333797664E-14]
[410,1.4921749455974046E-2,6.1603143999031271E-12,9.5385122787839718E-25,2.3935021613424011E-36,8.3629894573590651E-22,0,4.7189309967894648E-11,8.7345806372434485E-14,null,410,1.4802263803186519E-2,9.7064357862127599E-13,7.4462301986187569E-25,1.9728135616801757E-36,0,0,2.492236342312344E-11,7.6749241155462124E-14]
[420,1.5480158252837413E-2,1.0796425432302369E-11,1.08273947438785E-24,7.7810993117627701E-36,5.9534485778505325E-21,0,7.6694512667848168E-11,1.6239317753014281E-13,null,420,1.5368789874789337E-2,1.8383514584102613E-12,1.6131732614195201E-24,5.4685102124468266E-36,0,0,4.1703680595676528E-11,1.4356135206640455E-13]
[430,1.5997997851823612E-2,1.8429144542444203E-11,4.5410168066824579E-25,3.0139073615481147E-35,2.1738005158060255E-20,0,1.2182242488111682E-10,2.9326941064124477E-13,null,430,1.5895052595083826E-2,3.3757418857185734E-12,2.4021132946749082E-24,2.0604260275799209E-35,5.8177465596708587E-21,0,6.8074655334480468E-11,2.607327094551367E-13]
[440,1.647405822653639E-2,3.069409569155357E-11,0,1.1068354119115645E-34,6.1635370327484223E-20,0,1.8941177920271844E-10,5.1546116985520486E-13,null,440,1.6379750050521794E-2,6.0229308185786875E-12,2.2988007296465654E-24,8.1188243951180694E-35,2.509039797687231E-20,0,1.0858375235354673E-10,4.6070275984918999E-13]
[450,1.6907555193885072E-2,4.9961624420108401E-11,0,3.5079206294556579E-34,1.5362995146862113E-19,0,2.8868103741144799E-10,8.83356621030112E-13,null,450,1.6822013594851713E-2,1.0461343162101791E-11,1.4341568282930048E-25,2.7495457895084287E-34,7.2505785505130751E-20,0,1.6950728749860954E-10,7.9342933358047768E-13]
[460,1.7298093544028517E-2,7.9596962703616766E-11,0,9.6863639067935587E-34,3.5493315662901514E-19,0,4.3183963906883423E-10,1.4784273502112046E-12,null,460,1.7221371168470688E-2,1.772055047184629E-11,0,7.9341835382641111E-34,1.7937920418567537E-19,0,2.5934179512800154E-10,1.3340843999395833E-12]
[470,1.7645629781830933E-2,1.242870939177568E-10,0,2.4002728828247232E-33,7.7963632611483815E-19,0,6.347950582457915E-10,2.4201373809300081E-12,null,470,1.7577710057860785E-2,2.9321125844885759E-11,0,2.0244434779206294E-33,4.0937191352558305E-19,0,3.8938638567921275E-10,2.1933581808699192E-12]
[480,1.7950435208593411E-2,1.9044403620415432E-10,0,5.44406793843424E-33,1.6488555469655921E-18,0,9.1795732810956153E-10,3.8802010251015261E-12,null,480,1.7891239858660667E-2,4.7461596889971939E-11,0,4.7112001937315723E-33,8.8889511724330407E-19,0,5.7441955053366356E-10,3.5309795979677866E-12]
[490,1.821305991718641E-2,2.8669400367370483E-10,0,1.1317237533543296E-32,3.3786932727861669E-18,0,1.3071402304908921E-9,6.1008727920461237E-12,null,490,1.8162456245689206E-2,7.5258237308436771E-11,0,1.0108218417582366E-32,1.8618797873440104E-18,0,8.3347275969253015E-10,5.5731244776260066E-12]
[500,1.8434298139677154E-2,4.2446128755759348E-10,8.1493063885249766E-24,2.1174578387799823E-32,6.7300056546865955E-18,0,1.834555732931053E-9,9.4180020919481044E-12,null,500,1.8392106014885338E-2,1.1704688304993001E-10,0,1.9772872397538466E-32,3.7852528368106141E-18,0,1.1907008180075053E-9,8.6344352005347526E-12]
[510,1.861515527250017E-2,6.1865471761289413E-10,3.7095551317180844E-23,3.4147176695008891E-32,1.3056552974958039E-17,0,2.5398955865075461E-9,1.4289619323247455E-11,null,510,1.8581153744119162E-2,1.787561402553039E-10,0,3.4112855220650242E-32,7.4905886474458958E-18,0,1.6763463854490547E-9,1.314541281193914E-11]
[520,1.875681680836503E-2,8.8846322843307018E-10,7.5961279848751668E-23,4.2492593117808202E-32,2.4705918217302744E-17,0,3.4714913716012666E-9,2.1330834882141855E-11,null,520,1.873075032040802E-2,2.6836122923708113E-10,2.9701781448036585E-23,4.8234264164679833E-32,1.4450616301027199E-17,0,2.3277934213719616E-9,1.9685961657279098E-11]
[530,1.8860619324414855E-2,1.2582653923117539E-9,1.1703013879470017E-22,2.24161609896803E-32,4.5652140890444314E-17,0,4.6875417885759573E-9,3.1355826055349191E-11,null,530,1.8842203498217032E-2,3.9642725422730972E-10,9.5390547894912002E-23,4.3392973249664548E-32,2.7207877830047116E-17,0,3.1907016791789411E-9,2.9025864611879745E-11]
[540,1.8928023610780328E-2,1.7586558307072461E-9,1.4665264717131577E-22,0,8.2472095240652217E-17,0,6.2573937200236992E-9,4.5427656807796038E-11,null,540,1.8916950585365504E-2,5.7674988968845175E-10,1.7752354617359775E-22,0,5.0048410591148596E-17,0,4.3202118502685803E-9,4.2172941918297148E-11]
[550,1.8960589970712996E-2,2.427589232789868E-9,1.4649687610270713E-22,0,1.4582121124412604E-16,0,8.2628616125460566E-9,6.4916621184048153E-11,null,550,1.8956533297702114E-2,8.2710033310176185E-10,2.5710144033856528E-22,0,9.0037653168420231E-17,0,5.7822086212021524E-9,6.0429597374830573E-11]
[560,1.8959955681324497E-2,3.3116403537122663E-9,9.6850647279899722E-23,0,2.5262031396252676E-16,0,1.0799568096358151E-8,9.1567722360846624E-11,null,560,1.8962574779455975E-2,1.1700799089540466E-9,3.0410869693807312E-22,0,1.5858083097954432E-16,0,7.6546268410659422E-9,8.545838189713384E-11]
[570,1.8927814570888497E-2,4.4673759047684889E-9,0,0,4.2923634712254511E-16,0,1.3978287522082897E-8,1.2757779719710383E-10,null,570,1.8936758751358748E-2,1.6340879508948347E-9,2.8138242513102509E-22,0,2.7372799264968885E-16,0,1.0028784258856833E-8,1.1935710699373181E-10]
[580,1.8865898643448634E-2,5.9628317529515421E-9,0,0,7.1602775142236644E-16,0,1.7926273271771953E-8,1.7568267218201605E-10,null,580,1.8880810721903226E-2,2.254404582815634E-9,1.523377986113659E-22,0,4.6351684353273377E-16,0,1.3010722930031989E-8,1.6474392103662027E-10]
[590,1.8775961662688599E-2,7.8790863888219229E-9,0,0,1.1737323795802674E-15,0,2.2788549305818838E-8,2.3925459352316075E-10,null,590,1.8796481177104921E-2,3.0743878189631171E-9,0,0,7.7073674513744321E-16,0,1.6722540438023808E-8,2.2485262175879362E-10]
[600,1.8659764593732961E-2,1.0311919266346151E-8,0,0,1.892303915253551E-15,0,2.8729146435025503E-8,3.2241001495211797E-10,null,600,1.8685530649768609E-2,4.1467820694291258E-9,0,0,1.2596067833070307E-15,0,2.1303691545852503E-8,3.0363832225309442E-10]
[610,1.8519062792669665E-2,1.3373540428428557E-8,0,0,3.0029533389387973E-15,0,3.5932264240868435E-8,4.3012765538480229E-10,null,610,1.8549716559584671E-2,5.5351327360958695E-9,0,0,2.0249914785260453E-15,0,2.6912240785620703E-8,4.0589341851555167E-10]
[620,1.8355594828388288E-2,1.7194375861999204E-8,0,0,4.694326095019973E-15,0,4.4603340379334012E-8,5.6837655895185384E-10,null,620,1.8390781709445522E-2,7.315299182441739E-9,0,0,3.204930979920342E-15,0,3.3726046797046524E-8,5.3737362830354347E-10]
[630,1.817107281900731E-2,2.1924891322853918E-8,0,3.2896739705299045E-30,7.2339437142989301E-15,0,5.497001015810071E-8,7.4425370640998576E-10,null,630,1.8210444320548573E-2,9.5770560243536133E-9,0,0,4.9974394251198015E-15,0,4.1943859916211028E-8,7.0493368803407175E-10]
[640,1.7967174165279914E-2,2.7737435969530463E-8,0,3.2156267209140378E-29,1.0996260496167676E-14,0,6.7282940730235642E-8,9.6613054390297911E-10,null,640,1.8010389488500731E-2,1.2425770480369814E-8,0,2.0162658066934016E-29,7.6827259342243881E-15,0,5.1786315558846129E-8,9.1667211097733498E-10]
[650,1.7745534565154417E-2,3.4828086073868896E-8,0,8.7489383248869476E-29,1.6498930437050035E-14,0,8.1816525952306723E-8,1.2438076167062121E-9,null,650,1.7792261944078975E-2,1.5984141494965047E-8,0,6.9672054623892838E-29,1.1652217107719393E-14,0,6.3496807297935426E-8,1.1820842303819165E-9]
[660,1.7507742197038035E-2,4.3418468349991918E-8,5.7238569453191503E-22,1.7866180918600249E-28,2.4449145053809637E-14,0,9.8869429860614503E-8,1.5886763259749473E-9,null,660,1.7557660005468854E-2,2.0393984556569715E-8,0,1.5593034603336596E-28,1.7446006801891042E-14,0,7.7342225157042662E-8,1.5122225794707437E-9]
[670,1.7255332963542355E-2,5.3757542069962966E-8,1.7715847356157685E-21,3.106965868933932E-28,3.5802186373139873E-14,0,1.1876496877513982E-7,2.0138866692950041E-9,null,670,1.730813061277009E-2,2.5818044613441693E-8,0,2.8738043947317631E-28,2.5800626408469585E-14,0,9.3613546479368133E-8,1.9198635002203153E-9]
[680,1.6989786692637125E-2,6.6123319110886349E-8,3.1905887230300719E-21,4.7735768899255395E-28,5.1834637557090305E-14,0,1.4185132419647514E-7,2.5345196842443877E-9,null,680,1.7045165340632697E-2,3.2441818276421971E-8,1.5109679992701374E-21,4.6323249898892505E-28,3.7709314050286786E-14,0,1.1262626873736735E-7,2.4196787278132748E-9]
[690,1.6712524198658207E-2,8.0824501394024984E-8,4.6838919673797916E-21,6.5159266948250246E-28,7.4235001996963427E-14,0,1.685015808683093E-7,3.1677631909554496E-9,null,690,1.6770197290292638E-2,4.0475365609603555E-8,3.7987776239699572E-21,6.638270402864125E-28,5.4497260344172366E-14,0,1.3472067576845303E-7,3.0284105704824214E-9]
[700,1.6424905111536405E-2,9.8202015813673239E-8,6.0530425883620047E-21,7.7431938691455669E-28,1.0521479505613609E-13,0,1.9911358659192481E-7,3.9330893270186395E-9,null,700,1.6484598768142476E-2,5.0155091260082691E-8,6.3970990189679495E-21,8.3856473114412462E-28,7.7914617177704274E-14,0,1.602619311100872E-7,3.7650491974552906E-9]
[710,1.6128226388705921E-2,1.1863042768800594E-7,7.0649517143609191E-21,7.4387937994710415E-28,1.4764348513133932E-13,0,2.3410963255856821E-7,4.8524322876205736E-9,null,710,1.6189679664049238E-2,6.17454744692168E-8,9.0069245712258806E-21,8.9338637078669484E-28,1.1025036904628714E-13,0,1.8963999431647274E-7,4.6510104626093053E-9]
[720,1.5823721430141716E-2,1.4251921496696105E-7,7.4808968029462947E-21,4.1003578892105906E-28,2.0521096594358128E-13,0,2.7393595507393917E-7,5.9503646266296851E-9,null,720,1.5886686448631386E-2,7.5540727634703059E-8,1.1242770348057372E-20,6.8144995678569758E-28,1.544704779989557E-13,0,2.2326935832680399E-7,5.7103126294420628E-9]
[730,1.5512559723080188E-2,1.7031388687073357E-7,7.0955318000122428E-21,0,2.8262153317421783E-13,0,3.1906206155479346E-7,7.2542704409403616E-9,null,730,1.5576801714823629E-2,9.1866363542260133E-8,1.2668697536199926E-20,2.3682358106143562E-30,2.1438401671359547E-13,0,2.6158860808369981E-7,6.9697503246701716E-9]
[740,1.5195846948810026E-2,2.0249693227142851E-7,5.784869981355655E-21,0,3.8582360870293471E-13,0,3.6997988555415949E-7,8.7945137507519684E-9,null,740,1.5261144194910889E-2,1.1108065213814435E-7,1.2849198728293469E-20,0,2.9484129285427515E-13,0,3.0505980263681046E-7,8.4590640332872024E-9]
[750,1.4874625489637078E-2,2.3958858493308598E-7,3.5625559315271067E-21,0,5.2227969769056151E-13,0,4.2720277729753713E-7,1.060460040209613E-8,null,750,1.4940769190019763E-2,1.3357594874405566E-7,1.1411316622810208E-20,0,4.0196823462559806E-13,0,3.5416768488255922E-7,1.0211103456837427E-8]
[760,1.4549875279443335E-2,2.8214739465448949E-7,6.4505329204186971E-22,0,7.0128127060059361E-13,0,4.9126433777109144E-7,1.2721331853907979E-8,null,760,1.4616669354356789E-2,1.5977987689481994E-7,8.1133058629952234E-21,0,5.4344154525702406E-13,0,4.0941872486341313E-7,1.2261983088153389E-8]
[770,1.4222514946605258E-2,3.3077059537804624E-7,0,0,9.3431342727942385E-13,0,5.6271710578250612E-7,1.5184949268960771E-8,null,770,1.4289775781957592E-2,1.9015635047392208E-7,2.9150473726603464E-21,0,7.2880933608287111E-13,0,4.7134000416088687E-7,1.4651228408632561E-8]
[780,1.3893403202778768E-2,3.8609426340098751E-7,0,0,1.2354743171831307E-12,0,6.4213110860837161E-7,1.8039266404429558E-8,null,780,1.3960959348450501E-2,2.2520642149783883E-7,0,0,9.6986210729689226E-13,0,5.4047795035231235E-7,1.7421911186730819E-8]
[790,1.3563340435656834E-2,4.4879326091828346E-7,0,0,1.6219543531312957E-12,0,7.3009228784557709E-7,2.1331789891843234E-8,null,790,1.3631032265038725E-2,2.6546894172129935E-7,0,0,1.2810590561954588E-12,0,6.1739693175362765E-7,2.0620772446902408E-8]
[800,1.3233070468079719E-2,5.1958096220853278E-7,0,0,2.1145802607263412E-12,0,8.2720081289786909E-7,2.5113825605660278E-8,null,800,1.3300749806229721E-2,3.1152102816613132E-7,0,0,1.6800147492545345E-12,1.1679500349519476E-40,7.0267772373391386E-7,2.4298331784684639E-8]
[810,1.290328244999072E-2,5.9920876181581474E-7,9.3053093599147865E-21,0,2.7384289478156021E-12,0,9.3406929515664232E-7,2.9440569942457436E-8,null,810,1.297081217700914E-2,3.6397832468081069E-7,0,0,2.1880511919542545E-12,0,7.9691585876185603E-7,2.8508981823832772E-8]
[820,1.2574612853075885E-2,6.8846536605637258E-7,3.17026882018884E-20,0,3.5235160550831138E-12,0,1.0513209163822995E-6,3.4371184966475627E-8,null,820,1.2641866488561504E-2,4.2349505368225349E-7,0,0,2.8308202650007714E-12,0,9.0071987303125223E-7,3.3311066743089068E-8]
[830,1.2247647541741768E-2,7.8817587106623391E-7,7.1957296938312714E-20,0,4.5055638580779226E-12,0,1.1795874850684133E-6,3.9968856519714243E-8,null,830,1.2314508815533592E-2,4.9076385428349228E-7,0,0,3.6390013646105301E-12,0,1.0147094630181584E-6,3.8766943941012481E-8]
[840,1.1922923896838199E-2,8.9920063238534395E-7,1.3924438305266593E-19,2.1495679930671962E-26,5.7268529318435423E-12,0,1.319507434684562E-6,4.6300834543612556E-8,null,840,1.1989286310600179E-2,5.6651540504112237E-7,0,9.689874071474684E-27,4.6490788859790499E-12,0,1.1395135656528755E-6,4.4943028055006779E-8]
[850,1.1600932971596074E-2,1.022433932729221E-6,2.4687542428505341E-19,6.2432564337187246E-26,7.2371616620516867E-12,6.7673928312071547E-40,1.4717237776576419E-6,5.3438455012383279E-8,null,850,1.1666699355289445E-2,6.5151783153751622E-7,1.1111170062555892E-20,4.8375287094951648E-26,5.9042039222099445E-12,0,1.2757683759562361E-6,5.1909816703022557E-8]
[860,1.1282121661824509E-2,1.1588024561178503E-6,4.141664371648813E-19,1.1930164328536556E-25,9.0947972925136839E-12,2.5178651105089977E-39,1.6368820287774625E-6,6.1457143033123073E-8,null,860,1.1347203728523339E-2,7.4657590092094272E-7,5.9362146971060456E-20,1.0426614038918997E-25,7.4551442162008453E-12,0,1.4241153160017577E-6,5.9741897471211142E-8]
[870,1.0966894874631174E-2,1.3092635779035246E-6,6.6909525137897468E-19,1.9171865557863555E-25,1.13677217405718E-11,5.6845980573991373E-39,1.8156281114142144E-6,7.0436396822910127E-8,null,870,1.1031212776744025E-2,8.5253000734071625E-7,1.3862993616110212E-19,1.7790956814318455E-25,9.3613260017396854E-12,7.6617265998185442E-40,1.5851989689360114E-6,6.8517935826038621E-8]
[880,1.0655617682357378E-2,1.4748034814581411E-6,1.052031755291312E-18,2.7645635715727783E-25,1.4134774892612916E-11,1.041916987093602E-38,2.0086062595265196E-6,8.0459752426344234E-8,null,880,1.0719099571849291E-2,9.7025495391680561E-7,2.6251920407703237E-19,2.6712617486376551E-25,1.1691970904901238E-11,4.6826139570580465E-39,1.7596649915316815E-6,7.8320643783127123E-8]
[890,1.0348617450039276E-2,1.6564351133416242E-6,1.6209113497356059E-18,3.6653125704793414E-25,1.748699751620741E-11,1.6990881237455337E-38,2.2164569279330741E-6,9.1614729186677406E-8,null,890,1.0411199044857185E-2,1.1006585384591703E-6,4.5056209318117476E-19,3.6598185629970165E-25,1.4527330551308583E-11,1.1198096959760529E-38,1.948158018375074E-6,8.9236729315634708E-8]
[900,1.0046185926732783E-2,1.8551959896752547E-6,2.4583306996949177E-18,4.5044832839323926E-25,2.1529055298430715E-11,2.6204296435175134E-38,2.4398147227318845E-6,1.0399275612830462E-7,null,900,1.0107810085352924E-2,1.2446799515900092E-6,7.3091687954115623E-19,4.6386883013423074E-25,1.7960020943441006E-11,2.0076311347707926E-38,2.1513195703157278E-6,1.0135682663075688E-7]
[910,9.7485812924372438E-3,2.0721458671875264E-6,3.6811812559842461E-18,5.1177515913300967E-25,2.6380764847807639E-11,4.0569439104761505E-38,2.6793063630924518E-6,1.1768907954657772E-7,null,910,9.8091975980581624E-3,1.403287997213653E-6,1.14415929200437E-18,5.4487346852914087E-25,2.2096458040285474E-11,3.0373303046012477E-38,2.3697859792442756E-6,1.1477540758253988E-7]
[920,9.4560301537809748E-3,2.3083642929880147E-6,5.4536055697320943E-18,5.2923113365586629E-25,3.2178721786724777E-11,6.6414275538082494E-38,2.9355486849304717E-6,1.3280265223152188E-7,null,920,9.5155945094889931E-3,1.577479146418032E-6,1.7485338997559334E-18,5.876307437572045E-25,2.705839529535181E-11,4.1129782463026138E-38,2.6041863406289486E-6,1.2959067462144403E-7]
[930,9.1687294830558475E-3,2.5649480475617282E-6,8.0042705583278002E-18,4.7747076867559342E-25,3.9078030319285677E-11,1.1716724257307137E-37,3.2091466962143602E-6,1.4943600487409234E-7,null,930,9.2272037189944211E-3,1.7682754368757473E-6,2.6271395204218147E-18,5.6586701323730994E-25,3.2984563195140776E-11,5.3309449615946835E-38,2.8551405045444342E-6,1.4590443580497681E-7]
[940,8.8868484959870146E-3,2.8430084957674001E-6,1.1649207825164203E-17,3.2870875312171581E-25,4.7254132894076666E-11,2.1793586947161828E-37,3.5006916928595103E-6,1.6769510031632463E-7,null,940,8.9441999893557587E-3,1.9767222306402676E-6,3.8976563893732475E-18,4.4980890180006711E-25,4.0032410095836097E-11,7.3433496265007775E-38,3.1232571151815007E-6,1.6382196250839859E-7]
[950,8.6105304649747218E-3,3.1436688607768696E-6,1.6821781953694854E-17,5.5275276551195055E-26,5.6904737800038529E-11,4.1140157438802012E-37,3.8107594433502451E-6,1.8768917140948865E-7,null,950,8.6667317734895229E-3,2.203885843906134E-6,5.7253894343105903E-18,2.0858272388613089E-25,4.8379942888918715E-11,1.191424537425272E-37,3.4091317080434498E-6,1.8345183057934167E-7]
[960,8.3398944651596092E-3,3.4680614359153257E-6,2.4111722315110485E-17,0,6.8251841744669663E-11,7.6501609950076928E-37,4.139908449401594E-6,2.0953054333670492E-7,null,960,8.3949229744529012E-3,2.4508510628230063E-6,8.3406077236190282E-18,0,5.8227665244501708E-11,2.265721810627722E-37,3.7133448732278249E-6,2.0490574577468807E-7]
[970,8.0750370514736276E-3,3.8173247492648246E-6,3.4315602132094988E-17,0,8.1543843675164124E-11,1.379608598858901E-36,4.4886782891412286E-6,2.3333444133815279E-7,null,970,8.1288746367221259E-3,2.7187185598283563E-6,1.2061412076371924E-17,0,6.98006103924714E-11,4.5907073031484576E-37,4.0364604923678796E-6,2.2829835440193602E-7]
[980,7.8160338657099603E-3,4.1926006956840604E-6,4.8501680992100273E-17,0,9.7057745322823606E-11,2.3998539934516794E-36,4.8575880484653283E-6,2.5921878484782344E-7,null,980,7.8686665676938779E-3,3.0086022251976511E-6,1.7323668824033661E-17,0,8.3350464614092345E-11,9.165884120218993E-37,4.3790240559787699E-6,2.5374704016032567E-7]
[990,7.5629411729672821E-3,4.595031650586109E-6,6.8092655176113878E-17,0,1.1510143318691458E-10,4.0275930381152345E-36,5.247134845407501E-6,2.873039691107686E-7,null,990,7.6143588886000329E-3,3.3216264286115657E-6,2.4719916496901699E-17,0,9.9157776838492248E-11,1.7452602759574977E-36,4.741561067125443E-6,2.8137170823921188E-7]
[1000,7.3157973273780853E-3,5.0257575794146266E-6,9.4970596369550067E-17,0,1.3601603593360482E-10,6.5395768311646122E-36,5.6577924515635133E-6,3.1771263539906897E-7,null,1000,7.365993514716754E-3,3.6589232255165399E-6,3.5049593330513867E-17,0,1.1753424897719129E-10,3.1474449562621313E-36,5.1245755365113269E-6,3.1129455778263244E-7]

{"sheet":"User_Water_Balance","index":10,"n_rows":46,"n_cols":9,"rows_kept":46,"cut":false,"hidden":false,"merged":[]}
["Input",null,"RAINFALL"]
["Output",null,"Annual Effective Rainfall",255,"mm"]
[null,null,"Effective Rainfall  ",{"$f":"D2/s_per_year/1000","v":8.0804623925773812E-9},"m3/s"]
[null,null,null,null,null,null,"Void B"]
[null,null,"VOID PARAMETERS"]
[null,null,"Void Area",160618,"m2",null,"Max Elevation of void surface",{"$f":"maxele_b","v":57.33},"mAOD"]
[null,null,"Void Perimeter",2332,"m",null,"Average GW head downstream",{"$f":"gwele_b","v":54.5},"mAOD"]
[null,null,null,null,null,null,"Distance from centre of void to perimeter",{"$f":"distancetoedge_b","v":150},"m"]
[null,null,"Restoration Material Thickness",{"$f":"maxele_b-D11","v":6.2800000000000011},"m",null,"Average depth of restoration material",{"$f":"thick_b","v":6.2800000000000011},"m"]
[null,null,null,null,null,null,"Perimeter of void ",{"$f":"peri_b","v":2332},"m"]
[null,null,"Base of Void B",51.05,"mAOD",null,"K",{"$f":"AL_K","v":9.9999999999999995E-8},"m/s"]
[null,null,"Maximum Elevation",57.33,"mAOD",null,"QS",{"$f":"((H6-H7)/H8)*H9*H10*H11","v":2.7630157866666653E-5},"m3/s"]
[]
[null,null,"GW Elevation at perimeter",54.5,"mAOD",null,"Qer_b",{"$f":"area_b*effective_rainfall","v":1.2978677085709938E-3},"m3/s"]
[]
[null,null,"Distance from centre void to edge",150,"m",null,"QRO_b",{"$f":"H14-H12","v":1.2702375507043272E-3},"m3/s"]
[]
[null,null,"Total Volume of restoration material",1153000,"m3"]
[null,null,"Volume in Void B",417835.8074747686,"m3"]
[]
[]
[null,null,"AQUIFER PROPERTIES"]
[]
[null,null,"Attenuation Layer Hydraulic Conductivity",9.9999999999999995E-8,"m/s"]
[null,null,"Beenham Grange Formation Hydraulic Conductivity",1.4120000000000001E-3,"m/s"]
[null,null,"Attenuation Layer Hydraulic Gradient",{"$f":"(maxele_b-gwele_b)/distancetoedge_b","v":1.8866666666666657E-2},"-"]
[null,null,"Beenham Grange Formation Hydraulic Gradient",3.0000000000000001E-3,"m/s"]
[null,null,"Attenuation Layer Bulk Density",2000,"kg/m3"]
[null,null,"Beenham Grange Formation Bulk Density",1600,"kg/m3"]
[null,null,"Attenuation Layer Porosity",0.05,"-"]
[null,null,"Beenham Grange Formation Porosity",0.2,"-"]
[null,null,"Tortuosity",5]
[]
[null,null,"RECEPTOR TRAVEL DISTANCES"]
[]
[null,null,"Attenuation Layer Travel Distance",1,"m"]
[null,null,"Distance to River Enborne",25,"m"]
[null,null,"Distance to GW Receptor",10,"m"]
[null,null,"Distance to Spring Ditch",20,"m"]
[]
[null,null,"RIVER FLOWS"]
[null,null,"River Enborne Q95",0.16800000000000001,"m3/s"]
[null,null,"Spring Ditch Q95",0.01,"m3/s"]
[]
[]
[null,null,null,{"$f":"Q_springditch/0.00000282","v":3546.0992907801419}]

{"sheet":"User_Attenuation_Parameters","index":11,"n_rows":22,"n_cols":8,"rows_kept":22,"cut":false,"hidden":false,"merged":[[1,3,1,4],[1,6,1,7]]}
[]
[null,null,null,"Attenuation Layer",null,null,"Beenham Grange Formation"]
["Parameter",null,null,"Kd (L/kg)","Comment",null,"Kd (L/kg)","Comment"]
["Ammoniacial Nitrogen",null,null,0.5,"Mid-range value for engineered clay barriers in Table 4.1 of Buss et al. (2003)",null,0,"Conservative Assumption"]
["Arsenic","As","Haz",137,"Midpoint from range by Golder Associates (2007)",null,25,"Minimum value from range by Golder Associates (2007)"]
["Barium","Ba","Non Haz",17,"Value at pH 8 (representative of Water Chemistry) for unspecified material by Golder Associates (2003)",null,17,"Value at pH 8 (representative of Water Chemistry) for unspecified material by Golder Associates (2003)"]
["Cadmium","Cd","Non Haz",222,"Value for glacial till (representative of clayey conditions) Golder Associates (2003)",null,74,"Value for sand Golder Associates (2003)"]
["Total Chromium","Cr total","Haz",966,"Value for glacial till (representative of clayey conditions) Golder Associates (2003)",null,67,"Value for sand Golder Associates (2003)"]
["Copper","Cu","Non Haz",126.8,"Value for glacial till (representative of clayey conditions) Golder Associates (2003)",null,295,"Value for unspecified conditions, Golder Associates(2003)"]
["Mercury","Hg","Haz",2142,"Midpoint from range by Golder Associates (2007)",null,450,"Value for sand Golder Associates (2003)"]
["Molybdenum","Mo","Non Haz",110,"Value for unspecified conditions, Golder Associates(2003)",null,110,"Value for unspecified conditions, Golder Associates(2003)"]
["Nickel","Ni","Non Haz",410,"Midpoint from range by Golder Associates (2007)",null,400,"Value for sand Golder Associates (2003)"]
["Lead","Pb","Haz",434.6,"Value for glacial till (representative of clayey conditions) Golder Associates (2003)",null,270,"Value for sand Golder Associates (2003)"]
["Antimony","Sb","Non Haz",140,"Geometric mean value for clay (Sheppard et al., 2009)",null,17,"Value for sand Golder Associates (2003)"]
["Selenium","Se","Non Haz",9.5,"Value for unspecified conditions, Golder Associates(2003)",null,9.5,"Value for unspecified conditions, Golder Associates(2003)"]
["Zinc","Zn","Non Haz",20.7,"Value for glacial till (representative of clayey conditions) Golder Associates (2003)",null,200,"Value for sand Golder Associates (2003)"]
["Chloride","Cl","Non Haz",0,"assume zero retardation",null,0,"assume zero retardation"]
["Fluoride","F","Non Haz"]
["Sulphate(a)","SO4","Non Haz",0,"assume zero retardation",null,0,"assume zero retardation"]
[]
[]
[null,null,"Free Water Diffusion Coefficient",2.0000000000000001E-9]

{"sheet":"User_ScreeningAssessment_VoidB","index":12,"n_rows":21,"n_cols":16,"rows_kept":21,"cut":false,"hidden":false,"merged":[[0,0,0,12]]}
["Waste Source Screening Assessment - Groundwater North of River Enborne"]
["Chemical Name","Symbol","Haz / Non Haz","Pass/Fail","Source Term concentration (mg/l)","Max acceptable concentration (mg/l)","Target Concentration to assess against (mg/l)","UK DWS (mg/l)","UKTAG Quantification Limit (mg/l)","Baseline 95th percentile concentration from ESSD (mg/l)","Comment"]
["Arsenic","As","Haz",{"$f":"IF(E3<=F3,\"Pass\",\"FAIL\")","v":"Pass"},0.06,{"$f":"G3/$B$21","v":9.3945732401099075E-2},{"$f":"MIN(H3:J3)","v":2E-3},0.01,5.0000000000000001E-3,2E-3,null,null,null,null,null,{"$f":"F3/E3","v":1.5657622066849846}]
["Barium","Ba","Non Haz",{"$f":"IF(E4<=F4,\"Pass\",\"FAIL\")","v":"FAIL"},4,{"$f":"G4/$B$21","v":2.3486433100274771},0.05,null,null,0.05,null,null,null,null,null,{"$f":"F4/E4","v":0.58716082750686927}]
["Cadmium","Cd","Non Haz","FAIL",0.02,1.1790189416337931E-2,2.5099999999999992E-4,5.0000000000000001E-3,null,2.5099999999999992E-4,null,null,null,null,null,0.58950947081689653]
["Total Chromium","Cr total","Haz","FAIL",0.1,2.3486433100274769E-2,5.0000000000000001E-4,0.05,1E-3,5.0000000000000001E-4,"Chromium VI hazardous.  Most WIF's only include total chromium so assume all chromium is chromium VI which is very conservative.",null,null,null,null,0.23486433100274767]
["Copper","Cu","Non Haz",{"$f":"IF(E7<=F7,\"Pass\",\"FAIL\")","v":"FAIL"},0.6,0.19728603804230807,4.2000000000000006E-3,2,null,4.2000000000000006E-3,null,null,null,null,null,0.32881006340384678]
["Mercury","Hg","Haz","FAIL",2E-3,9.3945732401099077E-4,2.0000000000000002E-5,1E-3,2.0000000000000002E-5,5.0999999999999945E-5,null,null,null,null,null,0.4697286620054954]
["Molybdenum","Mo","Non Haz","FAIL",0.2,4.6972866200549537E-2,{"$f":"MIN(H9:J9)","v":1E-3},null,null,1E-3,null,null,null,null,null,0.23486433100274767]
["Nickel","Ni","Non Haz","Pass",0.12,0.3757829296043963,8.0000000000000002E-3,0.02,null,8.0000000000000002E-3,null,null,null,null,null,3.1315244133699691]
["Lead","Pb","Haz","FAIL",0.15,9.3945732401099077E-4,2.0000000000000002E-5,0.01,2.0000000000000002E-5,4.0000000000000001E-3,null,null,null,null,null,6.2630488267399389E-3]
["Antimony","Sb","Non Haz",{"$f":"IF(E12<=F12,\"Pass\",\"FAIL\")","v":"FAIL"},0.1,4.6972866200549537E-2,1E-3,5.0000000000000001E-3,null,1E-3,null,null,null,null,null,0.46972866200549535]
["Selenium","Se","Non Haz","Pass",0.04,0.2348643310027477,5.0000000000000001E-3,0.01,null,5.0000000000000001E-3,null,null,null,null,null,5.8716082750686924]
["Zinc","Zn","Non Haz","Pass",1.2,2.9451987107744544,6.2699999999999964E-2,null,null,6.2699999999999964E-2,null,null,null,null,null,2.4543322589787122]
["Chloride","Cl","Non Haz","Pass",460,1550.1045846181346,33,250,null,33,null,null,null,null,null,3.3697925752568145]
["Fluoride","F","Non Haz","Pass",2.5,9.3945732401099082,0.2,1.5,null,0.2,null,null,null,null,null,3.7578292960439632]
["Sulphate(a)","SO4","Non Haz","Pass",1500,2921.7122776741808,62.199999999999989,250,null,62.199999999999989,null,null,null,null,null,1.9478081851161204]
["Ammoniacal N","NH3-N","Non Haz","Pass",1,{"$f":"G18/B$21","v":18.319417818214319},0.39,0.39,null,1.3]
["Dilution",{"$f":"QRO_b","v":1.2702375507043272E-3},"m3/s"]
["Q Side",{"$f":"QSide_B","v":2.7630157866666653E-5},"m3/s"]
["Dilution Factor",{"$f":"B20/(B20+B19)","v":2.1288886135466457E-2}]