{"text_format":"1","workbook":"xlsx","n_sheets":6,"sheets":["Cover","Guidance","Control_Panel","Damage_Costs_User_Interface","Outputs","Damage_Costs_and_Assumptions"],"not_rendered":{"charts":0,"images":1,"macros":0,"external_links":0,"defined_names":6,"comments":0,"pivot_tables":0},"unopened":[],"bounds":{"document_bytes":16777216,"sheet_cells":100000,"rows_first":2000,"rows_last":500,"rows_between":2000,"halvings":0,"cell_chars":16384,"cell_head_chars":4096},"cells_cut":0,"cells_raw":0,"read":"whole","date_system":"1900"}

{"sheet":"Cover","index":0,"n_rows":26,"n_cols":2,"rows_kept":26,"cut":false,"hidden":false,"merged":[]}
[]
[]
[]
[]
[]
[]
[]
["Damage Costs Appraisal Toolkit"]
[]
["Original Version: January 2019"]
{"$rows_left_out":17}
{"sheet":"Guidance","index":1,"n_rows":45,"n_cols":11,"rows_kept":45,"cut":false,"hidden":false,"merged":[]}
[]
[]
[]
[]
[]
[]
[]
["This toolkit allows appraisers to calculate the economic impact of policies which affect air quality, using the damage cost approach. "]
["This tool is designed to be used in conjunction with the Air Quality Damage Costs Guidance: ",null,null,null,null,null,null,null,null,null,"https://www.gov.uk/government/publications/assess-the-impact-of-air-quality"]
["It is only appropriate for small air quality impacts (below £50 million)."]
{"$rows_left_out":36}
{"sheet":"Control_Panel","index":2,"n_rows":17,"n_cols":6,"rows_kept":17,"cut":false,"hidden":false,"merged":[]}
["Control Panel"]
[]
["Start Year",null,null,2024,null,"Please type the year at which the policy will start from, the start year is also the discount year"]
[]
["End Year",null,null,2033,null,"Please type the year at which the appraisal will end"]
[]
["Appraisal Period",null,null,{"$f":"(D5-D3)+1","v":10},null,"Autofills the number of years for which the policy is reviewed for"]
[]
["Price Base Year",null,null,2020,null,"Please type the price base year for your appraisal"]
[]
{"$rows_left_out":8}
{"sheet":"Damage_Costs_User_Interface","index":3,"n_rows":106,"n_cols":130,"rows_kept":106,"cut":false,"hidden":false,"merged":[]}
["Damage Cost User Interface"]
[]
[null,"Pollutant",null,"NOx","Part A Category 1",null,null,null,{"$f":"IF(COUNTIF($B$3:G3, \"Pollutant\")+1<=Control_Panel!$D$11, \"Pollutant\", \"\")","v":""},null,null,null,null,null,null,{"$f":"IF(COUNTIF($B$3:N3, \"Pollutant\")+1<=Control_Panel!$D$11, \"Pollutant\", \"\")","v":""}]
[]
[null,{"$f":"IF(COUNTIF($B$3:$Q$3, \"Pollutant\")+1<=Control_Panel!$D$11, \"Pollutant\", \"\")","v":""},null,null,null,null,null,null,{"$f":"IF(SUM(COUNTIF($B$3:$Q$3, \"Pollutant\"), COUNTIF($B$5:$G$5, \"Pollutant\")+1)<=Control_Panel!$D$11, \"Pollutant\", \"\")","v":""}]
[]
["Note: If you are assessing PM10 impacts, please convert these to PM2.5 using conversion factors found in the Assumptions sheet"]
[]
[{"$f":"IF($E$3=\"\", \"\", $D$3&\" \"&$E$3)","v":"NOx Part A Category 1"}]
[null,null,null,"Year",{"$f":"IF(Control_Panel!$D$3=\"\", \"\", Control_Panel!$D$3)","v":2024},{"$f":"IF(COLUMN()-4<=Control_Panel!$D$7, Damage_Costs_User_Interface!E10+1, \"\")","v":2025},{"$f":"IF(COLUMN()-4<=Control_Panel!$D$7, Damage_Costs_User_Interface!F10+1, \"\")","v":2026},{"$f":"IF(COLUMN()-4<=Control_Panel!$D$7, Damage_Costs_User_Interface!G10+1, \"\")","v":2027},{"$f":"IF(COLUMN()-4<=Control_Panel!$D$7, Damage_Costs_User_Interface!H10+1, \"\")","v":2028},{"$f":"IF(COLUMN()-4<=Control_Panel!$D$7, Damage_Costs_User_Interface!I10+1, \"\")","v":2029},{"$f":"IF(COLUMN()-4<=Control_Panel!$D$7, Damage_Costs_User_Interface!J10+1, \"\")","v":2030},{"$f":"IF(COLUMN()-4<=Control_Panel!$D$7, Damage_Costs_User_Interface!K10+1, \"\")","v":2031},{"$f":"IF(COLUMN()-4<=Control_Panel!$D$7, Damage_Costs_User_Interface!L10+1, \"\")","v":2032},{"$f":"IF(COLUMN()-4<=Control_Panel!$D$7, Damage_Costs_User_Interface!M10+1, \"\")","v":2033},{"$f":"IF(COLUMN()-4<=Control_Panel!$D$7, Damage_Costs_User_Interface!N10+1, \"\")","v":""},{"$f":"IF(COLUMN()-4<=Control_Panel!$D$7, Damage_Costs_User_Interface!O10+1, \"\")","v":""},{"$f":"IF(COLUMN()-4<=Control_Panel!$D$7, Damage_Costs_User_Interface!P10+1, \"\")","v":""},{"$f":"IF(COLUMN()-4<=Control_Panel!$D$7, Damage_Costs_User_Interface!Q10+1, \"\")","v":""},{"$f":"IF(COLUMN()-4<=Control_Panel!$D$7, Damage_Costs_User_Interface!R10+1, \"\")","v":""},{"$f":"IF(COLUMN()-4<=Control_Panel!$D$7, Damage_Costs_User_Interface!S10+1, \"\")","v":""},{"$f":"IF(COLUMN()-4<=Control_Panel!$D$7, Damage_Costs_User_Interface!T10+1, \"\")","v":""},{"$f":"IF(COLUMN()-4<=Control_Panel!$D$7, Damage_Costs_User_Interface!U10+1, \"\")","v":""},{"$f":"IF(COLUMN()-4<=Control_Panel!$D$7, Damage_Costs_User_Interface!V10+1, \"\")","v":""},{"$f":"IF(COLUMN()-4<=Control_Panel!$D$7, Damage_Costs_User_Interface!W10+1, \"\")","v":""},{"$f":"IF(COLUMN()-4<=Control_Panel!$D$7, Damage_Costs_User_Interface!X10+1, \"\")","v":""},{"$f":"IF(COLUMN()-4<=Control_Panel!$D$7, Damage_Costs_User_Interface!Y10+1, \"\")","v":""},{"$f":"IF(COLUMN()-4<=Control_Panel!$D$7, Damage_Costs_User_Interface!Z10+1, \"\")","v":""},{"$f":"IF(COLUMN()-4<=Control_Panel!$D$7, Damage_Costs_User_Interface!AA10+1, \"\")","v":""},{"$f":"IF(COLUMN()-4<=Control_Panel!$D$7, Damage_Costs_User_Interface!AB10+1, \"\")","v":""},{"$f":"IF(COLUMN()-4<=Control_Panel!$D$7, Damage_Costs_User_Interface!AC10+1, \"\")","v":""},{"$f":"IF(COLUMN()-4<=Control_Panel!$D$7, Damage_Costs_User_Interface!AD10+1, \"\")","v":""},{"$f":"IF(COLUMN()-4<=Control_Panel!$D$7, Damage_Costs_User_Interface!AE10+1, \"\")","v":""},{"$f":"IF(COLUMN()-4<=Control_Panel!$D$7, Damage_Costs_User_Interface!AF10+1, \"\")","v":""},{"$f":"IF(COLUMN()-4<=Control_Panel!$D$7, Damage_Costs_User_Interface!AG10+1, \"\")","v":""},{"$f":"IF(COLUMN()-4<=Control_Panel!$D$7, Damage_Costs_User_Interface!AH10+1, \"\")","v":""},{"$f":"IF(COLUMN()-4<=Control_Panel!$D$7, Damage_Costs_User_Interface!AI10+1, \"\")","v":""},{"$f":"IF(COLUMN()-4<=Control_Panel!$D$7, Damage_Costs_User_Interface!AJ10+1, \"\")","v":""},{"$f":"IF(COLUMN()-4<=Control_Panel!$D$7, Damage_Costs_User_Interface!AK10+1, \"\")","v":""},{"$f":"IF(COLUMN()-4<=Control_Panel!$D$7, Damage_Costs_User_Interface!AL10+1, \"\")","v":""},{"$f":"IF(COLUMN()-4<=Control_Panel!$D$7, Damage_Costs_User_Interface!AM10+1, \"\")","v":""},{"$f":"IF(COLUMN()-4<=Control_Panel!$D$7, Damage_Costs_User_Interface!AN10+1, \"\")","v":""},{"$f":"IF(COLUMN()-4<=Control_Panel!$D$7, Damage_Costs_User_Interface!AO10+1, \"\")","v":""},{"$f":"IF(COLUMN()-4<=Control_Panel!$D$7, Damage_Costs_User_Interface!AP10+1, \"\")","v":""},{"$f":"IF(COLUMN()-4<=Control_Panel!$D$7, Damage_Costs_User_Interface!AQ10+1, \"\")","v":""},{"$f":"IF(COLUMN()-4<=Control_Panel!$D$7, Damage_Costs_User_Interface!AR10+1, \"\")","v":""},{"$f":"IF(COLUMN()-4<=Control_Panel!$D$7, Damage_Costs_User_Interface!AS10+1, \"\")","v":""},{"$f":"IF(COLUMN()-4<=Control_Panel!$D$7, Damage_Costs_User_Interface!AT10+1, \"\")","v":""},{"$f":"IF(COLUMN()-4<=Control_Panel!$D$7, Damage_Costs_User_Interface!AU10+1, \"\")","v":""},{"$f":"IF(COLUMN()-4<=Control_Panel!$D$7, Damage_Costs_User_Interface!AV10+1, \"\")","v":""},{"$f":"IF(COLUMN()-4<=Control_Panel!$D$7, Damage_Costs_User_Interface!AW10+1, \"\")","v":""},{"$f":"IF(COLUMN()-4<=Control_Panel!$D$7, Damage_Costs_User_Interface!AX10+1, \"\")","v":""},{"$f":"IF(COLUMN()-4<=Control_Panel!$D$7, Damage_Costs_User_Interface!AY10+1, \"\")","v":""},{"$f":"IF(COLUMN()-4<=Control_Panel!$D$7, Damage_Costs_User_Interface!AZ10+1, \"\")","v":""},{"$f":"IF(COLUMN()-4<=Control_Panel!$D$7, Damage_Costs_User_Interface!BA10+1, \"\")","v":""},{"$f":"IF(COLUMN()-4<=Control_Panel!$D$7, Damage_Costs_User_Interface!BB10+1, \"\")","v":""},{"$f":"IF(COLUMN()-4<=Control_Panel!$D$7, Damage_Costs_User_Interface!BC10+1, \"\")","v":""},{"$f":"IF(COLUMN()-4<=Control_Panel!$D$7, Damage_Costs_User_Interface!BD10+1, \"\")","v":""},{"$f":"IF(COLUMN()-4<=Control_Panel!$D$7, Damage_Costs_User_Interface!BE10+1, \"\")","v":""},{"$f":"IF(COLUMN()-4<=Control_Panel!$D$7, Damage_Costs_User_Interface!BF10+1, \"\")","v":""},{"$f":"IF(COLUMN()-4<=Control_Panel!$D$7, Damage_Costs_User_Interface!BG10+1, \"\")","v":""},{"$f":"IF(COLUMN()-4<=Control_Panel!$D$7, Damage_Costs_User_Interface!BH10+1, \"\")","v":""},{"$f":"IF(COLUMN()-4<=Control_Panel!$D$7, Damage_Costs_User_Interface!BI10+1, \"\")","v":""},{"$f":"IF(COLUMN()-4<=Control_Panel!$D$7, Damage_Costs_User_Interface!BJ10+1, \"\")","v":""},{"$f":"IF(COLUMN()-4<=Control_Panel!$D$7, Damage_Costs_User_Interface!BK10+1, \"\")","v":""},{"$f":"IF(COLUMN()-4<=Control_Panel!$D$7, Damage_Costs_User_Interface!BL10+1, \"\")","v":""},{"$f":"IF(COLUMN()-4<=Control_Panel!$D$7, Damage_Costs_User_Interface!BM10+1, \"\")","v":""},{"$f":"IF(COLUMN()-4<=Control_Panel!$D$7, Damage_Costs_User_Interface!BN10+1, \"\")","v":""},{"$f":"IF(COLUMN()-4<=Control_Panel!$D$7, Damage_Costs_User_Interface!BO10+1, \"\")","v":""},{"$f":"IF(COLUMN()-4<=Control_Panel!$D$7, Damage_Costs_User_Interface!BP10+1, \"\")","v":""},{"$f":"IF(COLUMN()-4<=Control_Panel!$D$7, Damage_Costs_User_Interface!BQ10+1, \"\")","v":""},{"$f":"IF(COLUMN()-4<=Control_Panel!$D$7, Damage_Costs_User_Interface!BR10+1, \"\")","v":""},{"$f":"IF(COLUMN()-4<=Control_Panel!$D$7, Damage_Costs_User_Interface!BS10+1, \"\")","v":""},{"$f":"IF(COLUMN()-4<=Control_Panel!$D$7, Damage_Costs_User_Interface!BT10+1, \"\")","v":""},{"$f":"IF(COLUMN()-4<=Control_Panel!$D$7, Damage_Costs_User_Interface!BU10+1, \"\")","v":""},{"$f":"IF(COLUMN()-4<=Control_Panel!$D$7, Damage_Costs_User_Interface!BV10+1, \"\")","v":""},{"$f":"IF(COLUMN()-4<=Control_Panel!$D$7, Damage_Costs_User_Interface!BW10+1, \"\")","v":""},{"$f":"IF(COLUMN()-4<=Control_Panel!$D$7, Damage_Costs_User_Interface!BX10+1, \"\")","v":""},{"$f":"IF(COLUMN()-4<=Control_Panel!$D$7, Damage_Costs_User_Interface!BY10+1, \"\")","v":""},{"$f":"IF(COLUMN()-4<=Control_Panel!$D$7, Damage_Costs_User_Interface!BZ10+1, \"\")","v":""},{"$f":"IF(COLUMN()-4<=Control_Panel!$D$7, Damage_Costs_User_Interface!CA10+1, \"\")","v":""},{"$f":"IF(COLUMN()-4<=Control_Panel!$D$7, Damage_Costs_User_Interface!CB10+1, \"\")","v":""},{"$f":"IF(COLUMN()-4<=Control_Panel!$D$7, Damage_Costs_User_Interface!CC10+1, \"\")","v":""},{"$f":"IF(COLUMN()-4<=Control_Panel!$D$7, Damage_Costs_User_Interface!CD10+1, \"\")","v":""},{"$f":"IF(COLUMN()-4<=Control_Panel!$D$7, Damage_Costs_User_Interface!CE10+1, \"\")","v":""},{"$f":"IF(COLUMN()-4<=Control_Panel!$D$7, Damage_Costs_User_Interface!CF10+1, \"\")","v":""},{"$f":"IF(COLUMN()-4<=Control_Panel!$D$7, Damage_Costs_User_Interface!CG10+1, \"\")","v":""},{"$f":"IF(COLUMN()-4<=Control_Panel!$D$7, Damage_Costs_User_Interface!CH10+1, \"\")","v":""},{"$f":"IF(COLUMN()-4<=Control_Panel!$D$7, Damage_Costs_User_Interface!CI10+1, \"\")","v":""},{"$f":"IF(COLUMN()-4<=Control_Panel!$D$7, Damage_Costs_User_Interface!CJ10+1, \"\")","v":""},{"$f":"IF(COLUMN()-4<=Control_Panel!$D$7, Damage_Costs_User_Interface!CK10+1, \"\")","v":""},{"$f":"IF(COLUMN()-4<=Control_Panel!$D$7, Damage_Costs_User_Interface!CL10+1, \"\")","v":""},{"$f":"IF(COLUMN()-4<=Control_Panel!$D$7, Damage_Costs_User_Interface!CM10+1, \"\")","v":""},{"$f":"IF(COLUMN()-4<=Control_Panel!$D$7, Damage_Costs_User_Interface!CN10+1, \"\")","v":""},{"$f":"IF(COLUMN()-4<=Control_Panel!$D$7, Damage_Costs_User_Interface!CO10+1, \"\")","v":""},{"$f":"IF(COLUMN()-4<=Control_Panel!$D$7, Damage_Costs_User_Interface!CP10+1, \"\")","v":""},{"$f":"IF(COLUMN()-4<=Control_Panel!$D$7, Damage_Costs_User_Interface!CQ10+1, \"\")","v":""},{"$f":"IF(COLUMN()-4<=Control_Panel!$D$7, Damage_Costs_User_Interface!CR10+1, \"\")","v":""},{"$f":"IF(COLUMN()-4<=Control_Panel!$D$7, Damage_Costs_User_Interface!CS10+1, \"\")","v":""},{"$f":"IF(COLUMN()-4<=Control_Panel!$D$7, Damage_Costs_User_Interface!CT10+1, \"\")","v":""},{"$f":"IF(COLUMN()-4<=Control_Panel!$D$7, Damage_Costs_User_Interface!CU10+1, \"\")","v":""},{"$f":"IF(COLUMN()-4<=Control_Panel!$D$7, Damage_Costs_User_Interface!CV10+1, \"\")","v":""},{"$f":"IF(COLUMN()-4<=Control_Panel!$D$7, Damage_Costs_User_Interface!CW10+1, \"\")","v":""},{"$f":"IF(COLUMN()-4<=Control_Panel!$D$7, Damage_Costs_User_Interface!CX10+1, \"\")","v":""},{"$f":"IF(COLUMN()-4<=Control_Panel!$D$7, Damage_Costs_User_Interface!CY10+1, \"\")","v":""},{"$f":"IF(COLUMN()-4<=Control_Panel!$D$7, Damage_Costs_User_Interface!CZ10+1, \"\")","v":""},{"$f":"IF(COLUMN()-4<=Control_Panel!$D$7, Damage_Costs_User_Interface!DA10+1, \"\")","v":""},{"$f":"IF(COLUMN()-4<=Control_Panel!$D$7, Damage_Costs_User_Interface!DB10+1, \"\")","v":""},{"$f":"IF(COLUMN()-4<=Control_Panel!$D$7, Damage_Costs_User_Interface!DC10+1, \"\")","v":""},{"$f":"IF(COLUMN()-4<=Control_Panel!$D$7, Damage_Costs_User_Interface!DD10+1, \"\")","v":""},{"$f":"IF(COLUMN()-4<=Control_Panel!$D$7, Damage_Costs_User_Interface!DE10+1, \"\")","v":""},{"$f":"IF(COLUMN()-4<=Control_Panel!$D$7, Damage_Costs_User_Interface!DF10+1, \"\")","v":""},{"$f":"IF(COLUMN()-4<=Control_Panel!$D$7, Damage_Costs_User_Interface!DG10+1, \"\")","v":""},{"$f":"IF(COLUMN()-4<=Control_Panel!$D$7, Damage_Costs_User_Interface!DH10+1, \"\")","v":""},{"$f":"IF(COLUMN()-4<=Control_Panel!$D$7, Damage_Costs_User_Interface!DI10+1, \"\")","v":""},{"$f":"IF(COLUMN()-4<=Control_Panel!$D$7, Damage_Costs_User_Interface!DJ10+1, \"\")","v":""},{"$f":"IF(COLUMN()-4<=Control_Panel!$D$7, Damage_Costs_User_Interface!DK10+1, \"\")","v":""},{"$f":"IF(COLUMN()-4<=Control_Panel!$D$7, Damage_Costs_User_Interface!DL10+1, \"\")","v":""},{"$f":"IF(COLUMN()-4<=Control_Panel!$D$7, Damage_Costs_User_Interface!DM10+1, \"\")","v":""},{"$f":"IF(COLUMN()-4<=Control_Panel!$D$7, Damage_Costs_User_Interface!DN10+1, \"\")","v":""},{"$f":"IF(COLUMN()-4<=Control_Panel!$D$7, Damage_Costs_User_Interface!DO10+1, \"\")","v":""},{"$f":"IF(COLUMN()-4<=Control_Panel!$D$7, Damage_Costs_User_Interface!DP10+1, \"\")","v":""},{"$f":"IF(COLUMN()-4<=Control_Panel!$D$7, Damage_Costs_User_Interface!DQ10+1, \"\")","v":""},{"$f":"IF(COLUMN()-4<=Control_Panel!$D$7, Damage_Costs_User_Interface!DR10+1, \"\")","v":""},{"$f":"IF(COLUMN()-4<=Control_Panel!$D$7, Damage_Costs_User_Interface!DS10+1, \"\")","v":""},{"$f":"IF(COLUMN()-4<=Control_Panel!$D$7, Damage_Costs_User_Interface!DT10+1, \"\")","v":""},{"$f":"IF(COLUMN()-4<=Control_Panel!$D$7, Damage_Costs_User_Interface!DU10+1, \"\")","v":""},{"$f":"IF(COLUMN()-4<=Control_Panel!$D$7, Damage_Costs_User_Interface!DV10+1, \"\")","v":""},{"$f":"IF(COLUMN()-4<=Control_Panel!$D$7, Damage_Costs_User_Interface!DW10+1, \"\")","v":""},{"$f":"IF(COLUMN()-4<=Control_Panel!$D$7, Damage_Costs_User_Interface!DX10+1, \"\")","v":""},{"$f":"IF(COLUMN()-4<=Control_Panel!$D$7, Damage_Costs_User_Interface!DY10+1, \"\")","v":""}]
{"$rows_left_out":97}
{"sheet":"Outputs","index":4,"n_rows":8,"n_cols":5,"rows_kept":8,"cut":false,"hidden":false,"merged":[]}
["Outputs"]
[]
[null,"Pollutant","Low Sensitivity Present Value","Central Present Value","High Sensitivity Present Value"]
[null,{"$f":"IF(Damage_Costs_User_Interface!$E$3=\"\", \"\", Damage_Costs_User_Interface!$A$9)","v":"NOx Part A Category 1"},{"$f":"IF(Damage_Costs_User_Interface!$D$3=\"\", \"\", Damage_Costs_User_Interface!$E$21)","v":2259.4835886983406},{"$f":"IF(Damage_Costs_User_Interface!$D$3=\"\", \"\", Damage_Costs_User_Interface!$E$16)","v":6816.8764693677667},{"$f":"IF(Damage_Costs_User_Interface!$D$3=\"\", \"\", Damage_Costs_User_Interface!$E$26)","v":20599.667593336817}]
[null,{"$f":"IF(Damage_Costs_User_Interface!$L$3=\"\", \"\", Damage_Costs_User_Interface!$A$29)","v":""},{"$f":"IF(Damage_Costs_User_Interface!$K$3=\"\", \"\", Damage_Costs_User_Interface!$E$41)","v":""},{"$f":"IF(Damage_Costs_User_Interface!$K$3=\"\", \"\", Damage_Costs_User_Interface!$E$36)","v":""},{"$f":"IF(Damage_Costs_User_Interface!$K$3=\"\", \"\", Damage_Costs_User_Interface!$E$46)","v":""}]
[null,{"$f":"IF(Damage_Costs_User_Interface!$S$3=\"\", \"\", Damage_Costs_User_Interface!$A$49)","v":""},{"$f":"IF(Damage_Costs_User_Interface!$R$3=\"\", \"\", Damage_Costs_User_Interface!$E$61)","v":""},{"$f":"IF(Damage_Costs_User_Interface!$R$3=\"\", \"\", Damage_Costs_User_Interface!$E$56)","v":""},{"$f":"IF(Damage_Costs_User_Interface!$R$3=\"\", \"\", Damage_Costs_User_Interface!$E$66)","v":""}]
[null,{"$f":"IF(Damage_Costs_User_Interface!$E$5=\"\", \"\", Damage_Costs_User_Interface!$A$69)","v":""},{"$f":"IF(Damage_Costs_User_Interface!$D$5=\"\", \"\", Damage_Costs_User_Interface!$E$81)","v":""},{"$f":"IF(Damage_Costs_User_Interface!$D$5=\"\", \"\", Damage_Costs_User_Interface!$E$76)","v":""},{"$f":"IF(Damage_Costs_User_Interface!$D$5=\"\", \"\", Damage_Costs_User_Interface!$E$86)","v":""}]
[null,{"$f":"IF(Damage_Costs_User_Interface!$L$5=\"\", \"\", Damage_Costs_User_Interface!$A$89)","v":""},{"$f":"IF(Damage_Costs_User_Interface!$K$5=\"\", \"\", Damage_Costs_User_Interface!$E$101)","v":""},{"$f":"IF(Damage_Costs_User_Interface!$K$5=\"\", \"\", Damage_Costs_User_Interface!$E$96)","v":""},{"$f":"IF(Damage_Costs_User_Interface!$K$5=\"\", \"\", Damage_Costs_User_Interface!$E$106)","v":""}]

{"sheet":"Damage_Costs_and_Assumptions","index":5,"n_rows":120,"n_cols":130,"rows_kept":120,"cut":false,"hidden":false,"merged":[]}
["Damage Costs & Assumptions"]
[]
[]
[null,"Damage Cost Valuations (£/tonne, 2022 Prices)",null,null,null,null,"PM2.5/PM10 Conversion Factors",null,null,"Pollutants by Sector"]
[null,"Number","Pollutant Sector","Low Scenario","Central Scenario","High Scenario",null,null,null,"NOx ",null,"PM2.5",null,"SO2 ",null,"VOC ",null,"NH3"]
[]
[null,1,"NOx National",1567,8147.9880163615089,30281.532175757911,"-",null,null,"National",null,"National",null,"National",null,"National",null,"National"]
[null,2,"NOx Industry (area)",1619.4635247918857,8634.5371107316205,32297.640918465302,"-",null,null,"Industry (area)",null,"Industry (area)"]
[null,3,"NOx Commercial",2468.5350528593362,16582.532675271992,65231.672715223875,"-",null,null,"Commercial",null,"Commercial"]
[null,4,"NOx Domestic",2073.0811081535535,12880.764220433555,49892.690829048523,"-",null,null,"Domestic",null,"Domestic"]
{"$rows_left_out":110}