{"text_format":"1","workbook":"xlsx","n_sheets":12,"sheets":["Control","Stabilised Wast","Contaminants","Hydrogeology","Attenuation","WaterBalance","Pathways","Chalk nonhaz","Chalk haz","Simulation","Audit","user_results"],"not_rendered":{"charts":1,"images":3,"macros":1,"external_links":0,"defined_names":2718,"comments":0,"pivot_tables":0},"unopened":[],"bounds":{"document_bytes":16777216,"sheet_cells":100000,"rows_first":2000,"rows_last":500,"rows_between":2000,"halvings":0,"cell_chars":16384,"cell_head_chars":4096},"cells_cut":0,"cells_raw":0,"read":"whole","date_system":"1900"}

{"sheet":"Control","index":0,"n_rows":34,"n_cols":3,"rows_kept":34,"cut":false,"hidden":false,"merged":[]}
[]
[]
[]
[]
[]
[]
[]
[]
[]
[]
[]
[]
[]
[]
[]
[]
[]
[]
[]
[]
[]
[]
[]
[]
[]
[]
[]
[]
[]
[null,null,"Numerical value"]
[null,null,"Suggested formula"]
[null,null,"Probabilistic parameters"]
[null,null,"Data specified elsewhere"]
[null,null,"Suggested formula edited"]

{"sheet":"Stabilised Wast","index":1,"n_rows":131,"n_cols":10,"rows_kept":131,"cut":false,"hidden":true,"merged":[]}
["SOURCE CONCENTRATIONS: Stabilised Wast","SOIL SOURCE"]
[]
["Source Data Options","Source Type"]
[]
[]
[]
[]
[]
[]
[]
["Target Standard"]
[]
["Select which Quality Standard (defined on the Contaminants sheet) to apply"]
["Not Specified"]
[]
[]
["Source Geometry"]
[]
["Stabilised_Wast_Source_length",null,"m"]
["Stabilised_Wast_Source_width",null,"m"]
["Stabilised_Wast_Source_area",17418,"m2"]
["Stabilised_Wast_Source_thickness",1,"m"]
["Stabilised_Wast_Source_volume",{"$f":" Stabilised_Wast_Source_area * Stabilised_Wast_Source_thickness","v":17418},"m3"]
[]
[]
["General Source Properties"]
[]
["Stabilised_Wast_Source_field_capacity","[-]",0.1]
["Distribution",null,"constant"]
["Stabilised_Wast_Source_field_capacity_param1"]
["Stabilised_Wast_Source_field_capacity_param2"]
["Stabilised_Wast_Source_field_capacity_param3"]
[]
[]
["Stabilised_Wast_Source_porosity_total","[-]"]
["Distribution",null,"constant"]
["Stabilised_Wast_Source_porosity_total_param1"]
["Stabilised_Wast_Source_porosity_total_param2"]
["Stabilised_Wast_Source_porosity_total_param3"]
[]
[]
["Stabilised_Wast_Source_porosity_water_filled","[-]"]
["Distribution",null,"constant"]
["Stabilised_Wast_Source_porosity_water_filled_param1"]
["Stabilised_Wast_Source_porosity_water_filled_param2"]
["Stabilised_Wast_Source_porosity_water_filled_param3"]
[]
[]
["Stabilised_Wast_Source_porosity_air_filled","[-]",{"$f":" Stabilised_Wast_Source_porosity_total - Stabilised_Wast_Source_porosity_water_filled","v":0}]
["Distribution",null,"constant"]
["Stabilised_Wast_Source_porosity_air_filled_param1"]
["Stabilised_Wast_Source_porosity_air_filled_param2"]
["Stabilised_Wast_Source_porosity_air_filled_param3"]
[]
[]
["Stabilised_Wast_Source_dry_bulk_density","kg/m3"]
["Distribution",null,"constant"]
["Stabilised_Wast_Source_dry_bulk_density_param1"]
["Stabilised_Wast_Source_dry_bulk_density_param2"]
["Stabilised_Wast_Source_dry_bulk_density_param3"]
[]
[]
["Stabilised_Wast_Source_fraction_organic_carbon","[-]"]
["Distribution",null,"constant"]
["Stabilised_Wast_Source_fraction_organic_carbon_param1"]
["Stabilised_Wast_Source_fraction_organic_carbon_param2"]
["Stabilised_Wast_Source_fraction_organic_carbon_param3"]
[]
[]
[]
["Source Contaminant Information"]
[]
["Source determinand names",null,{"$f":" IF( ISTEXT( (Contaminants_Source_determinand_names Contaminants_Species1)), (Contaminants_Source_determinand_names Contaminants_Species1), \"Undefined\" )","v":"Cr"},{"$f":" IF( ISTEXT( (Contaminants_Source_determinand_names Contaminants_Species2)), (Contaminants_Source_determinand_names Contaminants_Species2), \"Undefined\" )","v":"Phenol"},{"$f":" IF( ISTEXT( (Contaminants_Source_determinand_names Contaminants_Species3)), (Contaminants_Source_determinand_names Contaminants_Species3), \"Undefined\" )","v":"Hg"},{"$f":" IF( ISTEXT( (Contaminants_Source_determinand_names Contaminants_Species4)), (Contaminants_Source_determinand_names Contaminants_Species4), \"Undefined\" )","v":"Pb"},{"$f":" IF( ISTEXT( (Contaminants_Source_determinand_names Contaminants_Species5)), (Contaminants_Source_determinand_names Contaminants_Species5), \"Undefined\" )","v":"Undefined"},{"$f":" IF( ISTEXT( (Contaminants_Source_determinand_names Contaminants_Species6)), (Contaminants_Source_determinand_names Contaminants_Species6), \"Undefined\" )","v":"Undefined"},{"$f":" IF( ISTEXT( (Contaminants_Source_determinand_names Contaminants_Species7)), (Contaminants_Source_determinand_names Contaminants_Species7), \"Undefined\" )","v":"Undefined"},{"$f":" IF( ISTEXT( (Contaminants_Source_determinand_names Contaminants_Species8)), (Contaminants_Source_determinand_names Contaminants_Species8), \"Undefined\" )","v":"Undefined"}]
[]
["Stabilised_Wast_Pore_water_concentration","mg/L",1.0999999999999999E-2,3.0000000000000001E-3,4.0000000000000003E-5,5.0000000000000001E-4]
["Distribution",null,"constant","constant","constant","constant","constant","constant","constant","constant"]
["Stabilised_Wast_Pore_water_concentration_param1"]
["Stabilised_Wast_Pore_water_concentration_param2"]
["Stabilised_Wast_Pore_water_concentration_param3"]
[]
[]
["Stabilised_Wast_Leaching_test_concentration","mg/L"]
["Distribution",null,"constant","constant","constant","constant","constant","constant","constant","constant"]
["Stabilised_Wast_Leaching_test_concentration_param1"]
["Stabilised_Wast_Leaching_test_concentration_param2"]
["Stabilised_Wast_Leaching_test_concentration_param3"]
[]
[]
["Stabilised_Wast_Soil_contaminant_concentration","mg/kg"]
["Distribution",null,"constant","constant","constant","constant","constant","constant","constant","constant"]
["Stabilised_Wast_Soil_contaminant_concentration_param1"]
["Stabilised_Wast_Soil_contaminant_concentration_param2"]
["Stabilised_Wast_Soil_contaminant_concentration_param3"]
[]
[]
["Stabilised_Wast_Source_solid_water_partitioning_coefficient_Kd","L/kg",{"$f":" (Contaminants_Organic_Carbon_Water_Partition_Coefficient_Koc  Contaminants_Species1) * ( Stabilised_Wast_Source_fraction_organic_carbon)","v":0},{"$f":" (Contaminants_Organic_Carbon_Water_Partition_Coefficient_Koc  Contaminants_Species2) * ( Stabilised_Wast_Source_fraction_organic_carbon)","v":0},{"$f":" (Contaminants_Organic_Carbon_Water_Partition_Coefficient_Koc  Contaminants_Species3) * ( Stabilised_Wast_Source_fraction_organic_carbon)","v":0},{"$f":" (Contaminants_Organic_Carbon_Water_Partition_Coefficient_Koc  Contaminants_Species4) * ( Stabilised_Wast_Source_fraction_organic_carbon)","v":0},{"$f":" (Contaminants_Organic_Carbon_Water_Partition_Coefficient_Koc  Contaminants_Species5) * ( Stabilised_Wast_Source_fraction_organic_carbon)","v":0},{"$f":" (Contaminants_Organic_Carbon_Water_Partition_Coefficient_Koc  Contaminants_Species6) * ( Stabilised_Wast_Source_fraction_organic_carbon)","v":0},{"$f":" (Contaminants_Organic_Carbon_Water_Partition_Coefficient_Koc  Contaminants_Species7) * ( Stabilised_Wast_Source_fraction_organic_carbon)","v":0},{"$f":" (Contaminants_Organic_Carbon_Water_Partition_Coefficient_Koc  Contaminants_Species8) * ( Stabilised_Wast_Source_fraction_organic_carbon)","v":0}]
["Distribution",null,"constant","constant","constant","constant","constant","constant","constant","constant"]
["Stabilised_Wast_Source_solid_water_partitioning_coefficient_Kd_param1"]
["Stabilised_Wast_Source_solid_water_partitioning_coefficient_Kd_param2"]
["Stabilised_Wast_Source_solid_water_partitioning_coefficient_Kd_param3"]
[]
[]
["Stabilised_Wast_Initial_inventory","kg",{"$f":" 0.001 * (Stabilised_Wast_Pore_water_concentration) * (Stabilised_Wast_Source_field_capacity) * (Stabilised_Wast_Source_volume)","v":1.9159800000000001E-2},5.2254000000000007E-3,6.9672000000000006E-5,8.7089999999999997E-4,0,0,0,0]
["Distribution",null,"constant","constant","constant","constant","constant","constant","constant","constant"]
["Stabilised_Wast_Initial_inventory_param1"]
["Stabilised_Wast_Initial_inventory_param2"]
["Stabilised_Wast_Initial_inventory_param3"]
[]
[]
["Stabilised_Wast_Kappa_slope_value_m","kg/L"]
["Distribution",null,"constant","constant","constant","constant","constant","constant","constant","constant"]
["Stabilised_Wast_Kappa_slope_value_m_param1"]
["Stabilised_Wast_Kappa_slope_value_m_param2"]
["Stabilised_Wast_Kappa_slope_value_m_param3"]
[]
[]
["Stabilised_Wast_Kappa_intercept_value_c","kg/L"]
["Distribution",null,"constant","constant","constant","constant","constant","constant","constant","constant"]
["Stabilised_Wast_Kappa_intercept_value_c_param1"]
["Stabilised_Wast_Kappa_intercept_value_c_param2"]
["Stabilised_Wast_Kappa_intercept_value_c_param3"]
[]
[]
["Stabilised_Wast_Kappa_Value","kg/L",{"$f":" IF(AND(ISNUMBER(Stabilised_Wast_Kappa_slope_value_m),ISNUMBER(Stabilised_Wast_Kappa_intercept_value_c),ISNUMBER(Stabilised_Wast_Input_concentration)), IF(Stabilised_Wast_Input_concentration>0,MAX(0,Stabilised_Wast_Kappa_slope_value_m * LN(1000 * Stabilised_Wast_Input_concentration) + Stabilised_Wast_Kappa_intercept_value_c),\"\"),\"Not-used\")","v":"Not-used"},"Not-used","Not-used","Not-used","Not-used","Not-used","Not-used","Not-used"]
["Distribution",null,"constant","constant","constant","constant","constant","constant","constant","constant"]
["Stabilised_Wast_Kappa_Value_param1"]
["Stabilised_Wast_Kappa_Value_param2"]
["Stabilised_Wast_Kappa_Value_param3"]
[]
[]
["Stabilised_Wast_Input_concentration","mg/L",{"$f":" (Stabilised_Wast_Pore_water_concentration)","v":1.0999999999999999E-2},3.0000000000000001E-3,4.0000000000000003E-5,5.0000000000000001E-4,0,0,0,0]

{"sheet":"Contaminants","index":2,"n_rows":42,"n_cols":11,"rows_kept":42,"cut":false,"hidden":false,"merged":[]}
["CONTAMINANT INFORMATION"]
[]
[null,null,null,"Species1","Species2","Species3","Species4","Species5","Species6","Species7","Species8"]
["Source determinand names",null,4,"Cr","Phenol","Hg","Pb"]
[]
[]
["Receptor Target Concentrations"]
[null,"Name",null,"Values in mg/L"]
["Quality Standard 1  ","EAL",null,1E-3,5.0000000000000001E-4,2.0000000000000002E-5,2.0000000000000001E-4]
["Quality Standard 2  "]
["Quality Standard 3  "]
["Quality Standard 4  "]
[null,"Not Specified"]
[]
["Generic Contaminant Properties"]
[]
["Contaminants_Solubility","mg/L"]
["Distribution",null,null,"constant","constant","constant","constant","constant","constant","constant","constant"]
["Contaminants_Solubility_param1"]
["Contaminants_Solubility_param2"]
["Contaminants_Solubility_param3"]
[]
[]
["Contaminants_Henrys_Law_Constant","[-]"]
["Distribution",null,null,"constant","constant","constant","constant","constant","constant","constant","constant"]
["Contaminants_Henrys_Law_Constant_param1"]
["Contaminants_Henrys_Law_Constant_param2"]
["Contaminants_Henrys_Law_Constant_param3"]
[]
[]
["Contaminants_Organic_Carbon_Water_Partition_Coefficient_Koc","L/kg"]
["Distribution",null,null,"constant","constant","constant","constant","constant","constant","constant","constant"]
["Contaminants_Organic_Carbon_Water_Partition_Coefficient_Koc_param1"]
["Contaminants_Organic_Carbon_Water_Partition_Coefficient_Koc_param2"]
["Contaminants_Organic_Carbon_Water_Partition_Coefficient_Koc_param3"]
[]
[]
["Contaminants_Free_Water_Diffusion_Coefficient","m2/s"]
["Distribution",null,null,"constant","constant","constant","constant","constant","constant","constant","constant"]
["Contaminants_Free_Water_Diffusion_Coefficient_param1"]
["Contaminants_Free_Water_Diffusion_Coefficient_param2"]
["Contaminants_Free_Water_Diffusion_Coefficient_param3"]

{"sheet":"Hydrogeology","index":3,"n_rows":58,"n_cols":18,"rows_kept":58,"cut":false,"hidden":false,"merged":[]}
["HYDROGEOLOGICAL UNITS"]
[]
["Hydrogeological Units",null,"Unsat MG","Sat MG","Alluvium","Chalk"]
[]
["Hydrogeology_Unit_Thickness","m",{"$f":"mAOD-h_mg","v":0.98926489965019071},{"$f":"h_mg-B_mg","v":1.0107351003498093},{"$f":"t_al","v":3},{"$f":"t_ck","v":50}]
["Distribution",null,"constant","constant","constant","constant","constant","constant","constant","constant","constant","constant","constant","constant","constant","constant","constant","constant"]
["Hydrogeology_Unit_Thickness_param1"]
["Hydrogeology_Unit_Thickness_param2"]
["Hydrogeology_Unit_Thickness_param3"]
[]
[]
["Hydrogeology_Log_Hydraulic_Conductivity","log(m/s)"]
["Distribution",null,"constant","constant","constant","constant","constant","constant","constant","constant","constant","constant","constant","constant","constant","constant","constant","constant"]
["Hydrogeology_Log_Hydraulic_Conductivity_param1"]
["Hydrogeology_Log_Hydraulic_Conductivity_param2"]
["Hydrogeology_Log_Hydraulic_Conductivity_param3"]
[]
[]
["Hydrogeology_Hydraulic_Conductivity","m/s",{"$f":" POWER(10, (Hydrogeology_Log_Hydraulic_Conductivity))","v":1},{"$f":"K_mg","v":1.0000000000000001E-5},{"$f":"K_al","v":1E-8},{"$f":"k_ck","v":5.7870370370370373E-5},1,1,1,1,1,1,1,1,1,1,1,1]
["Distribution",null,"constant","constant","constant","constant","constant","constant","constant","constant","constant","constant","constant","constant","constant","constant","constant","constant"]
["Hydrogeology_Hydraulic_Conductivity_param1"]
["Hydrogeology_Hydraulic_Conductivity_param2"]
["Hydrogeology_Hydraulic_Conductivity_param3"]
[]
[]
["Hydrogeology_Head","m"]
["Distribution",null,"constant","constant","constant","constant","constant","constant","constant","constant","constant","constant","constant","constant","constant","constant","constant","constant"]
["Hydrogeology_Head_param1"]
["Hydrogeology_Head_param2"]
["Hydrogeology_Head_param3"]
[]
[]
["Hydrogeology_Hydraulic_Gradient","[-]"]
["Distribution",null,"constant","constant","constant","constant","constant","constant","constant","constant","constant","constant","constant","constant","constant","constant","constant","constant"]
["Hydrogeology_Hydraulic_Gradient_param1"]
["Hydrogeology_Hydraulic_Gradient_param2"]
["Hydrogeology_Hydraulic_Gradient_param3"]
[]
[]
["Hydrogeology_Porosity","[-]",0.1,0.1,0.01,0.1]
["Distribution",null,"constant","constant","constant","constant","constant","constant","constant","constant","constant","constant","constant","constant","constant","constant","constant","constant"]
["Hydrogeology_Porosity_param1"]
["Hydrogeology_Porosity_param2"]
["Hydrogeology_Porosity_param3"]
[]
[]
["Hydrogeology_Velocity","m/s",{"$f":" (Hydrogeology_Hydraulic_Conductivity) * (Hydrogeology_Hydraulic_Gradient) / (Hydrogeology_Porosity)","v":0},0,0,0,{"$error":"#DIV/0!"},{"$error":"#DIV/0!"},{"$error":"#DIV/0!"},{"$error":"#DIV/0!"},{"$error":"#DIV/0!"},{"$error":"#DIV/0!"},{"$error":"#DIV/0!"},{"$error":"#DIV/0!"},{"$error":"#DIV/0!"},{"$error":"#DIV/0!"},{"$error":"#DIV/0!"},{"$error":"#DIV/0!"}]
["Distribution",null,"constant","constant","constant","constant","constant","constant","constant","constant","constant","constant","constant","constant","constant","constant","constant","constant"]
["Hydrogeology_Velocity_param1"]
["Hydrogeology_Velocity_param2"]
["Hydrogeology_Velocity_param3"]
[]
[]
["Hydrogeology_Tortuosity","[-]"]
["Distribution",null,"constant","constant","constant","constant","constant","constant","constant","constant","constant","constant","constant","constant","constant","constant","constant","constant"]
["Hydrogeology_Tortuosity_param1"]
["Hydrogeology_Tortuosity_param2"]
["Hydrogeology_Tortuosity_param3"]

{"sheet":"Attenuation","index":4,"n_rows":261,"n_cols":18,"rows_kept":261,"cut":false,"hidden":false,"merged":[]}
["ATTENUATION PARAMETERS"]
[]
["Hydrogeological Units",null,"Unsat MG","Sat MG","Alluvium","Chalk"]
[]
["General properties"]
[]
["Attenuation_Dry_bulk_density","kg/m3",1800,1800,1800,1800]
["Distribution",null,"constant","constant","constant","constant","constant","constant","constant","constant","constant","constant","constant","constant","constant","constant","constant","constant"]
["Attenuation_Dry_bulk_density_param1"]
["Attenuation_Dry_bulk_density_param2"]
["Attenuation_Dry_bulk_density_param3"]
[]
[]
["Attenuation_Fraction_organic_carbon","[-]"]
["Distribution",null,"constant","constant","constant","constant","constant","constant","constant","constant","constant","constant","constant","constant","constant","constant","constant","constant"]
["Attenuation_Fraction_organic_carbon_param1"]
["Attenuation_Fraction_organic_carbon_param2"]
["Attenuation_Fraction_organic_carbon_param3"]
[]
[]
[]
["Contaminant specific parameters"]
[]
[{"$f":" IF((Contaminants_Source_determinand_names   Contaminants_Species1)=0,\"Undefined\",(Contaminants_Source_determinand_names   Contaminants_Species1))","v":"Cr"}]
[]
["Attenuation_Partition_Coefficient_Kd_Species_1","L/kg",2200,{"$f":"C26","v":2200},{"$f":"C26","v":2200},{"$f":"C26","v":2200},{"$f":" (Attenuation_Fraction_organic_carbon) * (Contaminants_Organic_Carbon_Water_Partition_Coefficient_Koc  Contaminants_Species1)","v":0},{"$f":" (Attenuation_Fraction_organic_carbon) * (Contaminants_Organic_Carbon_Water_Partition_Coefficient_Koc  Contaminants_Species1)","v":0},{"$f":" (Attenuation_Fraction_organic_carbon) * (Contaminants_Organic_Carbon_Water_Partition_Coefficient_Koc  Contaminants_Species1)","v":0},{"$f":" (Attenuation_Fraction_organic_carbon) * (Contaminants_Organic_Carbon_Water_Partition_Coefficient_Koc  Contaminants_Species1)","v":0},{"$f":" (Attenuation_Fraction_organic_carbon) * (Contaminants_Organic_Carbon_Water_Partition_Coefficient_Koc  Contaminants_Species1)","v":0},{"$f":" (Attenuation_Fraction_organic_carbon) * (Contaminants_Organic_Carbon_Water_Partition_Coefficient_Koc  Contaminants_Species1)","v":0},{"$f":" (Attenuation_Fraction_organic_carbon) * (Contaminants_Organic_Carbon_Water_Partition_Coefficient_Koc  Contaminants_Species1)","v":0},{"$f":" (Attenuation_Fraction_organic_carbon) * (Contaminants_Organic_Carbon_Water_Partition_Coefficient_Koc  Contaminants_Species1)","v":0},{"$f":" (Attenuation_Fraction_organic_carbon) * (Contaminants_Organic_Carbon_Water_Partition_Coefficient_Koc  Contaminants_Species1)","v":0},{"$f":" (Attenuation_Fraction_organic_carbon) * (Contaminants_Organic_Carbon_Water_Partition_Coefficient_Koc  Contaminants_Species1)","v":0},{"$f":" (Attenuation_Fraction_organic_carbon) * (Contaminants_Organic_Carbon_Water_Partition_Coefficient_Koc  Contaminants_Species1)","v":0},{"$f":" (Attenuation_Fraction_organic_carbon) * (Contaminants_Organic_Carbon_Water_Partition_Coefficient_Koc  Contaminants_Species1)","v":0}]
["Distribution",null,"constant","constant","constant","constant","constant","constant","constant","constant","constant","constant","constant","constant","constant","constant","constant","constant"]
["Attenuation_Partition_Coefficient_Kd_Species_1_param1"]
["Attenuation_Partition_Coefficient_Kd_Species_1_param2"]
["Attenuation_Partition_Coefficient_Kd_Species_1_param3"]
[]
[]
["Attenuation_Retardation_Species_1","[-]",{"$f":" 1 + 0.001 * (Attenuation_Partition_Coefficient_Kd_Species_1) * (Attenuation_Dry_bulk_density) / (Hydrogeology_Porosity    Hydrogeology!$C:$C)","v":39601},{"$f":" 1 + 0.001 * (Attenuation_Partition_Coefficient_Kd_Species_1) * (Attenuation_Dry_bulk_density) / (Hydrogeology_Porosity    Hydrogeology!$D:$D)","v":39601},{"$f":" 1 + 0.001 * (Attenuation_Partition_Coefficient_Kd_Species_1) * (Attenuation_Dry_bulk_density) / (Hydrogeology_Porosity    Hydrogeology!$E:$E)","v":396001.00000000006},{"$f":" 1 + 0.001 * (Attenuation_Partition_Coefficient_Kd_Species_1) * (Attenuation_Dry_bulk_density) / (Hydrogeology_Porosity    Hydrogeology!$F:$F)","v":39601},{"$f":" 1 + 0.001 * (Attenuation_Partition_Coefficient_Kd_Species_1) * (Attenuation_Dry_bulk_density) / (Hydrogeology_Porosity    Hydrogeology!$G:$G)","v":{"$error":"#DIV/0!"}},{"$f":" 1 + 0.001 * (Attenuation_Partition_Coefficient_Kd_Species_1) * (Attenuation_Dry_bulk_density) / (Hydrogeology_Porosity    Hydrogeology!$H:$H)","v":{"$error":"#DIV/0!"}},{"$f":" 1 + 0.001 * (Attenuation_Partition_Coefficient_Kd_Species_1) * (Attenuation_Dry_bulk_density) / (Hydrogeology_Porosity    Hydrogeology!$I:$I)","v":{"$error":"#DIV/0!"}},{"$f":" 1 + 0.001 * (Attenuation_Partition_Coefficient_Kd_Species_1) * (Attenuation_Dry_bulk_density) / (Hydrogeology_Porosity    Hydrogeology!$J:$J)","v":{"$error":"#DIV/0!"}},{"$f":" 1 + 0.001 * (Attenuation_Partition_Coefficient_Kd_Species_1) * (Attenuation_Dry_bulk_density) / (Hydrogeology_Porosity    Hydrogeology!$K:$K)","v":{"$error":"#DIV/0!"}},{"$f":" 1 + 0.001 * (Attenuation_Partition_Coefficient_Kd_Species_1) * (Attenuation_Dry_bulk_density) / (Hydrogeology_Porosity    Hydrogeology!$L:$L)","v":{"$error":"#DIV/0!"}},{"$f":" 1 + 0.001 * (Attenuation_Partition_Coefficient_Kd_Species_1) * (Attenuation_Dry_bulk_density) / (Hydrogeology_Porosity    Hydrogeology!$M:$M)","v":{"$error":"#DIV/0!"}},{"$f":" 1 + 0.001 * (Attenuation_Partition_Coefficient_Kd_Species_1) * (Attenuation_Dry_bulk_density) / (Hydrogeology_Porosity    Hydrogeology!$N:$N)","v":{"$error":"#DIV/0!"}},{"$f":" 1 + 0.001 * (Attenuation_Partition_Coefficient_Kd_Species_1) * (Attenuation_Dry_bulk_density) / (Hydrogeology_Porosity    Hydrogeology!$O:$O)","v":{"$error":"#DIV/0!"}},{"$f":" 1 + 0.001 * (Attenuation_Partition_Coefficient_Kd_Species_1) * (Attenuation_Dry_bulk_density) / (Hydrogeology_Porosity    Hydrogeology!$P:$P)","v":{"$error":"#DIV/0!"}},{"$f":" 1 + 0.001 * (Attenuation_Partition_Coefficient_Kd_Species_1) * (Attenuation_Dry_bulk_density) / (Hydrogeology_Porosity    Hydrogeology!$Q:$Q)","v":{"$error":"#DIV/0!"}},{"$f":" 1 + 0.001 * (Attenuation_Partition_Coefficient_Kd_Species_1) * (Attenuation_Dry_bulk_density) / (Hydrogeology_Porosity    Hydrogeology!$R:$R)","v":{"$error":"#DIV/0!"}}]
["Distribution",null,"constant","constant","constant","constant","constant","constant","constant","constant","constant","constant","constant","constant","constant","constant","constant","constant"]
["Attenuation_Retardation_Species_1_param1"]
["Attenuation_Retardation_Species_1_param2"]
["Attenuation_Retardation_Species_1_param3"]
[]
[]
["Attenuation_Half_Life_Species_1","days","No Decay","No Decay","No Decay","No Decay","No Decay","No Decay","No Decay","No Decay","No Decay","No Decay","No Decay","No Decay","No Decay","No Decay","No Decay","No Decay"]
["Distribution",null,"constant","constant","constant","constant","constant","constant","constant","constant","constant","constant","constant","constant","constant","constant","constant","constant"]
["Attenuation_Half_Life_Species_1_param1"]
["Attenuation_Half_Life_Species_1_param2"]
["Attenuation_Half_Life_Species_1_param3"]
[]
[]
["Attenuation_Decay_Coefficient_Species_1","1/s",{"$f":" IF((_xlfn.SINGLE(Attenuation_Half_Life_Species_1))<>\"No Decay\", LN(2) / ((_xlfn.SINGLE(Attenuation_Half_Life_Species_1)) *_xlfn.SINGLE( s_per_day)),0)","v":0},0,0,0,0,0,0,0,0,0,0,0,0,0,0,0]
["Distribution",null,"constant","constant","constant","constant","constant","constant","constant","constant","constant","constant","constant","constant","constant","constant","constant","constant"]
["Attenuation_Decay_Coefficient_Species_1_param1"]
["Attenuation_Decay_Coefficient_Species_1_param2"]
["Attenuation_Decay_Coefficient_Species_1_param3"]
[]
[]
[{"$f":" IF((Contaminants_Source_determinand_names   Contaminants_Species2)=0,\"Undefined\",(Contaminants_Source_determinand_names   Contaminants_Species2))","v":"Phenol"}]
[]
["Attenuation_Partition_Coefficient_Kd_Species_2","L/kg",0.22,{"$f":"C56","v":0.22},{"$f":"C56","v":0.22},{"$f":"C56","v":0.22},{"$f":" (Attenuation_Fraction_organic_carbon) * (Contaminants_Organic_Carbon_Water_Partition_Coefficient_Koc  Contaminants_Species2)","v":0},{"$f":" (Attenuation_Fraction_organic_carbon) * (Contaminants_Organic_Carbon_Water_Partition_Coefficient_Koc  Contaminants_Species2)","v":0},{"$f":" (Attenuation_Fraction_organic_carbon) * (Contaminants_Organic_Carbon_Water_Partition_Coefficient_Koc  Contaminants_Species2)","v":0},{"$f":" (Attenuation_Fraction_organic_carbon) * (Contaminants_Organic_Carbon_Water_Partition_Coefficient_Koc  Contaminants_Species2)","v":0},{"$f":" (Attenuation_Fraction_organic_carbon) * (Contaminants_Organic_Carbon_Water_Partition_Coefficient_Koc  Contaminants_Species2)","v":0},{"$f":" (Attenuation_Fraction_organic_carbon) * (Contaminants_Organic_Carbon_Water_Partition_Coefficient_Koc  Contaminants_Species2)","v":0},{"$f":" (Attenuation_Fraction_organic_carbon) * (Contaminants_Organic_Carbon_Water_Partition_Coefficient_Koc  Contaminants_Species2)","v":0},{"$f":" (Attenuation_Fraction_organic_carbon) * (Contaminants_Organic_Carbon_Water_Partition_Coefficient_Koc  Contaminants_Species2)","v":0},{"$f":" (Attenuation_Fraction_organic_carbon) * (Contaminants_Organic_Carbon_Water_Partition_Coefficient_Koc  Contaminants_Species2)","v":0},{"$f":" (Attenuation_Fraction_organic_carbon) * (Contaminants_Organic_Carbon_Water_Partition_Coefficient_Koc  Contaminants_Species2)","v":0},{"$f":" (Attenuation_Fraction_organic_carbon) * (Contaminants_Organic_Carbon_Water_Partition_Coefficient_Koc  Contaminants_Species2)","v":0},{"$f":" (Attenuation_Fraction_organic_carbon) * (Contaminants_Organic_Carbon_Water_Partition_Coefficient_Koc  Contaminants_Species2)","v":0}]
["Distribution",null,"constant","constant","constant","constant","constant","constant","constant","constant","constant","constant","constant","constant","constant","constant","constant","constant"]
["Attenuation_Partition_Coefficient_Kd_Species_2_param1"]
["Attenuation_Partition_Coefficient_Kd_Species_2_param2"]
["Attenuation_Partition_Coefficient_Kd_Species_2_param3"]
[]
[]
["Attenuation_Retardation_Species_2","[-]",{"$f":" 1 + 0.001 * (Attenuation_Partition_Coefficient_Kd_Species_2) * (Attenuation_Dry_bulk_density) / (Hydrogeology_Porosity    Hydrogeology!$C:$C)","v":4.96},{"$f":" 1 + 0.001 * (Attenuation_Partition_Coefficient_Kd_Species_2) * (Attenuation_Dry_bulk_density) / (Hydrogeology_Porosity    Hydrogeology!$D:$D)","v":4.96},{"$f":" 1 + 0.001 * (Attenuation_Partition_Coefficient_Kd_Species_2) * (Attenuation_Dry_bulk_density) / (Hydrogeology_Porosity    Hydrogeology!$E:$E)","v":40.6},{"$f":" 1 + 0.001 * (Attenuation_Partition_Coefficient_Kd_Species_2) * (Attenuation_Dry_bulk_density) / (Hydrogeology_Porosity    Hydrogeology!$F:$F)","v":4.96},{"$f":" 1 + 0.001 * (Attenuation_Partition_Coefficient_Kd_Species_2) * (Attenuation_Dry_bulk_density) / (Hydrogeology_Porosity    Hydrogeology!$G:$G)","v":{"$error":"#DIV/0!"}},{"$f":" 1 + 0.001 * (Attenuation_Partition_Coefficient_Kd_Species_2) * (Attenuation_Dry_bulk_density) / (Hydrogeology_Porosity    Hydrogeology!$H:$H)","v":{"$error":"#DIV/0!"}},{"$f":" 1 + 0.001 * (Attenuation_Partition_Coefficient_Kd_Species_2) * (Attenuation_Dry_bulk_density) / (Hydrogeology_Porosity    Hydrogeology!$I:$I)","v":{"$error":"#DIV/0!"}},{"$f":" 1 + 0.001 * (Attenuation_Partition_Coefficient_Kd_Species_2) * (Attenuation_Dry_bulk_density) / (Hydrogeology_Porosity    Hydrogeology!$J:$J)","v":{"$error":"#DIV/0!"}},{"$f":" 1 + 0.001 * (Attenuation_Partition_Coefficient_Kd_Species_2) * (Attenuation_Dry_bulk_density) / (Hydrogeology_Porosity    Hydrogeology!$K:$K)","v":{"$error":"#DIV/0!"}},{"$f":" 1 + 0.001 * (Attenuation_Partition_Coefficient_Kd_Species_2) * (Attenuation_Dry_bulk_density) / (Hydrogeology_Porosity    Hydrogeology!$L:$L)","v":{"$error":"#DIV/0!"}},{"$f":" 1 + 0.001 * (Attenuation_Partition_Coefficient_Kd_Species_2) * (Attenuation_Dry_bulk_density) / (Hydrogeology_Porosity    Hydrogeology!$M:$M)","v":{"$error":"#DIV/0!"}},{"$f":" 1 + 0.001 * (Attenuation_Partition_Coefficient_Kd_Species_2) * (Attenuation_Dry_bulk_density) / (Hydrogeology_Porosity    Hydrogeology!$N:$N)","v":{"$error":"#DIV/0!"}},{"$f":" 1 + 0.001 * (Attenuation_Partition_Coefficient_Kd_Species_2) * (Attenuation_Dry_bulk_density) / (Hydrogeology_Porosity    Hydrogeology!$O:$O)","v":{"$error":"#DIV/0!"}},{"$f":" 1 + 0.001 * (Attenuation_Partition_Coefficient_Kd_Species_2) * (Attenuation_Dry_bulk_density) / (Hydrogeology_Porosity    Hydrogeology!$P:$P)","v":{"$error":"#DIV/0!"}},{"$f":" 1 + 0.001 * (Attenuation_Partition_Coefficient_Kd_Species_2) * (Attenuation_Dry_bulk_density) / (Hydrogeology_Porosity    Hydrogeology!$Q:$Q)","v":{"$error":"#DIV/0!"}},{"$f":" 1 + 0.001 * (Attenuation_Partition_Coefficient_Kd_Species_2) * (Attenuation_Dry_bulk_density) / (Hydrogeology_Porosity    Hydrogeology!$R:$R)","v":{"$error":"#DIV/0!"}}]
["Distribution",null,"constant","constant","constant","constant","constant","constant","constant","constant","constant","constant","constant","constant","constant","constant","constant","constant"]
["Attenuation_Retardation_Species_2_param1"]
["Attenuation_Retardation_Species_2_param2"]
["Attenuation_Retardation_Species_2_param3"]
[]
[]
["Attenuation_Half_Life_Species_2","days",100,{"$f":"C70","v":100},{"$f":"C70","v":100},{"$f":"C70","v":100},"No Decay","No Decay","No Decay","No Decay","No Decay","No Decay","No Decay","No Decay","No Decay","No Decay","No Decay","No Decay"]
["Distribution",null,"constant","constant","constant","constant","constant","constant","constant","constant","constant","constant","constant","constant","constant","constant","constant","constant"]
["Attenuation_Half_Life_Species_2_param1"]
["Attenuation_Half_Life_Species_2_param2"]
["Attenuation_Half_Life_Species_2_param3"]
[]
[]
["Attenuation_Decay_Coefficient_Species_2","1/s",{"$f":" IF((_xlfn.SINGLE(Attenuation_Half_Life_Species_2))<>\"No Decay\", LN(2) / ((_xlfn.SINGLE(Attenuation_Half_Life_Species_2)) *_xlfn.SINGLE( s_per_day)),0)","v":8.0225368120364034E-8},8.0225368120364034E-8,8.0225368120364034E-8,8.0225368120364034E-8,0,0,0,0,0,0,0,0,0,0,0,0]
["Distribution",null,"constant","constant","constant","constant","constant","constant","constant","constant","constant","constant","constant","constant","constant","constant","constant","constant"]
["Attenuation_Decay_Coefficient_Species_2_param1"]
["Attenuation_Decay_Coefficient_Species_2_param2"]
["Attenuation_Decay_Coefficient_Species_2_param3"]
[]
[]
[{"$f":" IF((Contaminants_Source_determinand_names   Contaminants_Species3)=0,\"Undefined\",(Contaminants_Source_determinand_names   Contaminants_Species3))","v":"Hg"}]
[]
["Attenuation_Partition_Coefficient_Kd_Species_3","L/kg",2143,{"$f":"C86","v":2143},{"$f":"C86","v":2143},{"$f":"C86","v":2143},{"$f":" (Attenuation_Fraction_organic_carbon) * (Contaminants_Organic_Carbon_Water_Partition_Coefficient_Koc  Contaminants_Species3)","v":0},{"$f":" (Attenuation_Fraction_organic_carbon) * (Contaminants_Organic_Carbon_Water_Partition_Coefficient_Koc  Contaminants_Species3)","v":0},{"$f":" (Attenuation_Fraction_organic_carbon) * (Contaminants_Organic_Carbon_Water_Partition_Coefficient_Koc  Contaminants_Species3)","v":0},{"$f":" (Attenuation_Fraction_organic_carbon) * (Contaminants_Organic_Carbon_Water_Partition_Coefficient_Koc  Contaminants_Species3)","v":0},{"$f":" (Attenuation_Fraction_organic_carbon) * (Contaminants_Organic_Carbon_Water_Partition_Coefficient_Koc  Contaminants_Species3)","v":0},{"$f":" (Attenuation_Fraction_organic_carbon) * (Contaminants_Organic_Carbon_Water_Partition_Coefficient_Koc  Contaminants_Species3)","v":0},{"$f":" (Attenuation_Fraction_organic_carbon) * (Contaminants_Organic_Carbon_Water_Partition_Coefficient_Koc  Contaminants_Species3)","v":0},{"$f":" (Attenuation_Fraction_organic_carbon) * (Contaminants_Organic_Carbon_Water_Partition_Coefficient_Koc  Contaminants_Species3)","v":0},{"$f":" (Attenuation_Fraction_organic_carbon) * (Contaminants_Organic_Carbon_Water_Partition_Coefficient_Koc  Contaminants_Species3)","v":0},{"$f":" (Attenuation_Fraction_organic_carbon) * (Contaminants_Organic_Carbon_Water_Partition_Coefficient_Koc  Contaminants_Species3)","v":0},{"$f":" (Attenuation_Fraction_organic_carbon) * (Contaminants_Organic_Carbon_Water_Partition_Coefficient_Koc  Contaminants_Species3)","v":0},{"$f":" (Attenuation_Fraction_organic_carbon) * (Contaminants_Organic_Carbon_Water_Partition_Coefficient_Koc  Contaminants_Species3)","v":0}]
["Distribution",null,"constant","constant","constant","constant","constant","constant","constant","constant","constant","constant","constant","constant","constant","constant","constant","constant"]
["Attenuation_Partition_Coefficient_Kd_Species_3_param1"]
["Attenuation_Partition_Coefficient_Kd_Species_3_param2"]
["Attenuation_Partition_Coefficient_Kd_Species_3_param3"]
[]
[]
["Attenuation_Retardation_Species_3","[-]",{"$f":" 1 + 0.001 * (Attenuation_Partition_Coefficient_Kd_Species_3) * (Attenuation_Dry_bulk_density) / (Hydrogeology_Porosity    Hydrogeology!$C:$C)","v":38575},{"$f":" 1 + 0.001 * (Attenuation_Partition_Coefficient_Kd_Species_3) * (Attenuation_Dry_bulk_density) / (Hydrogeology_Porosity    Hydrogeology!$D:$D)","v":38575},{"$f":" 1 + 0.001 * (Attenuation_Partition_Coefficient_Kd_Species_3) * (Attenuation_Dry_bulk_density) / (Hydrogeology_Porosity    Hydrogeology!$E:$E)","v":385741.00000000006},{"$f":" 1 + 0.001 * (Attenuation_Partition_Coefficient_Kd_Species_3) * (Attenuation_Dry_bulk_density) / (Hydrogeology_Porosity    Hydrogeology!$F:$F)","v":38575},{"$f":" 1 + 0.001 * (Attenuation_Partition_Coefficient_Kd_Species_3) * (Attenuation_Dry_bulk_density) / (Hydrogeology_Porosity    Hydrogeology!$G:$G)","v":{"$error":"#DIV/0!"}},{"$f":" 1 + 0.001 * (Attenuation_Partition_Coefficient_Kd_Species_3) * (Attenuation_Dry_bulk_density) / (Hydrogeology_Porosity    Hydrogeology!$H:$H)","v":{"$error":"#DIV/0!"}},{"$f":" 1 + 0.001 * (Attenuation_Partition_Coefficient_Kd_Species_3) * (Attenuation_Dry_bulk_density) / (Hydrogeology_Porosity    Hydrogeology!$I:$I)","v":{"$error":"#DIV/0!"}},{"$f":" 1 + 0.001 * (Attenuation_Partition_Coefficient_Kd_Species_3) * (Attenuation_Dry_bulk_density) / (Hydrogeology_Porosity    Hydrogeology!$J:$J)","v":{"$error":"#DIV/0!"}},{"$f":" 1 + 0.001 * (Attenuation_Partition_Coefficient_Kd_Species_3) * (Attenuation_Dry_bulk_density) / (Hydrogeology_Porosity    Hydrogeology!$K:$K)","v":{"$error":"#DIV/0!"}},{"$f":" 1 + 0.001 * (Attenuation_Partition_Coefficient_Kd_Species_3) * (Attenuation_Dry_bulk_density) / (Hydrogeology_Porosity    Hydrogeology!$L:$L)","v":{"$error":"#DIV/0!"}},{"$f":" 1 + 0.001 * (Attenuation_Partition_Coefficient_Kd_Species_3) * (Attenuation_Dry_bulk_density) / (Hydrogeology_Porosity    Hydrogeology!$M:$M)","v":{"$error":"#DIV/0!"}},{"$f":" 1 + 0.001 * (Attenuation_Partition_Coefficient_Kd_Species_3) * (Attenuation_Dry_bulk_density) / (Hydrogeology_Porosity    Hydrogeology!$N:$N)","v":{"$error":"#DIV/0!"}},{"$f":" 1 + 0.001 * (Attenuation_Partition_Coefficient_Kd_Species_3) * (Attenuation_Dry_bulk_density) / (Hydrogeology_Porosity    Hydrogeology!$O:$O)","v":{"$error":"#DIV/0!"}},{"$f":" 1 + 0.001 * (Attenuation_Partition_Coefficient_Kd_Species_3) * (Attenuation_Dry_bulk_density) / (Hydrogeology_Porosity    Hydrogeology!$P:$P)","v":{"$error":"#DIV/0!"}},{"$f":" 1 + 0.001 * (Attenuation_Partition_Coefficient_Kd_Species_3) * (Attenuation_Dry_bulk_density) / (Hydrogeology_Porosity    Hydrogeology!$Q:$Q)","v":{"$error":"#DIV/0!"}},{"$f":" 1 + 0.001 * (Attenuation_Partition_Coefficient_Kd_Species_3) * (Attenuation_Dry_bulk_density) / (Hydrogeology_Porosity    Hydrogeology!$R:$R)","v":{"$error":"#DIV/0!"}}]
["Distribution",null,"constant","constant","constant","constant","constant","constant","constant","constant","constant","constant","constant","constant","constant","constant","constant","constant"]
["Attenuation_Retardation_Species_3_param1"]
["Attenuation_Retardation_Species_3_param2"]
["Attenuation_Retardation_Species_3_param3"]
[]
[]
["Attenuation_Half_Life_Species_3","days","No Decay","No Decay","No Decay","No Decay","No Decay","No Decay","No Decay","No Decay","No Decay","No Decay","No Decay","No Decay","No Decay","No Decay","No Decay","No Decay"]
["Distribution",null,"constant","constant","constant","constant","constant","constant","constant","constant","constant","constant","constant","constant","constant","constant","constant","constant"]
["Attenuation_Half_Life_Species_3_param1"]
["Attenuation_Half_Life_Species_3_param2"]
["Attenuation_Half_Life_Species_3_param3"]
[]
[]
["Attenuation_Decay_Coefficient_Species_3","1/s",{"$f":" IF((_xlfn.SINGLE(Attenuation_Half_Life_Species_3))<>\"No Decay\", LN(2) / ((_xlfn.SINGLE(Attenuation_Half_Life_Species_3)) *_xlfn.SINGLE( s_per_day)),0)","v":0},0,0,0,0,0,0,0,0,0,0,0,0,0,0,0]
["Distribution",null,"constant","constant","constant","constant","constant","constant","constant","constant","constant","constant","constant","constant","constant","constant","constant","constant"]
["Attenuation_Decay_Coefficient_Species_3_param1"]
["Attenuation_Decay_Coefficient_Species_3_param2"]
["Attenuation_Decay_Coefficient_Species_3_param3"]
[]
[]
[{"$f":" IF((Contaminants_Source_determinand_names   Contaminants_Species4)=0,\"Undefined\",(Contaminants_Source_determinand_names   Contaminants_Species4))","v":"Pb"}]
[]
["Attenuation_Partition_Coefficient_Kd_Species_4","L/kg",135014,{"$f":"C116","v":135014},{"$f":"C116","v":135014},{"$f":"C116","v":135014},{"$f":" (Attenuation_Fraction_organic_carbon) * (Contaminants_Organic_Carbon_Water_Partition_Coefficient_Koc  Contaminants_Species4)","v":0},{"$f":" (Attenuation_Fraction_organic_carbon) * (Contaminants_Organic_Carbon_Water_Partition_Coefficient_Koc  Contaminants_Species4)","v":0},{"$f":" (Attenuation_Fraction_organic_carbon) * (Contaminants_Organic_Carbon_Water_Partition_Coefficient_Koc  Contaminants_Species4)","v":0},{"$f":" (Attenuation_Fraction_organic_carbon) * (Contaminants_Organic_Carbon_Water_Partition_Coefficient_Koc  Contaminants_Species4)","v":0},{"$f":" (Attenuation_Fraction_organic_carbon) * (Contaminants_Organic_Carbon_Water_Partition_Coefficient_Koc  Contaminants_Species4)","v":0},{"$f":" (Attenuation_Fraction_organic_carbon) * (Contaminants_Organic_Carbon_Water_Partition_Coefficient_Koc  Contaminants_Species4)","v":0},{"$f":" (Attenuation_Fraction_organic_carbon) * (Contaminants_Organic_Carbon_Water_Partition_Coefficient_Koc  Contaminants_Species4)","v":0},{"$f":" (Attenuation_Fraction_organic_carbon) * (Contaminants_Organic_Carbon_Water_Partition_Coefficient_Koc  Contaminants_Species4)","v":0},{"$f":" (Attenuation_Fraction_organic_carbon) * (Contaminants_Organic_Carbon_Water_Partition_Coefficient_Koc  Contaminants_Species4)","v":0},{"$f":" (Attenuation_Fraction_organic_carbon) * (Contaminants_Organic_Carbon_Water_Partition_Coefficient_Koc  Contaminants_Species4)","v":0},{"$f":" (Attenuation_Fraction_organic_carbon) * (Contaminants_Organic_Carbon_Water_Partition_Coefficient_Koc  Contaminants_Species4)","v":0},{"$f":" (Attenuation_Fraction_organic_carbon) * (Contaminants_Organic_Carbon_Water_Partition_Coefficient_Koc  Contaminants_Species4)","v":0}]
["Distribution",null,"constant","constant","constant","constant","constant","constant","constant","constant","constant","constant","constant","constant","constant","constant","constant","constant"]
["Attenuation_Partition_Coefficient_Kd_Species_4_param1"]
["Attenuation_Partition_Coefficient_Kd_Species_4_param2"]
["Attenuation_Partition_Coefficient_Kd_Species_4_param3"]
[]
[]
["Attenuation_Retardation_Species_4","[-]",{"$f":" 1 + 0.001 * (Attenuation_Partition_Coefficient_Kd_Species_4) * (Attenuation_Dry_bulk_density) / (Hydrogeology_Porosity    Hydrogeology!$C:$C)","v":2430253},{"$f":" 1 + 0.001 * (Attenuation_Partition_Coefficient_Kd_Species_4) * (Attenuation_Dry_bulk_density) / (Hydrogeology_Porosity    Hydrogeology!$D:$D)","v":2430253},{"$f":" 1 + 0.001 * (Attenuation_Partition_Coefficient_Kd_Species_4) * (Attenuation_Dry_bulk_density) / (Hydrogeology_Porosity    Hydrogeology!$E:$E)","v":24302521},{"$f":" 1 + 0.001 * (Attenuation_Partition_Coefficient_Kd_Species_4) * (Attenuation_Dry_bulk_density) / (Hydrogeology_Porosity    Hydrogeology!$F:$F)","v":2430253},{"$f":" 1 + 0.001 * (Attenuation_Partition_Coefficient_Kd_Species_4) * (Attenuation_Dry_bulk_density) / (Hydrogeology_Porosity    Hydrogeology!$G:$G)","v":{"$error":"#DIV/0!"}},{"$f":" 1 + 0.001 * (Attenuation_Partition_Coefficient_Kd_Species_4) * (Attenuation_Dry_bulk_density) / (Hydrogeology_Porosity    Hydrogeology!$H:$H)","v":{"$error":"#DIV/0!"}},{"$f":" 1 + 0.001 * (Attenuation_Partition_Coefficient_Kd_Species_4) * (Attenuation_Dry_bulk_density) / (Hydrogeology_Porosity    Hydrogeology!$I:$I)","v":{"$error":"#DIV/0!"}},{"$f":" 1 + 0.001 * (Attenuation_Partition_Coefficient_Kd_Species_4) * (Attenuation_Dry_bulk_density) / (Hydrogeology_Porosity    Hydrogeology!$J:$J)","v":{"$error":"#DIV/0!"}},{"$f":" 1 + 0.001 * (Attenuation_Partition_Coefficient_Kd_Species_4) * (Attenuation_Dry_bulk_density) / (Hydrogeology_Porosity    Hydrogeology!$K:$K)","v":{"$error":"#DIV/0!"}},{"$f":" 1 + 0.001 * (Attenuation_Partition_Coefficient_Kd_Species_4) * (Attenuation_Dry_bulk_density) / (Hydrogeology_Porosity    Hydrogeology!$L:$L)","v":{"$error":"#DIV/0!"}},{"$f":" 1 + 0.001 * (Attenuation_Partition_Coefficient_Kd_Species_4) * (Attenuation_Dry_bulk_density) / (Hydrogeology_Porosity    Hydrogeology!$M:$M)","v":{"$error":"#DIV/0!"}},{"$f":" 1 + 0.001 * (Attenuation_Partition_Coefficient_Kd_Species_4) * (Attenuation_Dry_bulk_density) / (Hydrogeology_Porosity    Hydrogeology!$N:$N)","v":{"$error":"#DIV/0!"}},{"$f":" 1 + 0.001 * (Attenuation_Partition_Coefficient_Kd_Species_4) * (Attenuation_Dry_bulk_density) / (Hydrogeology_Porosity    Hydrogeology!$O:$O)","v":{"$error":"#DIV/0!"}},{"$f":" 1 + 0.001 * (Attenuation_Partition_Coefficient_Kd_Species_4) * (Attenuation_Dry_bulk_density) / (Hydrogeology_Porosity    Hydrogeology!$P:$P)","v":{"$error":"#DIV/0!"}},{"$f":" 1 + 0.001 * (Attenuation_Partition_Coefficient_Kd_Species_4) * (Attenuation_Dry_bulk_density) / (Hydrogeology_Porosity    Hydrogeology!$Q:$Q)","v":{"$error":"#DIV/0!"}},{"$f":" 1 + 0.001 * (Attenuation_Partition_Coefficient_Kd_Species_4) * (Attenuation_Dry_bulk_density) / (Hydrogeology_Porosity    Hydrogeology!$R:$R)","v":{"$error":"#DIV/0!"}}]
["Distribution",null,"constant","constant","constant","constant","constant","constant","constant","constant","constant","constant","constant","constant","constant","constant","constant","constant"]
["Attenuation_Retardation_Species_4_param1"]
["Attenuation_Retardation_Species_4_param2"]
["Attenuation_Retardation_Species_4_param3"]
[]
[]
["Attenuation_Half_Life_Species_4","days","No Decay","No Decay","No Decay","No Decay","No Decay","No Decay","No Decay","No Decay","No Decay","No Decay","No Decay","No Decay","No Decay","No Decay","No Decay","No Decay"]
["Distribution",null,"constant","constant","constant","constant","constant","constant","constant","constant","constant","constant","constant","constant","constant","constant","constant","constant"]
["Attenuation_Half_Life_Species_4_param1"]
["Attenuation_Half_Life_Species_4_param2"]
["Attenuation_Half_Life_Species_4_param3"]
[]
[]
["Attenuation_Decay_Coefficient_Species_4","1/s",{"$f":" IF((_xlfn.SINGLE(Attenuation_Half_Life_Species_4))<>\"No Decay\", LN(2) / ((_xlfn.SINGLE(Attenuation_Half_Life_Species_4)) *_xlfn.SINGLE( s_per_day)),0)","v":0},0,0,0,0,0,0,0,0,0,0,0,0,0,0,0]
["Distribution",null,"constant","constant","constant","constant","constant","constant","constant","constant","constant","constant","constant","constant","constant","constant","constant","constant"]
["Attenuation_Decay_Coefficient_Species_4_param1"]
["Attenuation_Decay_Coefficient_Species_4_param2"]
["Attenuation_Decay_Coefficient_Species_4_param3"]
[]
[]
[{"$f":" IF((Contaminants_Source_determinand_names   Contaminants_Species5)=0,\"Undefined\",(Contaminants_Source_determinand_names   Contaminants_Species5))","v":"Undefined"}]
[]
["Attenuation_Partition_Coefficient_Kd_Species_5","L/kg",{"$f":" (Attenuation_Fraction_organic_carbon) * (Contaminants_Organic_Carbon_Water_Partition_Coefficient_Koc  Contaminants_Species5)","v":0},{"$f":" (Attenuation_Fraction_organic_carbon) * (Contaminants_Organic_Carbon_Water_Partition_Coefficient_Koc  Contaminants_Species5)","v":0},{"$f":" (Attenuation_Fraction_organic_carbon) * (Contaminants_Organic_Carbon_Water_Partition_Coefficient_Koc  Contaminants_Species5)","v":0},{"$f":" (Attenuation_Fraction_organic_carbon) * (Contaminants_Organic_Carbon_Water_Partition_Coefficient_Koc  Contaminants_Species5)","v":0},{"$f":" (Attenuation_Fraction_organic_carbon) * (Contaminants_Organic_Carbon_Water_Partition_Coefficient_Koc  Contaminants_Species5)","v":0},{"$f":" (Attenuation_Fraction_organic_carbon) * (Contaminants_Organic_Carbon_Water_Partition_Coefficient_Koc  Contaminants_Species5)","v":0},{"$f":" (Attenuation_Fraction_organic_carbon) * (Contaminants_Organic_Carbon_Water_Partition_Coefficient_Koc  Contaminants_Species5)","v":0},{"$f":" (Attenuation_Fraction_organic_carbon) * (Contaminants_Organic_Carbon_Water_Partition_Coefficient_Koc  Contaminants_Species5)","v":0},{"$f":" (Attenuation_Fraction_organic_carbon) * (Contaminants_Organic_Carbon_Water_Partition_Coefficient_Koc  Contaminants_Species5)","v":0},{"$f":" (Attenuation_Fraction_organic_carbon) * (Contaminants_Organic_Carbon_Water_Partition_Coefficient_Koc  Contaminants_Species5)","v":0},{"$f":" (Attenuation_Fraction_organic_carbon) * (Contaminants_Organic_Carbon_Water_Partition_Coefficient_Koc  Contaminants_Species5)","v":0},{"$f":" (Attenuation_Fraction_organic_carbon) * (Contaminants_Organic_Carbon_Water_Partition_Coefficient_Koc  Contaminants_Species5)","v":0},{"$f":" (Attenuation_Fraction_organic_carbon) * (Contaminants_Organic_Carbon_Water_Partition_Coefficient_Koc  Contaminants_Species5)","v":0},{"$f":" (Attenuation_Fraction_organic_carbon) * (Contaminants_Organic_Carbon_Water_Partition_Coefficient_Koc  Contaminants_Species5)","v":0},{"$f":" (Attenuation_Fraction_organic_carbon) * (Contaminants_Organic_Carbon_Water_Partition_Coefficient_Koc  Contaminants_Species5)","v":0},{"$f":" (Attenuation_Fraction_organic_carbon) * (Contaminants_Organic_Carbon_Water_Partition_Coefficient_Koc  Contaminants_Species5)","v":0}]
["Distribution",null,"constant","constant","constant","constant","constant","constant","constant","constant","constant","constant","constant","constant","constant","constant","constant","constant"]
["Attenuation_Partition_Coefficient_Kd_Species_5_param1"]
["Attenuation_Partition_Coefficient_Kd_Species_5_param2"]
["Attenuation_Partition_Coefficient_Kd_Species_5_param3"]
[]
[]
["Attenuation_Retardation_Species_5","[-]",{"$f":" 1 + 0.001 * (Attenuation_Partition_Coefficient_Kd_Species_5) * (Attenuation_Dry_bulk_density) / (Hydrogeology_Porosity    Hydrogeology!$C:$C)","v":1},{"$f":" 1 + 0.001 * (Attenuation_Partition_Coefficient_Kd_Species_5) * (Attenuation_Dry_bulk_density) / (Hydrogeology_Porosity    Hydrogeology!$D:$D)","v":1},{"$f":" 1 + 0.001 * (Attenuation_Partition_Coefficient_Kd_Species_5) * (Attenuation_Dry_bulk_density) / (Hydrogeology_Porosity    Hydrogeology!$E:$E)","v":1},{"$f":" 1 + 0.001 * (Attenuation_Partition_Coefficient_Kd_Species_5) * (Attenuation_Dry_bulk_density) / (Hydrogeology_Porosity    Hydrogeology!$F:$F)","v":1},{"$f":" 1 + 0.001 * (Attenuation_Partition_Coefficient_Kd_Species_5) * (Attenuation_Dry_bulk_density) / (Hydrogeology_Porosity    Hydrogeology!$G:$G)","v":{"$error":"#DIV/0!"}},{"$f":" 1 + 0.001 * (Attenuation_Partition_Coefficient_Kd_Species_5) * (Attenuation_Dry_bulk_density) / (Hydrogeology_Porosity    Hydrogeology!$H:$H)","v":{"$error":"#DIV/0!"}},{"$f":" 1 + 0.001 * (Attenuation_Partition_Coefficient_Kd_Species_5) * (Attenuation_Dry_bulk_density) / (Hydrogeology_Porosity    Hydrogeology!$I:$I)","v":{"$error":"#DIV/0!"}},{"$f":" 1 + 0.001 * (Attenuation_Partition_Coefficient_Kd_Species_5) * (Attenuation_Dry_bulk_density) / (Hydrogeology_Porosity    Hydrogeology!$J:$J)","v":{"$error":"#DIV/0!"}},{"$f":" 1 + 0.001 * (Attenuation_Partition_Coefficient_Kd_Species_5) * (Attenuation_Dry_bulk_density) / (Hydrogeology_Porosity    Hydrogeology!$K:$K)","v":{"$error":"#DIV/0!"}},{"$f":" 1 + 0.001 * (Attenuation_Partition_Coefficient_Kd_Species_5) * (Attenuation_Dry_bulk_density) / (Hydrogeology_Porosity    Hydrogeology!$L:$L)","v":{"$error":"#DIV/0!"}},{"$f":" 1 + 0.001 * (Attenuation_Partition_Coefficient_Kd_Species_5) * (Attenuation_Dry_bulk_density) / (Hydrogeology_Porosity    Hydrogeology!$M:$M)","v":{"$error":"#DIV/0!"}},{"$f":" 1 + 0.001 * (Attenuation_Partition_Coefficient_Kd_Species_5) * (Attenuation_Dry_bulk_density) / (Hydrogeology_Porosity    Hydrogeology!$N:$N)","v":{"$error":"#DIV/0!"}},{"$f":" 1 + 0.001 * (Attenuation_Partition_Coefficient_Kd_Species_5) * (Attenuation_Dry_bulk_density) / (Hydrogeology_Porosity    Hydrogeology!$O:$O)","v":{"$error":"#DIV/0!"}},{"$f":" 1 + 0.001 * (Attenuation_Partition_Coefficient_Kd_Species_5) * (Attenuation_Dry_bulk_density) / (Hydrogeology_Porosity    Hydrogeology!$P:$P)","v":{"$error":"#DIV/0!"}},{"$f":" 1 + 0.001 * (Attenuation_Partition_Coefficient_Kd_Species_5) * (Attenuation_Dry_bulk_density) / (Hydrogeology_Porosity    Hydrogeology!$Q:$Q)","v":{"$error":"#DIV/0!"}},{"$f":" 1 + 0.001 * (Attenuation_Partition_Coefficient_Kd_Species_5) * (Attenuation_Dry_bulk_density) / (Hydrogeology_Porosity    Hydrogeology!$R:$R)","v":{"$error":"#DIV/0!"}}]
["Distribution",null,"constant","constant","constant","constant","constant","constant","constant","constant","constant","constant","constant","constant","constant","constant","constant","constant"]
["Attenuation_Retardation_Species_5_param1"]
["Attenuation_Retardation_Species_5_param2"]
["Attenuation_Retardation_Species_5_param3"]
[]
[]
["Attenuation_Half_Life_Species_5","days","No Decay","No Decay","No Decay","No Decay","No Decay","No Decay","No Decay","No Decay","No Decay","No Decay","No Decay","No Decay","No Decay","No Decay","No Decay","No Decay"]
["Distribution",null,"constant","constant","constant","constant","constant","constant","constant","constant","constant","constant","constant","constant","constant","constant","constant","constant"]
["Attenuation_Half_Life_Species_5_param1"]
["Attenuation_Half_Life_Species_5_param2"]
["Attenuation_Half_Life_Species_5_param3"]
[]
[]
["Attenuation_Decay_Coefficient_Species_5","1/s",{"$f":" IF((_xlfn.SINGLE(Attenuation_Half_Life_Species_5))<>\"No Decay\", LN(2) / ((_xlfn.SINGLE(Attenuation_Half_Life_Species_5)) *_xlfn.SINGLE( s_per_day)),0)","v":0},0,0,0,0,0,0,0,0,0,0,0,0,0,0,0]
["Distribution",null,"constant","constant","constant","constant","constant","constant","constant","constant","constant","constant","constant","constant","constant","constant","constant","constant"]
["Attenuation_Decay_Coefficient_Species_5_param1"]
["Attenuation_Decay_Coefficient_Species_5_param2"]
["Attenuation_Decay_Coefficient_Species_5_param3"]
[]
[]
[{"$f":" IF((Contaminants_Source_determinand_names   Contaminants_Species6)=0,\"Undefined\",(Contaminants_Source_determinand_names   Contaminants_Species6))","v":"Undefined"}]
[]
["Attenuation_Partition_Coefficient_Kd_Species_6","L/kg",{"$f":" (Attenuation_Fraction_organic_carbon) * (Contaminants_Organic_Carbon_Water_Partition_Coefficient_Koc  Contaminants_Species6)","v":0},{"$f":" (Attenuation_Fraction_organic_carbon) * (Contaminants_Organic_Carbon_Water_Partition_Coefficient_Koc  Contaminants_Species6)","v":0},{"$f":" (Attenuation_Fraction_organic_carbon) * (Contaminants_Organic_Carbon_Water_Partition_Coefficient_Koc  Contaminants_Species6)","v":0},{"$f":" (Attenuation_Fraction_organic_carbon) * (Contaminants_Organic_Carbon_Water_Partition_Coefficient_Koc  Contaminants_Species6)","v":0},{"$f":" (Attenuation_Fraction_organic_carbon) * (Contaminants_Organic_Carbon_Water_Partition_Coefficient_Koc  Contaminants_Species6)","v":0},{"$f":" (Attenuation_Fraction_organic_carbon) * (Contaminants_Organic_Carbon_Water_Partition_Coefficient_Koc  Contaminants_Species6)","v":0},{"$f":" (Attenuation_Fraction_organic_carbon) * (Contaminants_Organic_Carbon_Water_Partition_Coefficient_Koc  Contaminants_Species6)","v":0},{"$f":" (Attenuation_Fraction_organic_carbon) * (Contaminants_Organic_Carbon_Water_Partition_Coefficient_Koc  Contaminants_Species6)","v":0},{"$f":" (Attenuation_Fraction_organic_carbon) * (Contaminants_Organic_Carbon_Water_Partition_Coefficient_Koc  Contaminants_Species6)","v":0},{"$f":" (Attenuation_Fraction_organic_carbon) * (Contaminants_Organic_Carbon_Water_Partition_Coefficient_Koc  Contaminants_Species6)","v":0},{"$f":" (Attenuation_Fraction_organic_carbon) * (Contaminants_Organic_Carbon_Water_Partition_Coefficient_Koc  Contaminants_Species6)","v":0},{"$f":" (Attenuation_Fraction_organic_carbon) * (Contaminants_Organic_Carbon_Water_Partition_Coefficient_Koc  Contaminants_Species6)","v":0},{"$f":" (Attenuation_Fraction_organic_carbon) * (Contaminants_Organic_Carbon_Water_Partition_Coefficient_Koc  Contaminants_Species6)","v":0},{"$f":" (Attenuation_Fraction_organic_carbon) * (Contaminants_Organic_Carbon_Water_Partition_Coefficient_Koc  Contaminants_Species6)","v":0},{"$f":" (Attenuation_Fraction_organic_carbon) * (Contaminants_Organic_Carbon_Water_Partition_Coefficient_Koc  Contaminants_Species6)","v":0},{"$f":" (Attenuation_Fraction_organic_carbon) * (Contaminants_Organic_Carbon_Water_Partition_Coefficient_Koc  Contaminants_Species6)","v":0}]
["Distribution",null,"constant","constant","constant","constant","constant","constant","constant","constant","constant","constant","constant","constant","constant","constant","constant","constant"]
["Attenuation_Partition_Coefficient_Kd_Species_6_param1"]
["Attenuation_Partition_Coefficient_Kd_Species_6_param2"]
["Attenuation_Partition_Coefficient_Kd_Species_6_param3"]
[]
[]
["Attenuation_Retardation_Species_6","[-]",{"$f":" 1 + 0.001 * (Attenuation_Partition_Coefficient_Kd_Species_6) * (Attenuation_Dry_bulk_density) / (Hydrogeology_Porosity    Hydrogeology!$C:$C)","v":1},{"$f":" 1 + 0.001 * (Attenuation_Partition_Coefficient_Kd_Species_6) * (Attenuation_Dry_bulk_density) / (Hydrogeology_Porosity    Hydrogeology!$D:$D)","v":1},{"$f":" 1 + 0.001 * (Attenuation_Partition_Coefficient_Kd_Species_6) * (Attenuation_Dry_bulk_density) / (Hydrogeology_Porosity    Hydrogeology!$E:$E)","v":1},{"$f":" 1 + 0.001 * (Attenuation_Partition_Coefficient_Kd_Species_6) * (Attenuation_Dry_bulk_density) / (Hydrogeology_Porosity    Hydrogeology!$F:$F)","v":1},{"$f":" 1 + 0.001 * (Attenuation_Partition_Coefficient_Kd_Species_6) * (Attenuation_Dry_bulk_density) / (Hydrogeology_Porosity    Hydrogeology!$G:$G)","v":{"$error":"#DIV/0!"}},{"$f":" 1 + 0.001 * (Attenuation_Partition_Coefficient_Kd_Species_6) * (Attenuation_Dry_bulk_density) / (Hydrogeology_Porosity    Hydrogeology!$H:$H)","v":{"$error":"#DIV/0!"}},{"$f":" 1 + 0.001 * (Attenuation_Partition_Coefficient_Kd_Species_6) * (Attenuation_Dry_bulk_density) / (Hydrogeology_Porosity    Hydrogeology!$I:$I)","v":{"$error":"#DIV/0!"}},{"$f":" 1 + 0.001 * (Attenuation_Partition_Coefficient_Kd_Species_6) * (Attenuation_Dry_bulk_density) / (Hydrogeology_Porosity    Hydrogeology!$J:$J)","v":{"$error":"#DIV/0!"}},{"$f":" 1 + 0.001 * (Attenuation_Partition_Coefficient_Kd_Species_6) * (Attenuation_Dry_bulk_density) / (Hydrogeology_Porosity    Hydrogeology!$K:$K)","v":{"$error":"#DIV/0!"}},{"$f":" 1 + 0.001 * (Attenuation_Partition_Coefficient_Kd_Species_6) * (Attenuation_Dry_bulk_density) / (Hydrogeology_Porosity    Hydrogeology!$L:$L)","v":{"$error":"#DIV/0!"}},{"$f":" 1 + 0.001 * (Attenuation_Partition_Coefficient_Kd_Species_6) * (Attenuation_Dry_bulk_density) / (Hydrogeology_Porosity    Hydrogeology!$M:$M)","v":{"$error":"#DIV/0!"}},{"$f":" 1 + 0.001 * (Attenuation_Partition_Coefficient_Kd_Species_6) * (Attenuation_Dry_bulk_density) / (Hydrogeology_Porosity    Hydrogeology!$N:$N)","v":{"$error":"#DIV/0!"}},{"$f":" 1 + 0.001 * (Attenuation_Partition_Coefficient_Kd_Species_6) * (Attenuation_Dry_bulk_density) / (Hydrogeology_Porosity    Hydrogeology!$O:$O)","v":{"$error":"#DIV/0!"}},{"$f":" 1 + 0.001 * (Attenuation_Partition_Coefficient_Kd_Species_6) * (Attenuation_Dry_bulk_density) / (Hydrogeology_Porosity    Hydrogeology!$P:$P)","v":{"$error":"#DIV/0!"}},{"$f":" 1 + 0.001 * (Attenuation_Partition_Coefficient_Kd_Species_6) * (Attenuation_Dry_bulk_density) / (Hydrogeology_Porosity    Hydrogeology!$Q:$Q)","v":{"$error":"#DIV/0!"}},{"$f":" 1 + 0.001 * (Attenuation_Partition_Coefficient_Kd_Species_6) * (Attenuation_Dry_bulk_density) / (Hydrogeology_Porosity    Hydrogeology!$R:$R)","v":{"$error":"#DIV/0!"}}]
["Distribution",null,"constant","constant","constant","constant","constant","constant","constant","constant","constant","constant","constant","constant","constant","constant","constant","constant"]
["Attenuation_Retardation_Species_6_param1"]
["Attenuation_Retardation_Species_6_param2"]
["Attenuation_Retardation_Species_6_param3"]
[]
[]
["Attenuation_Half_Life_Species_6","days","No Decay","No Decay","No Decay","No Decay","No Decay","No Decay","No Decay","No Decay","No Decay","No Decay","No Decay","No Decay","No Decay","No Decay","No Decay","No Decay"]
["Distribution",null,"constant","constant","constant","constant","constant","constant","constant","constant","constant","constant","constant","constant","constant","constant","constant","constant"]
["Attenuation_Half_Life_Species_6_param1"]
["Attenuation_Half_Life_Species_6_param2"]
["Attenuation_Half_Life_Species_6_param3"]
[]
[]
["Attenuation_Decay_Coefficient_Species_6","1/s",{"$f":" IF((_xlfn.SINGLE(Attenuation_Half_Life_Species_6))<>\"No Decay\", LN(2) / ((_xlfn.SINGLE(Attenuation_Half_Life_Species_6)) *_xlfn.SINGLE( s_per_day)),0)","v":0},0,0,0,0,0,0,0,0,0,0,0,0,0,0,0]
["Distribution",null,"constant","constant","constant","constant","constant","constant","constant","constant","constant","constant","constant","constant","constant","constant","constant","constant"]
["Attenuation_Decay_Coefficient_Species_6_param1"]
["Attenuation_Decay_Coefficient_Species_6_param2"]
["Attenuation_Decay_Coefficient_Species_6_param3"]
[]
[]
[{"$f":" IF((Contaminants_Source_determinand_names   Contaminants_Species7)=0,\"Undefined\",(Contaminants_Source_determinand_names   Contaminants_Species7))","v":"Undefined"}]
[]
["Attenuation_Partition_Coefficient_Kd_Species_7","L/kg",{"$f":" (Attenuation_Fraction_organic_carbon) * (Contaminants_Organic_Carbon_Water_Partition_Coefficient_Koc  Contaminants_Species7)","v":0},{"$f":" (Attenuation_Fraction_organic_carbon) * (Contaminants_Organic_Carbon_Water_Partition_Coefficient_Koc  Contaminants_Species7)","v":0},{"$f":" (Attenuation_Fraction_organic_carbon) * (Contaminants_Organic_Carbon_Water_Partition_Coefficient_Koc  Contaminants_Species7)","v":0},{"$f":" (Attenuation_Fraction_organic_carbon) * (Contaminants_Organic_Carbon_Water_Partition_Coefficient_Koc  Contaminants_Species7)","v":0},{"$f":" (Attenuation_Fraction_organic_carbon) * (Contaminants_Organic_Carbon_Water_Partition_Coefficient_Koc  Contaminants_Species7)","v":0},{"$f":" (Attenuation_Fraction_organic_carbon) * (Contaminants_Organic_Carbon_Water_Partition_Coefficient_Koc  Contaminants_Species7)","v":0},{"$f":" (Attenuation_Fraction_organic_carbon) * (Contaminants_Organic_Carbon_Water_Partition_Coefficient_Koc  Contaminants_Species7)","v":0},{"$f":" (Attenuation_Fraction_organic_carbon) * (Contaminants_Organic_Carbon_Water_Partition_Coefficient_Koc  Contaminants_Species7)","v":0},{"$f":" (Attenuation_Fraction_organic_carbon) * (Contaminants_Organic_Carbon_Water_Partition_Coefficient_Koc  Contaminants_Species7)","v":0},{"$f":" (Attenuation_Fraction_organic_carbon) * (Contaminants_Organic_Carbon_Water_Partition_Coefficient_Koc  Contaminants_Species7)","v":0},{"$f":" (Attenuation_Fraction_organic_carbon) * (Contaminants_Organic_Carbon_Water_Partition_Coefficient_Koc  Contaminants_Species7)","v":0},{"$f":" (Attenuation_Fraction_organic_carbon) * (Contaminants_Organic_Carbon_Water_Partition_Coefficient_Koc  Contaminants_Species7)","v":0},{"$f":" (Attenuation_Fraction_organic_carbon) * (Contaminants_Organic_Carbon_Water_Partition_Coefficient_Koc  Contaminants_Species7)","v":0},{"$f":" (Attenuation_Fraction_organic_carbon) * (Contaminants_Organic_Carbon_Water_Partition_Coefficient_Koc  Contaminants_Species7)","v":0},{"$f":" (Attenuation_Fraction_organic_carbon) * (Contaminants_Organic_Carbon_Water_Partition_Coefficient_Koc  Contaminants_Species7)","v":0},{"$f":" (Attenuation_Fraction_organic_carbon) * (Contaminants_Organic_Carbon_Water_Partition_Coefficient_Koc  Contaminants_Species7)","v":0}]
["Distribution",null,"constant","constant","constant","constant","constant","constant","constant","constant","constant","constant","constant","constant","constant","constant","constant","constant"]
["Attenuation_Partition_Coefficient_Kd_Species_7_param1"]
["Attenuation_Partition_Coefficient_Kd_Species_7_param2"]
["Attenuation_Partition_Coefficient_Kd_Species_7_param3"]
[]
[]
["Attenuation_Retardation_Species_7","[-]",{"$f":" 1 + 0.001 * (Attenuation_Partition_Coefficient_Kd_Species_7) * (Attenuation_Dry_bulk_density) / (Hydrogeology_Porosity    Hydrogeology!$C:$C)","v":1},{"$f":" 1 + 0.001 * (Attenuation_Partition_Coefficient_Kd_Species_7) * (Attenuation_Dry_bulk_density) / (Hydrogeology_Porosity    Hydrogeology!$D:$D)","v":1},{"$f":" 1 + 0.001 * (Attenuation_Partition_Coefficient_Kd_Species_7) * (Attenuation_Dry_bulk_density) / (Hydrogeology_Porosity    Hydrogeology!$E:$E)","v":1},{"$f":" 1 + 0.001 * (Attenuation_Partition_Coefficient_Kd_Species_7) * (Attenuation_Dry_bulk_density) / (Hydrogeology_Porosity    Hydrogeology!$F:$F)","v":1},{"$f":" 1 + 0.001 * (Attenuation_Partition_Coefficient_Kd_Species_7) * (Attenuation_Dry_bulk_density) / (Hydrogeology_Porosity    Hydrogeology!$G:$G)","v":{"$error":"#DIV/0!"}},{"$f":" 1 + 0.001 * (Attenuation_Partition_Coefficient_Kd_Species_7) * (Attenuation_Dry_bulk_density) / (Hydrogeology_Porosity    Hydrogeology!$H:$H)","v":{"$error":"#DIV/0!"}},{"$f":" 1 + 0.001 * (Attenuation_Partition_Coefficient_Kd_Species_7) * (Attenuation_Dry_bulk_density) / (Hydrogeology_Porosity    Hydrogeology!$I:$I)","v":{"$error":"#DIV/0!"}},{"$f":" 1 + 0.001 * (Attenuation_Partition_Coefficient_Kd_Species_7) * (Attenuation_Dry_bulk_density) / (Hydrogeology_Porosity    Hydrogeology!$J:$J)","v":{"$error":"#DIV/0!"}},{"$f":" 1 + 0.001 * (Attenuation_Partition_Coefficient_Kd_Species_7) * (Attenuation_Dry_bulk_density) / (Hydrogeology_Porosity    Hydrogeology!$K:$K)","v":{"$error":"#DIV/0!"}},{"$f":" 1 + 0.001 * (Attenuation_Partition_Coefficient_Kd_Species_7) * (Attenuation_Dry_bulk_density) / (Hydrogeology_Porosity    Hydrogeology!$L:$L)","v":{"$error":"#DIV/0!"}},{"$f":" 1 + 0.001 * (Attenuation_Partition_Coefficient_Kd_Species_7) * (Attenuation_Dry_bulk_density) / (Hydrogeology_Porosity    Hydrogeology!$M:$M)","v":{"$error":"#DIV/0!"}},{"$f":" 1 + 0.001 * (Attenuation_Partition_Coefficient_Kd_Species_7) * (Attenuation_Dry_bulk_density) / (Hydrogeology_Porosity    Hydrogeology!$N:$N)","v":{"$error":"#DIV/0!"}},{"$f":" 1 + 0.001 * (Attenuation_Partition_Coefficient_Kd_Species_7) * (Attenuation_Dry_bulk_density) / (Hydrogeology_Porosity    Hydrogeology!$O:$O)","v":{"$error":"#DIV/0!"}},{"$f":" 1 + 0.001 * (Attenuation_Partition_Coefficient_Kd_Species_7) * (Attenuation_Dry_bulk_density) / (Hydrogeology_Porosity    Hydrogeology!$P:$P)","v":{"$error":"#DIV/0!"}},{"$f":" 1 + 0.001 * (Attenuation_Partition_Coefficient_Kd_Species_7) * (Attenuation_Dry_bulk_density) / (Hydrogeology_Porosity    Hydrogeology!$Q:$Q)","v":{"$error":"#DIV/0!"}},{"$f":" 1 + 0.001 * (Attenuation_Partition_Coefficient_Kd_Species_7) * (Attenuation_Dry_bulk_density) / (Hydrogeology_Porosity    Hydrogeology!$R:$R)","v":{"$error":"#DIV/0!"}}]
["Distribution",null,"constant","constant","constant","constant","constant","constant","constant","constant","constant","constant","constant","constant","constant","constant","constant","constant"]
["Attenuation_Retardation_Species_7_param1"]
["Attenuation_Retardation_Species_7_param2"]
["Attenuation_Retardation_Species_7_param3"]
[]
[]
["Attenuation_Half_Life_Species_7","days","No Decay","No Decay","No Decay","No Decay","No Decay","No Decay","No Decay","No Decay","No Decay","No Decay","No Decay","No Decay","No Decay","No Decay","No Decay","No Decay"]
["Distribution",null,"constant","constant","constant","constant","constant","constant","constant","constant","constant","constant","constant","constant","constant","constant","constant","constant"]
["Attenuation_Half_Life_Species_7_param1"]
["Attenuation_Half_Life_Species_7_param2"]
["Attenuation_Half_Life_Species_7_param3"]
[]
[]
["Attenuation_Decay_Coefficient_Species_7","1/s",{"$f":" IF((_xlfn.SINGLE(Attenuation_Half_Life_Species_7))<>\"No Decay\", LN(2) / ((_xlfn.SINGLE(Attenuation_Half_Life_Species_7)) *_xlfn.SINGLE( s_per_day)),0)","v":0},0,0,0,0,0,0,0,0,0,0,0,0,0,0,0]
["Distribution",null,"constant","constant","constant","constant","constant","constant","constant","constant","constant","constant","constant","constant","constant","constant","constant","constant"]
["Attenuation_Decay_Coefficient_Species_7_param1"]
["Attenuation_Decay_Coefficient_Species_7_param2"]
["Attenuation_Decay_Coefficient_Species_7_param3"]
[]
[]
[{"$f":" IF((Contaminants_Source_determinand_names   Contaminants_Species8)=0,\"Undefined\",(Contaminants_Source_determinand_names   Contaminants_Species8))","v":"Undefined"}]
[]
["Attenuation_Partition_Coefficient_Kd_Species_8","L/kg",{"$f":" (Attenuation_Fraction_organic_carbon) * (Contaminants_Organic_Carbon_Water_Partition_Coefficient_Koc  Contaminants_Species8)","v":0},{"$f":" (Attenuation_Fraction_organic_carbon) * (Contaminants_Organic_Carbon_Water_Partition_Coefficient_Koc  Contaminants_Species8)","v":0},{"$f":" (Attenuation_Fraction_organic_carbon) * (Contaminants_Organic_Carbon_Water_Partition_Coefficient_Koc  Contaminants_Species8)","v":0},{"$f":" (Attenuation_Fraction_organic_carbon) * (Contaminants_Organic_Carbon_Water_Partition_Coefficient_Koc  Contaminants_Species8)","v":0},{"$f":" (Attenuation_Fraction_organic_carbon) * (Contaminants_Organic_Carbon_Water_Partition_Coefficient_Koc  Contaminants_Species8)","v":0},{"$f":" (Attenuation_Fraction_organic_carbon) * (Contaminants_Organic_Carbon_Water_Partition_Coefficient_Koc  Contaminants_Species8)","v":0},{"$f":" (Attenuation_Fraction_organic_carbon) * (Contaminants_Organic_Carbon_Water_Partition_Coefficient_Koc  Contaminants_Species8)","v":0},{"$f":" (Attenuation_Fraction_organic_carbon) * (Contaminants_Organic_Carbon_Water_Partition_Coefficient_Koc  Contaminants_Species8)","v":0},{"$f":" (Attenuation_Fraction_organic_carbon) * (Contaminants_Organic_Carbon_Water_Partition_Coefficient_Koc  Contaminants_Species8)","v":0},{"$f":" (Attenuation_Fraction_organic_carbon) * (Contaminants_Organic_Carbon_Water_Partition_Coefficient_Koc  Contaminants_Species8)","v":0},{"$f":" (Attenuation_Fraction_organic_carbon) * (Contaminants_Organic_Carbon_Water_Partition_Coefficient_Koc  Contaminants_Species8)","v":0},{"$f":" (Attenuation_Fraction_organic_carbon) * (Contaminants_Organic_Carbon_Water_Partition_Coefficient_Koc  Contaminants_Species8)","v":0},{"$f":" (Attenuation_Fraction_organic_carbon) * (Contaminants_Organic_Carbon_Water_Partition_Coefficient_Koc  Contaminants_Species8)","v":0},{"$f":" (Attenuation_Fraction_organic_carbon) * (Contaminants_Organic_Carbon_Water_Partition_Coefficient_Koc  Contaminants_Species8)","v":0},{"$f":" (Attenuation_Fraction_organic_carbon) * (Contaminants_Organic_Carbon_Water_Partition_Coefficient_Koc  Contaminants_Species8)","v":0},{"$f":" (Attenuation_Fraction_organic_carbon) * (Contaminants_Organic_Carbon_Water_Partition_Coefficient_Koc  Contaminants_Species8)","v":0}]
["Distribution",null,"constant","constant","constant","constant","constant","constant","constant","constant","constant","constant","constant","constant","constant","constant","constant","constant"]
["Attenuation_Partition_Coefficient_Kd_Species_8_param1"]
["Attenuation_Partition_Coefficient_Kd_Species_8_param2"]
["Attenuation_Partition_Coefficient_Kd_Species_8_param3"]
[]
[]
["Attenuation_Retardation_Species_8","[-]",{"$f":" 1 + 0.001 * (Attenuation_Partition_Coefficient_Kd_Species_8) * (Attenuation_Dry_bulk_density) / (Hydrogeology_Porosity    Hydrogeology!$C:$C)","v":1},{"$f":" 1 + 0.001 * (Attenuation_Partition_Coefficient_Kd_Species_8) * (Attenuation_Dry_bulk_density) / (Hydrogeology_Porosity    Hydrogeology!$D:$D)","v":1},{"$f":" 1 + 0.001 * (Attenuation_Partition_Coefficient_Kd_Species_8) * (Attenuation_Dry_bulk_density) / (Hydrogeology_Porosity    Hydrogeology!$E:$E)","v":1},{"$f":" 1 + 0.001 * (Attenuation_Partition_Coefficient_Kd_Species_8) * (Attenuation_Dry_bulk_density) / (Hydrogeology_Porosity    Hydrogeology!$F:$F)","v":1},{"$f":" 1 + 0.001 * (Attenuation_Partition_Coefficient_Kd_Species_8) * (Attenuation_Dry_bulk_density) / (Hydrogeology_Porosity    Hydrogeology!$G:$G)","v":{"$error":"#DIV/0!"}},{"$f":" 1 + 0.001 * (Attenuation_Partition_Coefficient_Kd_Species_8) * (Attenuation_Dry_bulk_density) / (Hydrogeology_Porosity    Hydrogeology!$H:$H)","v":{"$error":"#DIV/0!"}},{"$f":" 1 + 0.001 * (Attenuation_Partition_Coefficient_Kd_Species_8) * (Attenuation_Dry_bulk_density) / (Hydrogeology_Porosity    Hydrogeology!$I:$I)","v":{"$error":"#DIV/0!"}},{"$f":" 1 + 0.001 * (Attenuation_Partition_Coefficient_Kd_Species_8) * (Attenuation_Dry_bulk_density) / (Hydrogeology_Porosity    Hydrogeology!$J:$J)","v":{"$error":"#DIV/0!"}},{"$f":" 1 + 0.001 * (Attenuation_Partition_Coefficient_Kd_Species_8) * (Attenuation_Dry_bulk_density) / (Hydrogeology_Porosity    Hydrogeology!$K:$K)","v":{"$error":"#DIV/0!"}},{"$f":" 1 + 0.001 * (Attenuation_Partition_Coefficient_Kd_Species_8) * (Attenuation_Dry_bulk_density) / (Hydrogeology_Porosity    Hydrogeology!$L:$L)","v":{"$error":"#DIV/0!"}},{"$f":" 1 + 0.001 * (Attenuation_Partition_Coefficient_Kd_Species_8) * (Attenuation_Dry_bulk_density) / (Hydrogeology_Porosity    Hydrogeology!$M:$M)","v":{"$error":"#DIV/0!"}},{"$f":" 1 + 0.001 * (Attenuation_Partition_Coefficient_Kd_Species_8) * (Attenuation_Dry_bulk_density) / (Hydrogeology_Porosity    Hydrogeology!$N:$N)","v":{"$error":"#DIV/0!"}},{"$f":" 1 + 0.001 * (Attenuation_Partition_Coefficient_Kd_Species_8) * (Attenuation_Dry_bulk_density) / (Hydrogeology_Porosity    Hydrogeology!$O:$O)","v":{"$error":"#DIV/0!"}},{"$f":" 1 + 0.001 * (Attenuation_Partition_Coefficient_Kd_Species_8) * (Attenuation_Dry_bulk_density) / (Hydrogeology_Porosity    Hydrogeology!$P:$P)","v":{"$error":"#DIV/0!"}},{"$f":" 1 + 0.001 * (Attenuation_Partition_Coefficient_Kd_Species_8) * (Attenuation_Dry_bulk_density) / (Hydrogeology_Porosity    Hydrogeology!$Q:$Q)","v":{"$error":"#DIV/0!"}},{"$f":" 1 + 0.001 * (Attenuation_Partition_Coefficient_Kd_Species_8) * (Attenuation_Dry_bulk_density) / (Hydrogeology_Porosity    Hydrogeology!$R:$R)","v":{"$error":"#DIV/0!"}}]
["Distribution",null,"constant","constant","constant","constant","constant","constant","constant","constant","constant","constant","constant","constant","constant","constant","constant","constant"]
["Attenuation_Retardation_Species_8_param1"]
["Attenuation_Retardation_Species_8_param2"]
["Attenuation_Retardation_Species_8_param3"]
[]
[]
["Attenuation_Half_Life_Species_8","days","No Decay","No Decay","No Decay","No Decay","No Decay","No Decay","No Decay","No Decay","No Decay","No Decay","No Decay","No Decay","No Decay","No Decay","No Decay","No Decay"]
["Distribution",null,"constant","constant","constant","constant","constant","constant","constant","constant","constant","constant","constant","constant","constant","constant","constant","constant"]
["Attenuation_Half_Life_Species_8_param1"]
["Attenuation_Half_Life_Species_8_param2"]
["Attenuation_Half_Life_Species_8_param3"]
[]
[]
["Attenuation_Decay_Coefficient_Species_8","1/s",{"$f":" IF((_xlfn.SINGLE(Attenuation_Half_Life_Species_8))<>\"No Decay\", LN(2) / ((_xlfn.SINGLE(Attenuation_Half_Life_Species_8)) *_xlfn.SINGLE( s_per_day)),0)","v":0},0,0,0,0,0,0,0,0,0,0,0,0,0,0,0]
["Distribution",null,"constant","constant","constant","constant","constant","constant","constant","constant","constant","constant","constant","constant","constant","constant","constant","constant"]
["Attenuation_Decay_Coefficient_Species_8_param1"]
["Attenuation_Decay_Coefficient_Species_8_param2"]
["Attenuation_Decay_Coefficient_Species_8_param3"]

{"sheet":"WaterBalance","index":5,"n_rows":60,"n_cols":7,"rows_kept":60,"cut":false,"hidden":false,"merged":[]}
["Rainfall"]
["Effective Rainfall","q_er",166,"mm/a"]
["Area","A",17418,"m2","Area of stabilised waste measured from GIS"]
["Infiltration flux","Q_inf",{"$f":"q_er*A/(31536000*1000)","v":9.1685312024353119E-5},"m3/s",null,{"$f":"Q_inf/A","v":5.2638254693049213E-9}]
[]
["Made Ground"]
["Head in MG","h_mg",{"$f":"x","v":3.0107351003498093},"mAOD"]
["Head at Milton Creek","h_mc",2,"mAOD"]
["Distance in MG","d_mg",140,"mAOD","Approx distance from mid point of Site to Milton Creek beyond northeastern extent of Site"]
["Hydraulic Conductivity MG","K_mg",1.0000000000000001E-5,"m/s",null,{"$f":"K_mg*86400","v":0.8640000000000001},"m/d"]
["Ground Level","T_mg",4,"mAOD"]
["Elevation of base of MG","B_mg",2,"mAOD"]
["Perimeter length along Milton Creek","P_mg",268,"m","Measured off GIS"]
["Hydralic gradient MG","i_mg",{"$f":"(h_mg-h_mc)/d_mg","v":7.2195364310700663E-3},"-"]
["Darcy velocity MG","v_mg",{"$f":"K_mg*i_mg","v":7.2195364310700674E-8},"m/s"]
["Saturated thickness MG","s_mg",{"$f":"((h_mg+h_mc)/2)-B_mg","v":0.50536755017490442},"m"]
["Groundwater flux in MG","Q_mg",{"$f":"v_mg*s_mg*P_mg","v":9.7780320980431855E-6},"m3/s"]
[]
["Alluvium"]
["Thickness Alluvium","t_al",3,"m"]
["Hydraulic conductivity Alluvium","K_al",1E-8,"m/s",null,{"$f":"K_al*86400","v":8.6399999999999997E-4},"m/d"]
["Hydraulic gradient across Alluvium","i_al",{"$f":"(h_mg-h_ck)/t_al","v":0.4702450334499364},"-"]
["Darcy velocity Alluvium","v_al",{"$f":"K_al*i_al","v":4.7024503344993642E-9},"m/s"]
["Porewater velocity Alluvium","pv_al",{"$f":"v_al/Hydrogeology!E40","v":4.7024503344993644E-7},"m/s"]
["Flux across Alluvium","Q_al",{"$f":"v_al*A","v":8.1907279926309929E-5},"m3/s"]
[]
["Chalk"]
["Head in Chalk","h_ck",1.6,"mAOD","Average head in Chalk based on LEAP water level measurements"]
["Hydraulic gradient in Chalk","i_ck",1E-3,"-"]
["Hydraulic conductivity in Chalk","k_ck",{"$f":"5/86400","v":5.7870370370370373E-5},"m/s","Assume 5 m/d",{"$f":"k_ck*86400","v":5},"m/d"]
["Darcy velocity Chalk","v_ck",{"$f":"i_ck*k_ck","v":5.7870370370370371E-8},"m/s"]
["Width perpendicular to gw flow","w_ck",220,"m","Measured from northeast tip to southwest tip"]
["Saturated thickness","t_ck",50,"m","Groundwater flow restricted to top 50 m where fissured zone is present"]
["Chalk flow","Q_ck",{"$f":"v_ck*w_ck*t_ck","v":6.3657407407407413E-4},"m3/s"]
[]
["Milton Creek"]
["Tidal range","tr_mc",2.2000000000000002,"m","Based on neap tides, 23 May 2022 tide-forecast.com"]
["Area upstream of Site","a_mc",23408,"m2","Typical width at mid-tide measured from GIS"]
["Volume of water","v_mc",{"$f":"a_mc*tr_mc","v":51497.600000000006},"m3"]
["Time period","t_mc",{"$f":"6*86400","v":518400},"s","Tidal flow for 6 hrs"]
["Tidal flow","Q_mc",{"$f":"v_mc/t_mc","v":9.9339506172839515E-2},"m3/s"]
[]
["Water balance"]
["Flux to Milton Creek",null,{"$f":"Q_mg","v":9.7780320980431855E-6},"m3/s"]
["Flux across Alluvium",null,{"$f":"Q_al","v":8.1907279926309929E-5},"m3/s"]
["Flux out of MG",null,{"$f":"SUM(C44:C45)","v":9.1685312024353119E-5},"m3/s"]
["Infiltration flux",null,{"$f":"Q_inf","v":9.1685312024353119E-5},"m3/s"]
["Balance",null,{"$f":"C47-C46","v":0},"m3/s","This should be less than 1E-10"]
[]
["Quadratic"]
[null,"a_",{"$f":"K_mg*P_mg/(2*d_mg)","v":9.5714285714285715E-6}]
[null,"b_",{"$f":"-K_mg*P_mg*B_mg/d_mg+K_al*A/t_al","v":1.9774285714285717E-5}]
[null,"c_",{"$f":"-K_mg*P_mg*h_mc^2/(2*d_mg)+K_mg*P_mg*h_mc*B_mg/d_mg-K_al*A*h_ck/t_al-Q_inf","v":-1.4629559773863884E-4}]
[null,"x1",{"$f":"(-b+SQRT(b_^2-4*a_*c_))/(2*a_)","v":3.0107351003498093}]
[null,"x2",{"$f":"(-b-SQRT(b_^2-4*a_*c_))/(2*a_)","v":-5.076705249603541}]
[null,"x",{"$f":"IF(x1_<0,x2_,x1_)","v":3.0107351003498093}]
[]
["Dilution factors"]
["Milton Creek","D_mc",{"$f":"(Q_mg+Q_mc)/Q_mg","v":10160.45797444454}]
["Chalk","D_ck",{"$f":"(Q_al+Q_ck)/Q_al","v":8.7718863896687207}]

{"sheet":"Pathways","index":6,"n_rows":26,"n_cols":13,"rows_kept":26,"cut":false,"hidden":false,"merged":[]}
["PATHWAY SUMMARY"]
[]
["Path 1",null,"Section 1",null,"Section 2",null,"Section 3",null,"Section 4",null,"Section 5",null,"Section 6"]
["Path 1  Type",null,"Source",null,"Unit",null,"Unit",null,"Unit",null,"Unit",null,"Receptor"]
["Path 1  Name",null,"Stabilised Waste",null,"Unsat MG: Node 1",null,"Sat MG: Node 1",null,"Alluvium: Node 1",null,"Chalk: Node 1",null,"Chalk haz"]
["Path 1  Process",null,"Declining source",null,"No Processes",null,"No Processes",null,"ADRD (1D) + Dilution",null,"No Processes",null,"Monitoring Borehole"]
["Path 1  Standards",null,null,null,null,null,null,null,null,null,null,"Target Standard","EAL"]
["Path 1  Parameter1","Q_managed [m3/s]",0,null,null,null,null,"Velocity [m/s]",{"$f":"pv_al","v":4.7024503344993644E-7}]
["Path 1  Parameter2","Managed time [years]",0,null,null,null,null,"Dispersivity [m]",{"$f":"I10/10","v":0.3}]
["Path 1  Parameter3","Q_path [m3/s]",{"$f":"Q_inf","v":9.1685312024353119E-5},null,null,null,null,"Travel Distance [m]",{"$f":"t_al","v":3}]
["Path 1  Parameter4","Q_decline [m3/s]",{"$f":"Q_inf","v":9.1685312024353119E-5},null,null,null,null,"Mixing Depth [m]"]
["Path 1  Parameter5",null,null,null,null,null,null,"Mixing Width [m]"]
["Path 1  Parameter6",null,null,"Q_Dilute [m3/s]",0,"Q_Dilute [m3/s]",0,"Q_Dilute [m3/s]",{"$f":" Path1_Param5*Path1_Param4*(Alluvium   Hydrogeology_Hydraulic_Conductivity)*(Alluvium   Hydrogeology_Hydraulic_Gradient)","v":0},"Q_Dilute [m3/s]",0,"Q_dilute [m3/s]",0]
[]
[]
["Path 2",null,"Section 1",null,"Section 2",null,"Section 3",null,"Section 4",null,"Section 5",null,"Section 6"]
["Path 2  Type",null,"Source",null,"Unit",null,"Unit",null,"Unit",null,"Unit",null,"Receptor"]
["Path 2  Name",null,"Stabilised Waste",null,"Unsat MG: Node 3",null,"Sat MG: Node 3",null,"Alluvium: Node 3",null,"Chalk: Node 3",null,"Chalk nonhaz"]
["Path 2  Process",null,"Declining source",null,"No Processes",null,"No Processes",null,"ADRD (1D) + Dilution",null,"Aquifer Dilution Only",null,"Monitoring Borehole"]
["Path 2  Standards",null,null,null,null,null,null,null,null,null,null,"Target Standard","Not Specified"]
["Path 2  Parameter1","Q_managed [m3/s]",0,null,null,null,null,"Velocity [m/s]",{"$f":"pv_al","v":4.7024503344993644E-7}]
["Path 2  Parameter2","Managed time [years]",0,null,null,null,null,"Dispersivity [m]",{"$f":"I23/10","v":0.3}]
["Path 2  Parameter3","Q_path [m3/s]",{"$f":"Q_inf","v":9.1685312024353119E-5},null,null,null,null,"Travel Distance [m]",{"$f":"t_al","v":3}]
["Path 2  Parameter4","Q_decline [m3/s]",{"$f":"Q_inf","v":9.1685312024353119E-5},null,null,null,null,"Mixing Depth [m]",null,"Mixing Depth [m]"]
["Path 2  Parameter5",null,null,null,null,null,null,"Mixing Width [m]",null,"Mixing Width [m]"]
["Path 2  Parameter6",null,null,"Q_Dilute [m3/s]",0,"Q_Dilute [m3/s]",0,"Q_Dilute [m3/s]",{"$f":" Path2_Param5*Path2_Param4*(Alluvium   Hydrogeology_Hydraulic_Conductivity)*(Alluvium   Hydrogeology_Hydraulic_Gradient)","v":0},"Q_Dilute [m3/s]",{"$f":"Q_ck","v":6.3657407407407413E-4},"Q_dilute [m3/s]",0]

{"sheet":"Chalk nonhaz","index":7,"n_rows":7,"n_cols":6,"rows_kept":7,"cut":false,"hidden":true,"merged":[]}
["RECEPTOR: Chalk nonhaz"]
[]
["Receptor Options"]
[]
[null,null,null,null,null,"No further dilution along pathway"]
[]
[null,null,null,null,null,"No data requirement"]

{"sheet":"Chalk haz","index":8,"n_rows":7,"n_cols":6,"rows_kept":7,"cut":false,"hidden":true,"merged":[]}
["RECEPTOR: Chalk haz"]
[]
["Receptor Options"]
[]
[null,null,null,null,null,"No further dilution along pathway"]
[]
[null,null,null,null,null,"No data requirement"]

{"sheet":"Simulation","index":9,"n_rows":126,"n_cols":12,"rows_kept":126,"cut":false,"hidden":false,"merged":[]}
["SIMULATION PARAMETERS"]
[]
[null,"Monte Carlo Analysis with Crystal Ball",null,null,null,null,null,null,null,"Named Constants"]
[]
[null,null,"Reported Percentile",null,null,95,null,null,null,null,"s_per_year",{"$f":"365.25*60*60*24","v":31557600}]
[null,null,"Number of simulations",null,null,10000,null,null,null,null,"s_per_day",{"$f":"60*60*24","v":86400}]
[]
[]
[null,null,null,null,null,null,null,null,null,"Laplace Transform Solution Parameters"]
[]
[null,null,"Minimise while running:",null,null,null,null,null,null,null,"sigma",0]
[null,null,null,null,null,null,null,null,null,null,"nu",1]
[null,null,null,null,null,null,null,null,null,null,"nsum",16]
[null,null,null,null,null,null,null,null,null,null,"omega",11]
[]
[]
[null,"Reporting Options"]
[]
[]
[]
[]
[null,null,"Number of timeslices for breakthrough curves",null,null,null,100]
[]
[null," The timeslices specified on the results sheets are saved below."]
[null,null,"Path1 timeslices in years",null,"Path2 timeslices in years"]
[null,null,"TS_Path1",null,"TS_Path2"]
[null,null,10,null,10]
[null,null,20,null,20]
[null,null,30,null,30]
[null,null,40,null,40]
[null,null,50,null,50]
[null,null,60,null,60]
[null,null,70,null,70]
[null,null,80,null,80]
[null,null,90,null,90]
[null,null,100,null,100]
[null,null,110,null,110]
[null,null,120,null,120]
[null,null,130,null,130]
[null,null,140,null,140]
[null,null,150,null,150]
[null,null,160,null,160]
[null,null,170,null,170]
[null,null,180,null,180]
[null,null,190,null,190]
[null,null,200,null,200]
[null,null,210,null,210]
[null,null,220,null,220]
[null,null,230,null,230]
[null,null,240,null,240]
[null,null,250,null,250]
[null,null,260,null,260]
[null,null,270,null,270]
[null,null,280,null,280]
[null,null,290,null,290]
[null,null,300,null,300]
[null,null,310,null,310]
[null,null,320,null,320]
[null,null,330,null,330]
[null,null,340,null,340]
[null,null,350,null,350]
[null,null,360,null,360]
[null,null,370,null,370]
[null,null,380,null,380]
[null,null,390,null,390]
[null,null,400,null,400]
[null,null,410,null,410]
[null,null,420,null,420]
[null,null,430,null,430]
[null,null,440,null,440]
[null,null,450,null,450]
[null,null,460,null,460]
[null,null,470,null,470]
[null,null,480,null,480]
[null,null,490,null,490]
[null,null,500,null,500]
[null,null,510,null,510]
[null,null,520,null,520]
[null,null,530,null,530]
[null,null,540,null,540]
[null,null,550,null,550]
[null,null,560,null,560]
[null,null,570,null,570]
[null,null,580,null,580]
[null,null,590,null,590]
[null,null,600,null,600]
[null,null,610,null,610]
[null,null,620,null,620]
[null,null,630,null,630]
[null,null,640,null,640]
[null,null,650,null,650]
[null,null,660,null,660]
[null,null,670,null,670]
[null,null,680,null,680]
[null,null,690,null,690]
[null,null,700,null,700]
[null,null,710,null,710]
[null,null,720,null,720]
[null,null,730,null,730]
[null,null,740,null,740]
[null,null,750,null,750]
[null,null,760,null,760]
[null,null,770,null,770]
[null,null,780,null,780]
[null,null,790,null,790]
[null,null,800,null,800]
[null,null,810,null,810]
[null,null,820,null,820]
[null,null,830,null,830]
[null,null,840,null,840]
[null,null,850,null,850]
[null,null,860,null,860]
[null,null,870,null,870]
[null,null,880,null,880]
[null,null,890,null,890]
[null,null,900,null,900]
[null,null,910,null,910]
[null,null,920,null,920]
[null,null,930,null,930]
[null,null,940,null,940]
[null,null,950,null,950]
[null,null,960,null,960]
[null,null,970,null,970]
[null,null,980,null,980]
[null,null,990,null,990]
[null,null,1000,null,1000]

{"sheet":"Audit","index":10,"n_rows":1748,"n_cols":11,"rows_kept":1748,"cut":false,"hidden":false,"merged":[]}
["AUDIT TRAIL SHEET"]
[]
["Author","Date","Time",null,"Cell Address",null,"New Value","Old Value","Cell Name"]
[]
[]
["Saved  13/07/2022: 11:12:52  Level Number: 5"]
[]
["BREAKTHROUGH RESULTS"]
[]
["Advanced"]
["Pollutant Linkage: Stabilised Wast, Unsat MG, Sat MG, WaterTable"]
["Concentrations in mg/L in WaterTable"]
[]
["Compared with LOQ target concentration in mg/L"]
[null,5.0000000000000001E-3]
[]
["Time(years)","Species1"]
[null,"As"]
[10,0]
[20,0]
[30,0]
[40,0]
[50,0]
[]
[]
["Saved  13/07/2022: 11:13:53  Level Number: 5"]
[]
["BREAKTHROUGH RESULTS"]
[]
["Advanced"]
["Pollutant Linkage: Stabilised Wast, Unsat MG, Sat MG, WaterTable"]
["Concentrations in mg/L in WaterTable"]
[]
["Compared with LOQ target concentration in mg/L"]
[null,5.0000000000000001E-3]
[]
["Time(years)","Species1"]
[null,"As"]
[0.02,5.522106859594858E-2]
[0.04,5.0822773815008764E-2]
[0.06,4.6774798167597033E-2]
[0.08,4.3049239136546909E-2]
[0.1,3.9620416608431595E-2]
[0.12,3.6464695860935828E-2]
[0.14000000000000001,3.3560324650778774E-2]
[0.16,3.0887283275569707E-2]
[0.18,2.8427146579314475E-2]
[0.2,2.6162956948795623E-2]
[0.22,2.4079107424755743E-2]
[0.24,2.2161234124575054E-2]
[0.26,2.039611723262064E-2]
[0.28000000000000003,1.8771589876221923E-2]
[0.3,1.7276454260039372E-2]
[0.32,1.5900404480497204E-2]
[0.34,1.4633955487362446E-2]
[0.36,1.346837770346946E-2]
[0.38,1.2395636853042196E-2]
[0.4,1.1408338580755918E-2]
[0.42,1.0499677483130687E-2]
[0.44,9.6633901996084851E-3]
[0.46,8.8937122387650162E-3]
[0.48,8.185338244505222E-3]
[0.5,7.5333854263157007E-3]
[0.52,6.933359902126659E-3]
[0.54,6.3811257228137772E-3]
[0.56000000000000005,5.8728763621424982E-3]
[0.57999999999999996,5.4051084801472922E-3]
[0.6,4.9745977731675732E-3]
[0.62,4.578376750331156E-3]
[0.64,4.2137142772722003E-3]
[0.66,3.8780967519083873E-3]
[0.68,3.5692107776266841E-3]
[0.7,3.2849272165596578E-3]
[0.72,3.0232865151686478E-3]
[0.74,2.7824851955612433E-3]
[0.76,2.5608634248025864E-3]
[0.78,2.3568935738864779E-3]
[0.8,2.1691696875911475E-3]
[0.82,1.9963977934999654E-3]
[0.84,1.8373869825974482E-3]
[0.86,1.69104120041303E-3]
[0.88,1.556351691912584E-3]
[0.9,1.4323900481593127E-3]
[0.92,1.3183018072948011E-3]
[0.94,1.2133005639827726E-3]
[0.96,1.1166625490683689E-3]
[0.98,1.0277216413539828E-3]
[1,9.4586477485540199E-4]
[1.02,8.7052771397217203E-4]
[1.04,8.0119116344754611E-4]
[1.06,7.3737718972216538E-4]
[1.08,6.7864592598850112E-4]
[1.1000000000000001,6.245925398454434E-4]
[1.1200000000000001,5.748444440005396E-4]
[1.1399999999999999,5.29058727012384E-4]
[1.1599999999999999,4.8691978980780687E-4]
[1.18,4.4813717066916341E-4]
[1.2,4.1244354253101905E-4]
[1.22,3.7959287107858209E-4]
[1.24,3.4935871795641559E-4]
[1.26,3.2153268038167426E-4]
[1.28,2.9592295489319425E-4]
[1.3,2.7235301464713124E-4]
[1.32,2.5066039313140486E-4]
[1.34,2.3069556414043852E-4]
[1.36,2.1232091087842846E-4]
[1.38,1.9540977766690273E-4]
[1.4,1.798455966700887E-4]
[1.42,1.6552108506072172E-4]
[1.44,1.5233750433695913E-4]
[1.46,1.4020398084305981E-4]
[1.48,1.2903687841719029E-4]
[1.5,1.1875922300291105E-4]
[1.52,1.0930017101610547E-4]
[1.54,1.0059452181755171E-4]
[1.56,9.2582267513316406E-5]
[1.58,8.5208180111160728E-5]
[1.6,7.8421430375082171E-5]
[1.62,7.2175237444893343E-5]
[1.64,6.6426546679148297E-5]
[1.66,6.1135732493969387E-5]
[1.68,5.6266325741818352E-5]
[1.7,5.1784761533692007E-5]
[1.72,4.7660148946276409E-5]
[1.74,4.3864056893020553E-5]
[1.76,4.0370319428239652E-5]
[1.78,3.7154854005538369E-5]
[1.8,3.4195496779158724E-5]
[1.82,3.1471849054041359E-5]
[1.84,2.8965136737322153E-5]
[1.86,2.665808117981266E-5]
[1.88,2.4534780068525202E-5]
[1.9,2.258059735281564E-5]
[1.92,2.078206309133475E-5]
[1.94,1.9126780153106914E-5]
[1.96,1.7603338520021755E-5]
[1.98,1.6201237345556999E-5]
[2,1.4910811899965508E-5]
[]
[]
["Saved  13/07/2022: 11:18:08  Level Number: 5"]
[]
["BREAKTHROUGH RESULTS"]
[]
["Advanced"]
["Pollutant Linkage: Stabilised Wast, Unsat MG, Sat MG, WaterTable"]
["Concentrations in mg/L in WaterTable"]
[]
["Compared with LOQ target concentration in mg/L"]
[null,5.0000000000000001E-3]
[]
["Time(years)","Species1"]
[null,"As"]
[0.02,3.1516265374016028E-26]
[0.04,0]
[0.06,2.234797273175616E-16]
[0.08,1.797629861921534E-12]
[0.1,3.9770916777012475E-10]
[0.12,1.4476349335908272E-8]
[0.14000000000000001,1.8740896578837826E-7]
[0.16,1.2695003781247252E-6]
[0.18,5.5781102430656332E-6]
[0.2,1.80893436897847E-5]
[0.22,4.7008635759999273E-5]
[0.24,1.0342245499570046E-4]
[0.26,2.0011591718261217E-4]
[0.28000000000000003,3.4995850156559953E-4]
[0.3,5.643067630794115E-4]
[0.32,8.5174608518300303E-4]
[0.34,1.2173200646433176E-3]
[0.36,1.6622534633742513E-3]
[0.38,2.1840878526006948E-3]
[0.4,2.7771128683519741E-3]
[0.42,3.4329744672256298E-3]
[0.44,4.1413589300495256E-3]
[0.46,4.8906759633393039E-3]
[0.48,5.6686889747554333E-3]
[0.5,6.4630618610541464E-3]
[0.52,7.2618081678090043E-3]
[0.54,8.0536402913203367E-3]
[0.56000000000000005,8.8282241490879633E-3]
[0.57999999999999996,9.5763493068779151E-3]
[0.6,1.0290026761572865E-2]
[0.62,1.0962527164954947E-2]
[0.64,1.15883718098842E-2]
[0.66,1.2163287617785536E-2]
[0.68,1.2684135971692137E-2]
[0.7,1.3148823740284379E-2]
[0.72,1.3556203368641636E-2]
[0.74,1.3905967549850705E-2]
[0.76,1.4198542779412413E-2]
[0.78,1.443498504745047E-2]
[0.8,1.4616880041764988E-2]
[0.82,1.4746249507770301E-2]
[0.84,1.4825464824170917E-2]
[0.86,1.4857168388392763E-2]
[0.88,1.4844203045661088E-2]
[0.9,1.4789549523238186E-2]
[0.92,1.4696271631377227E-2]
[0.94,1.4567468851363176E-2]
[0.96,1.4406235836755635E-2]
[0.98,1.4215628296706874E-2]
[1,1.3998634701533555E-2]
[1.02,1.3758153243716193E-2]
[1.04,1.3496973496572468E-2]
[1.06,1.3217762233405367E-2]
[1.08,1.2923052898469052E-2]
[1.1000000000000001,1.2615238254667429E-2]
[1.1200000000000001,1.229656576945274E-2]
[1.1399999999999999,1.1969135338125299E-2]
[1.1599999999999999,1.1634898981500793E-2]
[1.18,1.1295662191787976E-2]
[1.2,1.0953086635744205E-2]
[1.22,1.0608693957570955E-2]
[1.24,1.0263870455017896E-2]
[1.26,9.9198724308269311E-3]
[1.28,9.5778320479794846E-3]
[1.3,9.2387635408878836E-3]
[1.32,8.9035696562861227E-3]
[1.34,8.5730482167404344E-3]
[1.36,8.2478987168764107E-3]
[1.38,7.9287288776159603E-3]
[1.4,7.6160610970628624E-3]
[1.42,7.31033874842325E-3]
[1.44,7.0119322855587323E-3]
[1.46,6.7211451256280067E-3]
[1.48,6.4382192858558236E-3]
[1.5,6.1633407581217917E-3]
[1.52,5.8966446104342998E-3]
[1.54,5.6382198092397931E-3]
[1.56,5.3881137603381899E-3]
[1.58,5.1463365694295205E-3]
[1.6,4.912865026062533E-3]
[1.62,4.6876463169002111E-3]
[1.64,4.4706014758439236E-3]
[1.66,4.2616285800949772E-3]
[1.68,4.0606057020113901E-3]
[1.7,3.8673936275545138E-3]
[1.72,3.6818383524783727E-3]
[1.74,3.5037733678320625E-3]
[1.76,3.3330217462679461E-3]
[1.78,3.1693980409300071E-3]
[1.8,3.0127100083256184E-3]
[1.82,2.862760166430129E-3]
[1.84,2.719347199086326E-3]
[1.86,2.5822672172794666E-3]
[1.88,2.4513148874941793E-3]
[1.9,2.3262844370647161E-3]
[1.92,2.206970545786668E-3]
[1.94,2.0931691327204958E-3]
[1.96,1.9846780466514489E-3]
[1.98,1.8812976681107712E-3]
[2,1.7828314305568802E-3]
[]
[]
["Saved  13/07/2022: 11:20:13  Level Number: 5"]
[]
["BREAKTHROUGH RESULTS"]
[]
["Advanced"]
["Pollutant Linkage: Stabilised Wast, Unsat MG, Sat MG, WaterTable"]
["Concentrations in mg/L in WaterTable"]
[]
["Compared with LOQ target concentration in mg/L"]
[null,5.0000000000000001E-3]
[]
["Time(years)","Species1"]
[null,"As"]
[0.02,0]
[0.04,0]
[0.06,5.7050182916551672E-22]
[0.08,5.0344013797660854E-20]
[0.1,7.346064975327765E-18]
[0.12,5.8512205978704167E-15]
[0.14000000000000001,6.2554263002228028E-13]
[0.16,2.0791346933974013E-11]
[0.18,3.1664546469204572E-10]
[0.2,2.7904459009401734E-9]
[0.22,1.6509150365949121E-8]
[0.24,7.2409112233016811E-8]
[0.26,2.5218630286244436E-7]
[0.28000000000000003,7.3256311753628866E-7]
[0.3,1.8400280301748795E-6]
[0.32,4.1059733108333094E-6]
[0.34,8.3103422746690227E-6]
[0.36,1.5503818193895059E-5]
[0.38,2.7002985408429036E-5]
[0.4,4.4357984933858907E-5]
[0.42,6.9296528307260103E-5]
[0.44,1.036509638620046E-4]
[0.46,1.4927627607367604E-4]
[0.48,2.0796671027233343E-4]
[0.5,2.8137759155310877E-4]
[0.52,3.7095729301564933E-4]
[0.54,4.7789256614809428E-4]
[0.56000000000000005,6.0306882425241297E-4]
[0.57999999999999996,7.4704561082337799E-4]
[0.6,9.1004644717108474E-4]
[0.62,1.0919615377394045E-3]
[0.64,1.2923613832229164E-3]
[0.66,1.5105191596337568E-3]
[0.68,1.7454397103669657E-3]
[0.7,1.9958931156209667E-3]
[0.72,2.2604510039170378E-3]
[0.74,2.5375240172400052E-3]
[0.76,2.8253991064566063E-3]
[0.78,3.1222755969296922E-3]
[0.8,3.4262992119872978E-3]
[0.82,3.7355934657323743E-3]
[0.84,4.0482880322073433E-3]
[0.86,4.3625438636961849E-3]
[0.88,4.6765749675135061E-3]
[0.9,4.9886668598709497E-3]
[0.92,5.297191799967532E-3]
[0.94,5.6006209703481835E-3]
[0.96,5.8975338139225829E-3]
[0.98,6.1866247668679016E-3]
[1,6.4667076427630055E-3]
[1.02,6.7367179292591693E-3]
[1.04,6.9957132566204E-3]
[1.06,7.2428722894844564E-3]
[1.08,7.4774922808304757E-3]
[1.1000000000000001,7.6989855117436104E-3]
[1.1200000000000001,7.9068748232376026E-3]
[1.1399999999999999,8.1007884280162121E-3]
[1.1599999999999999,8.2804541713243692E-3]
[1.18,8.4456933914753667E-3]
[1.2,8.5964145126590456E-3]
[1.22,8.7326064855114145E-3]
[1.24,8.8543321748510029E-3]
[1.26,8.9617217791002676E-3]
[1.28,9.0549663522560102E-3]
[1.3,9.1343114868923121E-3]
[1.32,9.2000512055351452E-3]
[1.34,9.252522097829086E-3]
[1.36,9.2920977321424153E-3]
[1.38,9.3191833625711103E-3]
[1.4,9.3342109456259134E-3]
[1.42,9.3376344751424176E-3]
[1.44,9.3299256390485009E-3]
[1.46,9.3115697974978113E-3]
[1.48,9.2830622784283775E-3]
[1.5,9.2449049837867395E-3]
[1.52,9.1976032973562893E-3]
[1.54,9.1416632833477181E-3]
[1.56,9.0775891635047224E-3]
[1.58,9.0058810594631535E-3]
[1.6,8.9270329863978988E-3]
[1.62,8.8415310835440776E-3]
[1.64,8.7498520669694272E-3]
[1.66,8.6524618899538851E-3]
[1.68,8.5498145964644917E-3]
[1.7,8.4423513534885586E-3]
[1.72,8.3304996483463175E-3]
[1.74,8.2146726375680358E-3]
[1.76,8.0952686344441926E-3]
[1.78,7.9726707229037658E-3]
[1.8,7.8472464859940614E-3]
[1.82,7.7193478378571314E-3]
[1.84,7.5893109487077072E-3]
[1.86,7.4574562529912437E-3]
[1.88,7.3240885314832214E-3]
[1.9,7.1894970587763844E-3]
[1.92,7.0539558081397892E-3]
[1.94,6.917723706380924E-3]
[1.96,6.7810449318772108E-3]
[1.98,6.6441492494975088E-3]
[2,6.5072523766669405E-3]
[]
[]
["Saved  13/07/2022: 12:15:22  Level Number: 5"]
[]
["BREAKTHROUGH RESULTS"]
[]
["Advanced"]
["Pollutant Linkage: Stabilised Wast, Unsat MG, Sat MG, Alluvium, Chalk, Chalk haz",null,null,null,"Pollutant Linkage: Stabilised Wast, Unsat MG, Sat MG, Alluvium, Chalk, Chalk nonhaz"]
["Concentrations in mg/L in Chalk haz",null,null,null,"Concentrations in mg/L in Chalk nonhaz"]
[]
["Compared with EAL target concentration in mg/L",null,null,null,"No target concentrations specified for comparison"]
[null,5.0000000000000001E-3,0.05]
[]
["Time(years)","Species1","Species2",null,"Time(years)","Species1","Species2"]
[null,"As","Cr",null,null,"As","Cr"]
[10,0,0,null,10,0,0]
[20,0,0,null,20,0,0]
[30,0,0,null,30,0,0]
[40,0,0,null,40,0,0]
[50,0,0,null,50,0,0]
[60,0,0,null,60,0,0]
[70,0,0,null,70,0,0]
[80,0,0,null,80,0,0]
[90,0,0,null,90,0,0]
[100,0,0,null,100,0,0]
[110,0,0,null,110,0,0]
[120,4.5371171561820148E-13,1.057910565212614E-12,null,120,5.7096285695532435E-14,1.3336949336586715E-13]
[130,8.1227109651386716E-13,1.8949864230582975E-12,null,130,1.0228086412939419E-13,2.3865288916830914E-13]
[140,1.0646065757775107E-12,2.4824034069627063E-12,null,140,1.3403338430616722E-13,3.1254669934187652E-13]
[150,1.2504832689826938E-12,2.9193059637991959E-12,null,150,1.5744473197886357E-13,3.6745091362191842E-13]
[160,1.3832267200328534E-12,3.2264637177586066E-12,null,160,1.741968698478926E-13,4.0618127281778109E-13]
[170,1.4832518467641599E-12,3.4604970956604562E-12,null,170,1.8674806357450618E-13,4.3568537154740981E-13]
[180,1.5503300323895691E-12,3.6167395216449376E-12,null,180,1.9514219870636984E-13,4.5538686758839896E-13]
[190,1.5981865114300066E-12,3.7298259583628551E-12,null,190,2.0121677169795748E-13,4.6957618475573474E-13]
[200,1.6292411349563456E-12,3.8009233644438529E-12,null,200,2.0508158781717909E-13,4.7862459951076029E-13]
[210,1.6488821041368966E-12,3.8475227209391302E-12,null,210,2.076102825215119E-13,4.8429802147073237E-13]
[220,1.6593885618470237E-12,3.8723123292843769E-12,null,220,2.0894484938593344E-13,4.8746518154680626E-13]
[230,1.6601451949393543E-12,3.8740924181023225E-12,null,230,2.089812986584579E-13,4.8763564201099417E-13]
[240,1.6564628190076062E-12,3.8659807012311219E-12,null,240,2.0854907603232007E-13,4.866774461505214E-13]
[250,1.6474733388843564E-12,3.8445217650007201E-12,null,250,2.0743249009458071E-13,4.8393202317149362E-13]
[260,1.6371489727154319E-12,3.8205867845915644E-12,null,260,2.0613347846716499E-13,4.8091353392200667E-13]
[270,1.6208892668190912E-12,3.7817829483706761E-12,null,270,2.0406707722815935E-13,4.76174106857814E-13]
[280,1.6055779149836588E-12,3.7461325680215693E-12,null,280,2.0213148844993433E-13,4.7163596982079943E-13]
[290,1.5875967153424989E-12,3.7043834266654058E-12,null,290,1.9987544363654337E-13,4.6639414110979626E-13]
[300,1.5697807603176773E-12,3.6629029449398928E-12,null,300,1.9764246336813217E-13,4.6117181505667025E-13]
[310,1.5487462915462769E-12,3.6137338116401522E-12,null,310,1.9499578350009201E-13,4.5492295956812884E-13]
[320,1.5267478522111734E-12,3.5618856485518469E-12,null,320,1.9221251451497666E-13,4.4844929495533202E-13]
[330,1.5061107622059926E-12,3.51394213061421E-12,null,330,1.8961462074750411E-13,4.4243907256614954E-13]
[340,1.4861912586359359E-12,3.4675504026870081E-12,null,340,1.8710774003236735E-13,4.3655368184611697E-13]
[350,1.4640628858217632E-12,3.4157370793778377E-12,null,350,1.8432379805013139E-13,4.3006864769304606E-13]
[360,1.4427653336085155E-12,3.366109250656567E-12,null,360,1.8161645577633488E-13,4.2383361317763105E-13]
[370,1.421913344316043E-12,3.3183376559666444E-12,null,370,1.7903031090738091E-13,4.1774283540039085E-13]
[380,1.4003892602460716E-12,3.2677954165501776E-12,null,380,1.7628823938761471E-13,4.1135939283789189E-13]
[390,1.3815261786112043E-12,3.2237318078042381E-12,null,390,1.7394397448813659E-13,4.0585553902692103E-13]
[400,1.3599406448380036E-12,3.1735638287296421E-12,null,400,1.7121458899356063E-13,3.9957392444111861E-13]
[410,1.3411459985359553E-12,3.1294810048769142E-12,null,410,1.6883535637208627E-13,3.9401031973367717E-13]
[420,1.3221108140782551E-12,3.0846555112594849E-12,null,420,1.6643533816100021E-13,3.8834163861805387E-13]
[430,1.3025141987833056E-12,3.0386899062754011E-12,null,430,1.6399503093670109E-13,3.8253285872195618E-13]
[440,1.2835487741713119E-12,2.995048344347585E-12,null,440,1.6160646723450118E-13,3.7710263516577778E-13]
[450,1.2652841002233581E-12,2.9518340978197521E-12,null,450,1.592975496223359E-13,3.7163676985797074E-13]
[460,1.2483534273996259E-12,2.9131171944276756E-12,null,460,1.5716005189353669E-13,3.667162013573367E-13]
[470,1.2301856198986218E-12,2.8702953796385871E-12,null,470,1.5485368147046499E-13,3.6133892305485984E-13]
[480,1.2116748087239235E-12,2.8276723158452577E-12,null,480,1.525500823614241E-13,3.5594112807455374E-13]
[490,1.1967427281493353E-12,2.7925323089709641E-12,null,490,1.5066726030987533E-13,3.5158150561613344E-13]
[500,1.1796496782289461E-12,2.7521100482124967E-12,null,500,1.4852381114324109E-13,3.4650504417239109E-13]
[510,1.163808636092671E-12,2.7156429131430287E-12,null,510,1.4651051951214093E-13,3.4183178748309681E-13]
[520,1.1481082317008619E-12,2.6788557073934067E-12,null,520,1.4456114614559954E-13,3.3727341961703911E-13]
[530,1.1332336696603843E-12,2.643473023498712E-12,null,530,1.4266237711351485E-13,3.3277643298314683E-13]
[540,1.1163740746750565E-12,2.6050009920373814E-12,null,540,1.4053871194076473E-13,3.2790730635377338E-13]
[550,1.1028684615190794E-12,2.5736340142728529E-12,null,550,1.3885601953602573E-13,3.2401085670213856E-13]
[560,1.088100819695567E-12,2.5389709908242509E-12,null,560,1.3699778245429907E-13,3.1961551307028438E-13]
[570,1.0727263075971154E-12,2.5029839081821137E-12,null,570,1.3506302086983372E-13,3.1509755995855224E-13]
[580,1.0596364367756124E-12,2.4723305237806931E-12,null,580,1.3341547296658749E-13,3.112639101049811E-13]
[590,1.0467330713517628E-12,2.4424529972591044E-12,null,590,1.3179650865810828E-13,3.0750251927297539E-13]
[600,1.0335457153739699E-12,2.4117512847975674E-12,null,600,1.3012238891873756E-13,3.0364327431248319E-13]
[610,1.0198515253568275E-12,2.3799984634885175E-12,null,610,1.2839885535927942E-13,2.9961614604908428E-13]
[620,1.0077935404844597E-12,2.3517267253884686E-12,null,620,1.2688902290960556E-13,2.9605208690940771E-13]
[630,9.9582872801074606E-13,2.3236978548399782E-12,null,630,1.2536766371435045E-13,2.9252226619883206E-13]
[640,9.828109892737621E-13,2.2928360972388004E-12,null,640,1.2372637429935371E-13,2.8866971298282357E-13]
[650,9.7264262906819813E-13,2.2693890950710595E-12,null,650,1.22437166064822E-13,2.8572100501148625E-13]
[660,9.6031366183831475E-13,2.2411058895000128E-12,null,660,1.2090837885983492E-13,2.8212807090390806E-13]
[670,9.4813646734850625E-13,2.2126801894232688E-12,null,670,1.1936269072159464E-13,2.7859545678026437E-13]
[680,9.3880016622721212E-13,2.1908143685412802E-12,null,680,1.1820638723594692E-13,2.7578960728745211E-13]
[690,9.2815299722058868E-13,2.1653995479259809E-12,null,690,1.1685808289730459E-13,2.7263778955698586E-13]
[700,9.1603061470025341E-13,2.137425122119107E-12,null,700,1.1533434949491108E-13,2.6907509568735887E-13]
[710,9.0683685529972932E-13,2.1162625470912678E-12,null,710,1.1417212017531973E-13,2.6639924670032688E-13]
[720,8.9551292164675274E-13,2.0894887392068031E-12,null,720,1.1273720389850177E-13,2.630681469798768E-13]
[730,8.8617248080868659E-13,2.0678792215010375E-12,null,730,1.1156724080376218E-13,2.6035652718184656E-13]
[740,8.7647661904551642E-13,2.0452951416236393E-12,null,740,1.1035952916903807E-13,2.5750114273014014E-13]
[750,8.6750165224196726E-13,2.0240656912575699E-12,null,750,1.0921823487307858E-13,2.5480860989131636E-13]
[760,8.5779834060338646E-13,2.0013250164131413E-12,null,760,1.0799031657566738E-13,2.5199271790475785E-13]
[770,8.48915845962268E-13,1.9804172757832482E-12,null,770,1.0687438947388061E-13,2.4934815170489466E-13]
[780,8.39801040015669E-13,1.9593614448981643E-12,null,780,1.0572620411837732E-13,2.4668730629426047E-13]
[790,8.3079288394250054E-13,1.938500919515236E-12,null,790,1.0459007227897199E-13,2.4404491156323446E-13]
[800,8.2211154031621596E-13,1.9183448832790582E-12,null,800,1.0351197148897208E-13,2.4152422100904119E-13]
[810,8.147140663596523E-13,1.9010472962490759E-12,null,810,1.0257182758105041E-13,2.3930262195538889E-13]
[820,8.0607598102144262E-13,1.8808706470878757E-12,null,820,1.0147810899309094E-13,2.3678248242655597E-13]
[830,7.9763138300524171E-13,1.8612478775908072E-12,null,830,1.004174503265278E-13,2.3427471707309312E-13]
[840,7.9023665495691684E-13,1.8438014482366124E-12,null,840,9.9487386572325558E-14,2.321279921998085E-13]
[850,7.8209434674424885E-13,1.8247567133195867E-12,null,850,9.8462007224940294E-14,2.2971150781719202E-13]
[860,7.745534600918194E-13,1.8069948724407793E-12,null,860,9.7511620512127557E-14,2.2751960720135186E-13]
[870,7.6683974526751993E-13,1.7890861604779404E-12,null,870,9.6541197325230454E-14,2.2522879701024426E-13]
[880,7.5979132512616119E-13,1.7728769632539904E-12,null,880,9.565018401937915E-14,2.2318864964254186E-13]
[890,7.5237180176749118E-13,1.7556237835073722E-12,null,890,9.4720319024935034E-14,2.2103131235625752E-13]
[900,7.4538301744541008E-13,1.7396659521219647E-12,null,900,9.3853374102497212E-14,2.1900552229289366E-13]
[910,7.388130136598007E-13,1.7239076279099922E-12,null,910,9.3014834801798313E-14,2.1704006547897282E-13]
[920,7.3194735899323355E-13,1.7079399075953598E-12,null,920,9.214857547822875E-14,2.1500924744741977E-13]
[930,7.2469059683882353E-13,1.6910335528300433E-12,null,930,9.1228482566895353E-14,2.1290994879517438E-13]
[940,7.185361415413609E-13,1.6766847206513003E-12,null,940,9.0455735524648636E-14,2.1107064251388154E-13]
[950,7.1149862615186643E-13,1.6600438156562747E-12,null,950,8.9584218924921734E-14,2.089887279071151E-13]
[960,7.0544685658082841E-13,1.6462169407267505E-12,null,960,8.8819412444728778E-14,2.0724281923359548E-13]
[970,6.9939958850006105E-13,1.631978534543972E-12,null,970,8.8058796517853656E-14,2.054697062942777E-13]
[980,6.9355142006809809E-13,1.6181662880926756E-12,null,980,8.7317748522659012E-14,2.0373504405512384E-13]
[990,6.8614751518647012E-13,1.601248598069476E-12,null,990,8.6396615313089351E-14,2.0159914427676403E-13]
[1000,6.8135602701629067E-13,1.5899287175505701E-12,null,1000,8.5776408869155199E-14,2.0015114126798385E-13]
[]
[]
["Saved  13/07/2022: 12:17:53  Level Number: 5"]
[]
["BREAKTHROUGH RESULTS"]
[]
["Advanced"]
["Pollutant Linkage: Stabilised Wast, Unsat MG, Sat MG, Alluvium, Chalk, Chalk haz",null,null,null,"Pollutant Linkage: Stabilised Wast, Unsat MG, Sat MG, Alluvium, Chalk, Chalk nonhaz"]
["Concentrations in mg/L in Chalk haz",null,null,null,"Concentrations in mg/L in Chalk nonhaz"]
[]
["Compared with EAL target concentration in mg/L",null,null,null,"No target concentrations specified for comparison"]
[null,5.0000000000000001E-3,0.05]
[]
["Time(years)","Species1","Species2",null,"Time(years)","Species1","Species2"]
[null,"As","Cr",null,null,"As","Cr"]
[10,0,0,null,10,0,0]
[20,0,0,null,20,0,0]
[30,0,0,null,30,0,0]
[40,0,0,null,40,0,0]
[50,0,0,null,50,0,0]
[60,0,0,null,60,0,0]
[70,0,0,null,70,0,0]
[80,0,0,null,80,0,0]
[90,0,0,null,90,0,0]
[100,0,0,null,100,0,0]
[110,0,0,null,110,0,0]
[120,4.5371171561820148E-13,1.057910565212614E-12,null,120,5.7096285695532435E-14,1.3336949336586715E-13]
[130,8.1227109651386716E-13,1.8949864230582975E-12,null,130,1.0228086412939419E-13,2.3865288916830914E-13]
[140,1.0646065757775107E-12,2.4824034069627063E-12,null,140,1.3403338430616722E-13,3.1254669934187652E-13]
[150,1.2504832689826938E-12,2.9193059637991959E-12,null,150,1.5744473197886357E-13,3.6745091362191842E-13]
[160,1.3832267200328534E-12,3.2264637177586066E-12,null,160,1.741968698478926E-13,4.0618127281778109E-13]
[170,1.4832518467641599E-12,3.4604970956604562E-12,null,170,1.8674806357450618E-13,4.3568537154740981E-13]
[180,1.5503300323895691E-12,3.6167395216449376E-12,null,180,1.9514219870636984E-13,4.5538686758839896E-13]
[190,1.5981865114300066E-12,3.7298259583628551E-12,null,190,2.0121677169795748E-13,4.6957618475573474E-13]
[200,1.6292411349563456E-12,3.8009233644438529E-12,null,200,2.0508158781717909E-13,4.7862459951076029E-13]
[210,1.6488821041368966E-12,3.8475227209391302E-12,null,210,2.076102825215119E-13,4.8429802147073237E-13]
[220,1.6593885618470237E-12,3.8723123292843769E-12,null,220,2.0894484938593344E-13,4.8746518154680626E-13]
[230,1.6601451949393543E-12,3.8740924181023225E-12,null,230,2.089812986584579E-13,4.8763564201099417E-13]
[240,1.6564628190076062E-12,3.8659807012311219E-12,null,240,2.0854907603232007E-13,4.866774461505214E-13]
[250,1.6474733388843564E-12,3.8445217650007201E-12,null,250,2.0743249009458071E-13,4.8393202317149362E-13]
[260,1.6371489727154319E-12,3.8205867845915644E-12,null,260,2.0613347846716499E-13,4.8091353392200667E-13]
[270,1.6208892668190912E-12,3.7817829483706761E-12,null,270,2.0406707722815935E-13,4.76174106857814E-13]
[280,1.6055779149836588E-12,3.7461325680215693E-12,null,280,2.0213148844993433E-13,4.7163596982079943E-13]
[290,1.5875967153424989E-12,3.7043834266654058E-12,null,290,1.9987544363654337E-13,4.6639414110979626E-13]
[300,1.5697807603176773E-12,3.6629029449398928E-12,null,300,1.9764246336813217E-13,4.6117181505667025E-13]
[310,1.5487462915462769E-12,3.6137338116401522E-12,null,310,1.9499578350009201E-13,4.5492295956812884E-13]
[320,1.5267478522111734E-12,3.5618856485518469E-12,null,320,1.9221251451497666E-13,4.4844929495533202E-13]
[330,1.5061107622059926E-12,3.51394213061421E-12,null,330,1.8961462074750411E-13,4.4243907256614954E-13]
[340,1.4861912586359359E-12,3.4675504026870081E-12,null,340,1.8710774003236735E-13,4.3655368184611697E-13]
[350,1.4640628858217632E-12,3.4157370793778377E-12,null,350,1.8432379805013139E-13,4.3006864769304606E-13]
[360,1.4427653336085155E-12,3.366109250656567E-12,null,360,1.8161645577633488E-13,4.2383361317763105E-13]
[370,1.421913344316043E-12,3.3183376559666444E-12,null,370,1.7903031090738091E-13,4.1774283540039085E-13]
[380,1.4003892602460716E-12,3.2677954165501776E-12,null,380,1.7628823938761471E-13,4.1135939283789189E-13]
[390,1.3815261786112043E-12,3.2237318078042381E-12,null,390,1.7394397448813659E-13,4.0585553902692103E-13]
[400,1.3599406448380036E-12,3.1735638287296421E-12,null,400,1.7121458899356063E-13,3.9957392444111861E-13]
[410,1.3411459985359553E-12,3.1294810048769142E-12,null,410,1.6883535637208627E-13,3.9401031973367717E-13]
[420,1.3221108140782551E-12,3.0846555112594849E-12,null,420,1.6643533816100021E-13,3.8834163861805387E-13]
[430,1.3025141987833056E-12,3.0386899062754011E-12,null,430,1.6399503093670109E-13,3.8253285872195618E-13]
[440,1.2835487741713119E-12,2.995048344347585E-12,null,440,1.6160646723450118E-13,3.7710263516577778E-13]
[450,1.2652841002233581E-12,2.9518340978197521E-12,null,450,1.592975496223359E-13,3.7163676985797074E-13]
[460,1.2483534273996259E-12,2.9131171944276756E-12,null,460,1.5716005189353669E-13,3.667162013573367E-13]
[470,1.2301856198986218E-12,2.8702953796385871E-12,null,470,1.5485368147046499E-13,3.6133892305485984E-13]
[480,1.2116748087239235E-12,2.8276723158452577E-12,null,480,1.525500823614241E-13,3.5594112807455374E-13]
[490,1.1967427281493353E-12,2.7925323089709641E-12,null,490,1.5066726030987533E-13,3.5158150561613344E-13]
[500,1.1796496782289461E-12,2.7521100482124967E-12,null,500,1.4852381114324109E-13,3.4650504417239109E-13]
[510,1.163808636092671E-12,2.7156429131430287E-12,null,510,1.4651051951214093E-13,3.4183178748309681E-13]
[520,1.1481082317008619E-12,2.6788557073934067E-12,null,520,1.4456114614559954E-13,3.3727341961703911E-13]
[530,1.1332336696603843E-12,2.643473023498712E-12,null,530,1.4266237711351485E-13,3.3277643298314683E-13]
[540,1.1163740746750565E-12,2.6050009920373814E-12,null,540,1.4053871194076473E-13,3.2790730635377338E-13]
[550,1.1028684615190794E-12,2.5736340142728529E-12,null,550,1.3885601953602573E-13,3.2401085670213856E-13]
[560,1.088100819695567E-12,2.5389709908242509E-12,null,560,1.3699778245429907E-13,3.1961551307028438E-13]
[570,1.0727263075971154E-12,2.5029839081821137E-12,null,570,1.3506302086983372E-13,3.1509755995855224E-13]
[580,1.0596364367756124E-12,2.4723305237806931E-12,null,580,1.3341547296658749E-13,3.112639101049811E-13]
[590,1.0467330713517628E-12,2.4424529972591044E-12,null,590,1.3179650865810828E-13,3.0750251927297539E-13]
[600,1.0335457153739699E-12,2.4117512847975674E-12,null,600,1.3012238891873756E-13,3.0364327431248319E-13]
[610,1.0198515253568275E-12,2.3799984634885175E-12,null,610,1.2839885535927942E-13,2.9961614604908428E-13]
[620,1.0077935404844597E-12,2.3517267253884686E-12,null,620,1.2688902290960556E-13,2.9605208690940771E-13]
[630,9.9582872801074606E-13,2.3236978548399782E-12,null,630,1.2536766371435045E-13,2.9252226619883206E-13]
[640,9.828109892737621E-13,2.2928360972388004E-12,null,640,1.2372637429935371E-13,2.8866971298282357E-13]
[650,9.7264262906819813E-13,2.2693890950710595E-12,null,650,1.22437166064822E-13,2.8572100501148625E-13]
[660,9.6031366183831475E-13,2.2411058895000128E-12,null,660,1.2090837885983492E-13,2.8212807090390806E-13]
[670,9.4813646734850625E-13,2.2126801894232688E-12,null,670,1.1936269072159464E-13,2.7859545678026437E-13]
[680,9.3880016622721212E-13,2.1908143685412802E-12,null,680,1.1820638723594692E-13,2.7578960728745211E-13]
[690,9.2815299722058868E-13,2.1653995479259809E-12,null,690,1.1685808289730459E-13,2.7263778955698586E-13]
[700,9.1603061470025341E-13,2.137425122119107E-12,null,700,1.1533434949491108E-13,2.6907509568735887E-13]
[710,9.0683685529972932E-13,2.1162625470912678E-12,null,710,1.1417212017531973E-13,2.6639924670032688E-13]
[720,8.9551292164675274E-13,2.0894887392068031E-12,null,720,1.1273720389850177E-13,2.630681469798768E-13]
[730,8.8617248080868659E-13,2.0678792215010375E-12,null,730,1.1156724080376218E-13,2.6035652718184656E-13]
[740,8.7647661904551642E-13,2.0452951416236393E-12,null,740,1.1035952916903807E-13,2.5750114273014014E-13]
[750,8.6750165224196726E-13,2.0240656912575699E-12,null,750,1.0921823487307858E-13,2.5480860989131636E-13]
[760,8.5779834060338646E-13,2.0013250164131413E-12,null,760,1.0799031657566738E-13,2.5199271790475785E-13]
[770,8.48915845962268E-13,1.9804172757832482E-12,null,770,1.0687438947388061E-13,2.4934815170489466E-13]
[780,8.39801040015669E-13,1.9593614448981643E-12,null,780,1.0572620411837732E-13,2.4668730629426047E-13]
[790,8.3079288394250054E-13,1.938500919515236E-12,null,790,1.0459007227897199E-13,2.4404491156323446E-13]
[800,8.2211154031621596E-13,1.9183448832790582E-12,null,800,1.0351197148897208E-13,2.4152422100904119E-13]
[810,8.147140663596523E-13,1.9010472962490759E-12,null,810,1.0257182758105041E-13,2.3930262195538889E-13]
[820,8.0607598102144262E-13,1.8808706470878757E-12,null,820,1.0147810899309094E-13,2.3678248242655597E-13]
[830,7.9763138300524171E-13,1.8612478775908072E-12,null,830,1.004174503265278E-13,2.3427471707309312E-13]
[840,7.9023665495691684E-13,1.8438014482366124E-12,null,840,9.9487386572325558E-14,2.321279921998085E-13]
[850,7.8209434674424885E-13,1.8247567133195867E-12,null,850,9.8462007224940294E-14,2.2971150781719202E-13]
[860,7.745534600918194E-13,1.8069948724407793E-12,null,860,9.7511620512127557E-14,2.2751960720135186E-13]
[870,7.6683974526751993E-13,1.7890861604779404E-12,null,870,9.6541197325230454E-14,2.2522879701024426E-13]
[880,7.5979132512616119E-13,1.7728769632539904E-12,null,880,9.565018401937915E-14,2.2318864964254186E-13]
[890,7.5237180176749118E-13,1.7556237835073722E-12,null,890,9.4720319024935034E-14,2.2103131235625752E-13]
[900,7.4538301744541008E-13,1.7396659521219647E-12,null,900,9.3853374102497212E-14,2.1900552229289366E-13]
[910,7.388130136598007E-13,1.7239076279099922E-12,null,910,9.3014834801798313E-14,2.1704006547897282E-13]
[920,7.3194735899323355E-13,1.7079399075953598E-12,null,920,9.214857547822875E-14,2.1500924744741977E-13]
[930,7.2469059683882353E-13,1.6910335528300433E-12,null,930,9.1228482566895353E-14,2.1290994879517438E-13]
[940,7.185361415413609E-13,1.6766847206513003E-12,null,940,9.0455735524648636E-14,2.1107064251388154E-13]
[950,7.1149862615186643E-13,1.6600438156562747E-12,null,950,8.9584218924921734E-14,2.089887279071151E-13]
[960,7.0544685658082841E-13,1.6462169407267505E-12,null,960,8.8819412444728778E-14,2.0724281923359548E-13]
[970,6.9939958850006105E-13,1.631978534543972E-12,null,970,8.8058796517853656E-14,2.054697062942777E-13]
[980,6.9355142006809809E-13,1.6181662880926756E-12,null,980,8.7317748522659012E-14,2.0373504405512384E-13]
[990,6.8614751518647012E-13,1.601248598069476E-12,null,990,8.6396615313089351E-14,2.0159914427676403E-13]
[1000,6.8135602701629067E-13,1.5899287175505701E-12,null,1000,8.5776408869155199E-14,2.0015114126798385E-13]
[]
[]
["Saved  13/07/2022: 12:20:58  Level Number: 5"]
[]
["BREAKTHROUGH RESULTS"]
[]
["Advanced"]
["Pollutant Linkage: Stabilised Wast, Unsat MG, Sat MG, Alluvium, Chalk, Chalk haz",null,null,null,"Pollutant Linkage: Stabilised Wast, Unsat MG, Sat MG, Alluvium, Chalk, Chalk nonhaz"]
["Concentrations in mg/L in Chalk haz",null,null,null,"Concentrations in mg/L in Chalk nonhaz"]
[]
["Compared with EAL target concentration in mg/L",null,null,null,"No target concentrations specified for comparison"]
[null,5.0000000000000001E-3,0.05]
[]
["Time(years)","Species1","Species2",null,"Time(years)","Species1","Species2"]
[null,"As","Cr",null,null,"As","Cr"]
[10,0,0,null,10,0,0]
[20,0,0,null,20,0,0]
[30,0,0,null,30,0,0]
[40,0,0,null,40,0,0]
[50,0,0,null,50,0,0]
[60,0,0,null,60,0,0]
[70,0,0,null,70,0,0]
[80,0,0,null,80,0,0]
[90,0,0,null,90,0,0]
[100,0,0,null,100,0,0]
[110,0,0,null,110,0,0]
[120,4.5371171561820148E-13,1.057910565212614E-12,null,120,5.7096285695532435E-14,1.3336949336586715E-13]
[130,8.1227109651386716E-13,1.8949864230582975E-12,null,130,1.0228086412939419E-13,2.3865288916830914E-13]
[140,1.0646065757775107E-12,2.4824034069627063E-12,null,140,1.3403338430616722E-13,3.1254669934187652E-13]
[150,1.2504832689826938E-12,2.9193059637991959E-12,null,150,1.5744473197886357E-13,3.6745091362191842E-13]
[160,1.3832267200328534E-12,3.2264637177586066E-12,null,160,1.741968698478926E-13,4.0618127281778109E-13]
[170,1.4832518467641599E-12,3.4604970956604562E-12,null,170,1.8674806357450618E-13,4.3568537154740981E-13]
[180,1.5503300323895691E-12,3.6167395216449376E-12,null,180,1.9514219870636984E-13,4.5538686758839896E-13]
[190,1.5981865114300066E-12,3.7298259583628551E-12,null,190,2.0121677169795748E-13,4.6957618475573474E-13]
[200,1.6292411349563456E-12,3.8009233644438529E-12,null,200,2.0508158781717909E-13,4.7862459951076029E-13]
[210,1.6488821041368966E-12,3.8475227209391302E-12,null,210,2.076102825215119E-13,4.8429802147073237E-13]
[220,1.6593885618470237E-12,3.8723123292843769E-12,null,220,2.0894484938593344E-13,4.8746518154680626E-13]
[230,1.6601451949393543E-12,3.8740924181023225E-12,null,230,2.089812986584579E-13,4.8763564201099417E-13]
[240,1.6564628190076062E-12,3.8659807012311219E-12,null,240,2.0854907603232007E-13,4.866774461505214E-13]
[250,1.6474733388843564E-12,3.8445217650007201E-12,null,250,2.0743249009458071E-13,4.8393202317149362E-13]
[260,1.6371489727154319E-12,3.8205867845915644E-12,null,260,2.0613347846716499E-13,4.8091353392200667E-13]
[270,1.6208892668190912E-12,3.7817829483706761E-12,null,270,2.0406707722815935E-13,4.76174106857814E-13]
[280,1.6055779149836588E-12,3.7461325680215693E-12,null,280,2.0213148844993433E-13,4.7163596982079943E-13]
[290,1.5875967153424989E-12,3.7043834266654058E-12,null,290,1.9987544363654337E-13,4.6639414110979626E-13]
[300,1.5697807603176773E-12,3.6629029449398928E-12,null,300,1.9764246336813217E-13,4.6117181505667025E-13]
[310,1.5487462915462769E-12,3.6137338116401522E-12,null,310,1.9499578350009201E-13,4.5492295956812884E-13]
[320,1.5267478522111734E-12,3.5618856485518469E-12,null,320,1.9221251451497666E-13,4.4844929495533202E-13]
[330,1.5061107622059926E-12,3.51394213061421E-12,null,330,1.8961462074750411E-13,4.4243907256614954E-13]
[340,1.4861912586359359E-12,3.4675504026870081E-12,null,340,1.8710774003236735E-13,4.3655368184611697E-13]
[350,1.4640628858217632E-12,3.4157370793778377E-12,null,350,1.8432379805013139E-13,4.3006864769304606E-13]
[360,1.4427653336085155E-12,3.366109250656567E-12,null,360,1.8161645577633488E-13,4.2383361317763105E-13]
[370,1.421913344316043E-12,3.3183376559666444E-12,null,370,1.7903031090738091E-13,4.1774283540039085E-13]
[380,1.4003892602460716E-12,3.2677954165501776E-12,null,380,1.7628823938761471E-13,4.1135939283789189E-13]
[390,1.3815261786112043E-12,3.2237318078042381E-12,null,390,1.7394397448813659E-13,4.0585553902692103E-13]
[400,1.3599406448380036E-12,3.1735638287296421E-12,null,400,1.7121458899356063E-13,3.9957392444111861E-13]
[410,1.3411459985359553E-12,3.1294810048769142E-12,null,410,1.6883535637208627E-13,3.9401031973367717E-13]
[420,1.3221108140782551E-12,3.0846555112594849E-12,null,420,1.6643533816100021E-13,3.8834163861805387E-13]
[430,1.3025141987833056E-12,3.0386899062754011E-12,null,430,1.6399503093670109E-13,3.8253285872195618E-13]
[440,1.2835487741713119E-12,2.995048344347585E-12,null,440,1.6160646723450118E-13,3.7710263516577778E-13]
[450,1.2652841002233581E-12,2.9518340978197521E-12,null,450,1.592975496223359E-13,3.7163676985797074E-13]
[460,1.2483534273996259E-12,2.9131171944276756E-12,null,460,1.5716005189353669E-13,3.667162013573367E-13]
[470,1.2301856198986218E-12,2.8702953796385871E-12,null,470,1.5485368147046499E-13,3.6133892305485984E-13]
[480,1.2116748087239235E-12,2.8276723158452577E-12,null,480,1.525500823614241E-13,3.5594112807455374E-13]
[490,1.1967427281493353E-12,2.7925323089709641E-12,null,490,1.5066726030987533E-13,3.5158150561613344E-13]
[500,1.1796496782289461E-12,2.7521100482124967E-12,null,500,1.4852381114324109E-13,3.4650504417239109E-13]
[510,1.163808636092671E-12,2.7156429131430287E-12,null,510,1.4651051951214093E-13,3.4183178748309681E-13]
[520,1.1481082317008619E-12,2.6788557073934067E-12,null,520,1.4456114614559954E-13,3.3727341961703911E-13]
[530,1.1332336696603843E-12,2.643473023498712E-12,null,530,1.4266237711351485E-13,3.3277643298314683E-13]
[540,1.1163740746750565E-12,2.6050009920373814E-12,null,540,1.4053871194076473E-13,3.2790730635377338E-13]
[550,1.1028684615190794E-12,2.5736340142728529E-12,null,550,1.3885601953602573E-13,3.2401085670213856E-13]
[560,1.088100819695567E-12,2.5389709908242509E-12,null,560,1.3699778245429907E-13,3.1961551307028438E-13]
[570,1.0727263075971154E-12,2.5029839081821137E-12,null,570,1.3506302086983372E-13,3.1509755995855224E-13]
[580,1.0596364367756124E-12,2.4723305237806931E-12,null,580,1.3341547296658749E-13,3.112639101049811E-13]
[590,1.0467330713517628E-12,2.4424529972591044E-12,null,590,1.3179650865810828E-13,3.0750251927297539E-13]
[600,1.0335457153739699E-12,2.4117512847975674E-12,null,600,1.3012238891873756E-13,3.0364327431248319E-13]
[610,1.0198515253568275E-12,2.3799984634885175E-12,null,610,1.2839885535927942E-13,2.9961614604908428E-13]
[620,1.0077935404844597E-12,2.3517267253884686E-12,null,620,1.2688902290960556E-13,2.9605208690940771E-13]
[630,9.9582872801074606E-13,2.3236978548399782E-12,null,630,1.2536766371435045E-13,2.9252226619883206E-13]
[640,9.828109892737621E-13,2.2928360972388004E-12,null,640,1.2372637429935371E-13,2.8866971298282357E-13]
[650,9.7264262906819813E-13,2.2693890950710595E-12,null,650,1.22437166064822E-13,2.8572100501148625E-13]
[660,9.6031366183831475E-13,2.2411058895000128E-12,null,660,1.2090837885983492E-13,2.8212807090390806E-13]
[670,9.4813646734850625E-13,2.2126801894232688E-12,null,670,1.1936269072159464E-13,2.7859545678026437E-13]
[680,9.3880016622721212E-13,2.1908143685412802E-12,null,680,1.1820638723594692E-13,2.7578960728745211E-13]
[690,9.2815299722058868E-13,2.1653995479259809E-12,null,690,1.1685808289730459E-13,2.7263778955698586E-13]
[700,9.1603061470025341E-13,2.137425122119107E-12,null,700,1.1533434949491108E-13,2.6907509568735887E-13]
[710,9.0683685529972932E-13,2.1162625470912678E-12,null,710,1.1417212017531973E-13,2.6639924670032688E-13]
[720,8.9551292164675274E-13,2.0894887392068031E-12,null,720,1.1273720389850177E-13,2.630681469798768E-13]
[730,8.8617248080868659E-13,2.0678792215010375E-12,null,730,1.1156724080376218E-13,2.6035652718184656E-13]
[740,8.7647661904551642E-13,2.0452951416236393E-12,null,740,1.1035952916903807E-13,2.5750114273014014E-13]
[750,8.6750165224196726E-13,2.0240656912575699E-12,null,750,1.0921823487307858E-13,2.5480860989131636E-13]
[760,8.5779834060338646E-13,2.0013250164131413E-12,null,760,1.0799031657566738E-13,2.5199271790475785E-13]
[770,8.48915845962268E-13,1.9804172757832482E-12,null,770,1.0687438947388061E-13,2.4934815170489466E-13]
[780,8.39801040015669E-13,1.9593614448981643E-12,null,780,1.0572620411837732E-13,2.4668730629426047E-13]
[790,8.3079288394250054E-13,1.938500919515236E-12,null,790,1.0459007227897199E-13,2.4404491156323446E-13]
[800,8.2211154031621596E-13,1.9183448832790582E-12,null,800,1.0351197148897208E-13,2.4152422100904119E-13]
[810,8.147140663596523E-13,1.9010472962490759E-12,null,810,1.0257182758105041E-13,2.3930262195538889E-13]
[820,8.0607598102144262E-13,1.8808706470878757E-12,null,820,1.0147810899309094E-13,2.3678248242655597E-13]
[830,7.9763138300524171E-13,1.8612478775908072E-12,null,830,1.004174503265278E-13,2.3427471707309312E-13]
[840,7.9023665495691684E-13,1.8438014482366124E-12,null,840,9.9487386572325558E-14,2.321279921998085E-13]
[850,7.8209434674424885E-13,1.8247567133195867E-12,null,850,9.8462007224940294E-14,2.2971150781719202E-13]
[860,7.745534600918194E-13,1.8069948724407793E-12,null,860,9.7511620512127557E-14,2.2751960720135186E-13]
[870,7.6683974526751993E-13,1.7890861604779404E-12,null,870,9.6541197325230454E-14,2.2522879701024426E-13]
[880,7.5979132512616119E-13,1.7728769632539904E-12,null,880,9.565018401937915E-14,2.2318864964254186E-13]
[890,7.5237180176749118E-13,1.7556237835073722E-12,null,890,9.4720319024935034E-14,2.2103131235625752E-13]
[900,7.4538301744541008E-13,1.7396659521219647E-12,null,900,9.3853374102497212E-14,2.1900552229289366E-13]
[910,7.388130136598007E-13,1.7239076279099922E-12,null,910,9.3014834801798313E-14,2.1704006547897282E-13]
[920,7.3194735899323355E-13,1.7079399075953598E-12,null,920,9.214857547822875E-14,2.1500924744741977E-13]
[930,7.2469059683882353E-13,1.6910335528300433E-12,null,930,9.1228482566895353E-14,2.1290994879517438E-13]
[940,7.185361415413609E-13,1.6766847206513003E-12,null,940,9.0455735524648636E-14,2.1107064251388154E-13]
[950,7.1149862615186643E-13,1.6600438156562747E-12,null,950,8.9584218924921734E-14,2.089887279071151E-13]
[960,7.0544685658082841E-13,1.6462169407267505E-12,null,960,8.8819412444728778E-14,2.0724281923359548E-13]
[970,6.9939958850006105E-13,1.631978534543972E-12,null,970,8.8058796517853656E-14,2.054697062942777E-13]
[980,6.9355142006809809E-13,1.6181662880926756E-12,null,980,8.7317748522659012E-14,2.0373504405512384E-13]
[990,6.8614751518647012E-13,1.601248598069476E-12,null,990,8.6396615313089351E-14,2.0159914427676403E-13]
[1000,6.8135602701629067E-13,1.5899287175505701E-12,null,1000,8.5776408869155199E-14,2.0015114126798385E-13]
[]
[]
["Saved  13/07/2022: 14:29:12  Level Number: 5"]
[]
["BREAKTHROUGH RESULTS"]
[]
["Advanced"]
["Pollutant Linkage: Stabilised Wast, Unsat MG, Sat MG, Alluvium, Chalk, Chalk haz",null,null,null,"Pollutant Linkage: Stabilised Wast, Unsat MG, Sat MG, Alluvium, Chalk, Chalk nonhaz"]
["Concentrations in mg/L in Chalk haz",null,null,null,"Concentrations in mg/L in Chalk nonhaz"]
[]
["Compared with EAL target concentration in mg/L",null,null,null,"No target concentrations specified for comparison"]
[null,5.0000000000000001E-3,1E-3]
[]
["Time(years)","Species1","Species2",null,"Time(years)","Species1","Species2"]
[null,"As","Cr",null,null,"As","Cr"]
[10,0,0,null,10,0,0]
[20,0,0,null,20,0,0]
[30,0,0,null,30,0,0]
[40,0,0,null,40,0,0]
[50,0,0,null,50,0,0]
[60,0,0,null,60,0,0]
[70,0,0,null,70,0,0]
[80,0,0,null,80,0,0]
[90,0,0,null,90,0,0]
[100,0,0,null,100,0,0]
[110,0,0,null,110,0,0]
[120,4.5371171561820148E-13,1.057910565212614E-12,null,120,5.7096285695532435E-14,1.3336949336586715E-13]
[130,8.1227109651386716E-13,1.8949864230582975E-12,null,130,1.0228086412939419E-13,2.3865288916830914E-13]
[140,1.0646065757775107E-12,2.4824034069627063E-12,null,140,1.3403338430616722E-13,3.1254669934187652E-13]
[150,1.2504832689826938E-12,2.9193059637991959E-12,null,150,1.5744473197886357E-13,3.6745091362191842E-13]
[160,1.3832267200328534E-12,3.2264637177586066E-12,null,160,1.741968698478926E-13,4.0618127281778109E-13]
[170,1.4832518467641599E-12,3.4604970956604562E-12,null,170,1.8674806357450618E-13,4.3568537154740981E-13]
[180,1.5503300323895691E-12,3.6167395216449376E-12,null,180,1.9514219870636984E-13,4.5538686758839896E-13]
[190,1.5981865114300066E-12,3.7298259583628551E-12,null,190,2.0121677169795748E-13,4.6957618475573474E-13]
[200,1.6292411349563456E-12,3.8009233644438529E-12,null,200,2.0508158781717909E-13,4.7862459951076029E-13]
[210,1.6488821041368966E-12,3.8475227209391302E-12,null,210,2.076102825215119E-13,4.8429802147073237E-13]
[220,1.6593885618470237E-12,3.8723123292843769E-12,null,220,2.0894484938593344E-13,4.8746518154680626E-13]
[230,1.6601451949393543E-12,3.8740924181023225E-12,null,230,2.089812986584579E-13,4.8763564201099417E-13]
[240,1.6564628190076062E-12,3.8659807012311219E-12,null,240,2.0854907603232007E-13,4.866774461505214E-13]
[250,1.6474733388843564E-12,3.8445217650007201E-12,null,250,2.0743249009458071E-13,4.8393202317149362E-13]
[260,1.6371489727154319E-12,3.8205867845915644E-12,null,260,2.0613347846716499E-13,4.8091353392200667E-13]
[270,1.6208892668190912E-12,3.7817829483706761E-12,null,270,2.0406707722815935E-13,4.76174106857814E-13]
[280,1.6055779149836588E-12,3.7461325680215693E-12,null,280,2.0213148844993433E-13,4.7163596982079943E-13]
[290,1.5875967153424989E-12,3.7043834266654058E-12,null,290,1.9987544363654337E-13,4.6639414110979626E-13]
[300,1.5697807603176773E-12,3.6629029449398928E-12,null,300,1.9764246336813217E-13,4.6117181505667025E-13]
[310,1.5487462915462769E-12,3.6137338116401522E-12,null,310,1.9499578350009201E-13,4.5492295956812884E-13]
[320,1.5267478522111734E-12,3.5618856485518469E-12,null,320,1.9221251451497666E-13,4.4844929495533202E-13]
[330,1.5061107622059926E-12,3.51394213061421E-12,null,330,1.8961462074750411E-13,4.4243907256614954E-13]
[340,1.4861912586359359E-12,3.4675504026870081E-12,null,340,1.8710774003236735E-13,4.3655368184611697E-13]
[350,1.4640628858217632E-12,3.4157370793778377E-12,null,350,1.8432379805013139E-13,4.3006864769304606E-13]
[360,1.4427653336085155E-12,3.366109250656567E-12,null,360,1.8161645577633488E-13,4.2383361317763105E-13]
[370,1.421913344316043E-12,3.3183376559666444E-12,null,370,1.7903031090738091E-13,4.1774283540039085E-13]
[380,1.4003892602460716E-12,3.2677954165501776E-12,null,380,1.7628823938761471E-13,4.1135939283789189E-13]
[390,1.3815261786112043E-12,3.2237318078042381E-12,null,390,1.7394397448813659E-13,4.0585553902692103E-13]
[400,1.3599406448380036E-12,3.1735638287296421E-12,null,400,1.7121458899356063E-13,3.9957392444111861E-13]
[410,1.3411459985359553E-12,3.1294810048769142E-12,null,410,1.6883535637208627E-13,3.9401031973367717E-13]
[420,1.3221108140782551E-12,3.0846555112594849E-12,null,420,1.6643533816100021E-13,3.8834163861805387E-13]
[430,1.3025141987833056E-12,3.0386899062754011E-12,null,430,1.6399503093670109E-13,3.8253285872195618E-13]
[440,1.2835487741713119E-12,2.995048344347585E-12,null,440,1.6160646723450118E-13,3.7710263516577778E-13]
[450,1.2652841002233581E-12,2.9518340978197521E-12,null,450,1.592975496223359E-13,3.7163676985797074E-13]
[460,1.2483534273996259E-12,2.9131171944276756E-12,null,460,1.5716005189353669E-13,3.667162013573367E-13]
[470,1.2301856198986218E-12,2.8702953796385871E-12,null,470,1.5485368147046499E-13,3.6133892305485984E-13]
[480,1.2116748087239235E-12,2.8276723158452577E-12,null,480,1.525500823614241E-13,3.5594112807455374E-13]
[490,1.1967427281493353E-12,2.7925323089709641E-12,null,490,1.5066726030987533E-13,3.5158150561613344E-13]
[500,1.1796496782289461E-12,2.7521100482124967E-12,null,500,1.4852381114324109E-13,3.4650504417239109E-13]
[510,1.163808636092671E-12,2.7156429131430287E-12,null,510,1.4651051951214093E-13,3.4183178748309681E-13]
[520,1.1481082317008619E-12,2.6788557073934067E-12,null,520,1.4456114614559954E-13,3.3727341961703911E-13]
[530,1.1332336696603843E-12,2.643473023498712E-12,null,530,1.4266237711351485E-13,3.3277643298314683E-13]
[540,1.1163740746750565E-12,2.6050009920373814E-12,null,540,1.4053871194076473E-13,3.2790730635377338E-13]
[550,1.1028684615190794E-12,2.5736340142728529E-12,null,550,1.3885601953602573E-13,3.2401085670213856E-13]
[560,1.088100819695567E-12,2.5389709908242509E-12,null,560,1.3699778245429907E-13,3.1961551307028438E-13]
[570,1.0727263075971154E-12,2.5029839081821137E-12,null,570,1.3506302086983372E-13,3.1509755995855224E-13]
[580,1.0596364367756124E-12,2.4723305237806931E-12,null,580,1.3341547296658749E-13,3.112639101049811E-13]
[590,1.0467330713517628E-12,2.4424529972591044E-12,null,590,1.3179650865810828E-13,3.0750251927297539E-13]
[600,1.0335457153739699E-12,2.4117512847975674E-12,null,600,1.3012238891873756E-13,3.0364327431248319E-13]
[610,1.0198515253568275E-12,2.3799984634885175E-12,null,610,1.2839885535927942E-13,2.9961614604908428E-13]
[620,1.0077935404844597E-12,2.3517267253884686E-12,null,620,1.2688902290960556E-13,2.9605208690940771E-13]
[630,9.9582872801074606E-13,2.3236978548399782E-12,null,630,1.2536766371435045E-13,2.9252226619883206E-13]
[640,9.828109892737621E-13,2.2928360972388004E-12,null,640,1.2372637429935371E-13,2.8866971298282357E-13]
[650,9.7264262906819813E-13,2.2693890950710595E-12,null,650,1.22437166064822E-13,2.8572100501148625E-13]
[660,9.6031366183831475E-13,2.2411058895000128E-12,null,660,1.2090837885983492E-13,2.8212807090390806E-13]
[670,9.4813646734850625E-13,2.2126801894232688E-12,null,670,1.1936269072159464E-13,2.7859545678026437E-13]
[680,9.3880016622721212E-13,2.1908143685412802E-12,null,680,1.1820638723594692E-13,2.7578960728745211E-13]
[690,9.2815299722058868E-13,2.1653995479259809E-12,null,690,1.1685808289730459E-13,2.7263778955698586E-13]
[700,9.1603061470025341E-13,2.137425122119107E-12,null,700,1.1533434949491108E-13,2.6907509568735887E-13]
[710,9.0683685529972932E-13,2.1162625470912678E-12,null,710,1.1417212017531973E-13,2.6639924670032688E-13]
[720,8.9551292164675274E-13,2.0894887392068031E-12,null,720,1.1273720389850177E-13,2.630681469798768E-13]
[730,8.8617248080868659E-13,2.0678792215010375E-12,null,730,1.1156724080376218E-13,2.6035652718184656E-13]
[740,8.7647661904551642E-13,2.0452951416236393E-12,null,740,1.1035952916903807E-13,2.5750114273014014E-13]
[750,8.6750165224196726E-13,2.0240656912575699E-12,null,750,1.0921823487307858E-13,2.5480860989131636E-13]
[760,8.5779834060338646E-13,2.0013250164131413E-12,null,760,1.0799031657566738E-13,2.5199271790475785E-13]
[770,8.48915845962268E-13,1.9804172757832482E-12,null,770,1.0687438947388061E-13,2.4934815170489466E-13]
[780,8.39801040015669E-13,1.9593614448981643E-12,null,780,1.0572620411837732E-13,2.4668730629426047E-13]
[790,8.3079288394250054E-13,1.938500919515236E-12,null,790,1.0459007227897199E-13,2.4404491156323446E-13]
[800,8.2211154031621596E-13,1.9183448832790582E-12,null,800,1.0351197148897208E-13,2.4152422100904119E-13]
[810,8.147140663596523E-13,1.9010472962490759E-12,null,810,1.0257182758105041E-13,2.3930262195538889E-13]
[820,8.0607598102144262E-13,1.8808706470878757E-12,null,820,1.0147810899309094E-13,2.3678248242655597E-13]
[830,7.9763138300524171E-13,1.8612478775908072E-12,null,830,1.004174503265278E-13,2.3427471707309312E-13]
[840,7.9023665495691684E-13,1.8438014482366124E-12,null,840,9.9487386572325558E-14,2.321279921998085E-13]
[850,7.8209434674424885E-13,1.8247567133195867E-12,null,850,9.8462007224940294E-14,2.2971150781719202E-13]
[860,7.745534600918194E-13,1.8069948724407793E-12,null,860,9.7511620512127557E-14,2.2751960720135186E-13]
[870,7.6683974526751993E-13,1.7890861604779404E-12,null,870,9.6541197325230454E-14,2.2522879701024426E-13]
[880,7.5979132512616119E-13,1.7728769632539904E-12,null,880,9.565018401937915E-14,2.2318864964254186E-13]
[890,7.5237180176749118E-13,1.7556237835073722E-12,null,890,9.4720319024935034E-14,2.2103131235625752E-13]
[900,7.4538301744541008E-13,1.7396659521219647E-12,null,900,9.3853374102497212E-14,2.1900552229289366E-13]
[910,7.388130136598007E-13,1.7239076279099922E-12,null,910,9.3014834801798313E-14,2.1704006547897282E-13]
[920,7.3194735899323355E-13,1.7079399075953598E-12,null,920,9.214857547822875E-14,2.1500924744741977E-13]
[930,7.2469059683882353E-13,1.6910335528300433E-12,null,930,9.1228482566895353E-14,2.1290994879517438E-13]
[940,7.185361415413609E-13,1.6766847206513003E-12,null,940,9.0455735524648636E-14,2.1107064251388154E-13]
[950,7.1149862615186643E-13,1.6600438156562747E-12,null,950,8.9584218924921734E-14,2.089887279071151E-13]
[960,7.0544685658082841E-13,1.6462169407267505E-12,null,960,8.8819412444728778E-14,2.0724281923359548E-13]
[970,6.9939958850006105E-13,1.631978534543972E-12,null,970,8.8058796517853656E-14,2.054697062942777E-13]
[980,6.9355142006809809E-13,1.6181662880926756E-12,null,980,8.7317748522659012E-14,2.0373504405512384E-13]
[990,6.8614751518647012E-13,1.601248598069476E-12,null,990,8.6396615313089351E-14,2.0159914427676403E-13]
[1000,6.8135602701629067E-13,1.5899287175505701E-12,null,1000,8.5776408869155199E-14,2.0015114126798385E-13]
[]
[]
["Saved  13/07/2022: 14:38:38  Level Number: 5"]
[]
["BREAKTHROUGH RESULTS"]
[]
["Advanced"]
["Pollutant Linkage: Stabilised Wast, Unsat MG, Sat MG, Alluvium, Chalk, Chalk haz",null,null,null,"Pollutant Linkage: Stabilised Wast, Unsat MG, Sat MG, Alluvium, Chalk, Chalk nonhaz"]
["Concentrations in mg/L in Chalk haz",null,null,null,"Concentrations in mg/L in Chalk nonhaz"]
[]
["Compared with EAL target concentration in mg/L",null,null,null,"No target concentrations specified for comparison"]
[null,5.0000000000000001E-3,1E-3]
[]
["Time(years)","Species1","Species2",null,"Time(years)","Species1","Species2"]
[null,"As","Cr",null,null,"As","Cr"]
[10,0,0,null,10,0,0]
[20,0,0,null,20,0,0]
[30,0,0,null,30,0,0]
[40,0,0,null,40,0,0]
[50,0,0,null,50,0,0]
[60,0,0,null,60,0,0]
[70,0,0,null,70,0,0]
[80,0,0,null,80,0,0]
[90,0,0,null,90,0,0]
[100,0,0,null,100,0,0]
[110,0,0,null,110,0,0]
[120,4.5371171561820148E-13,1.057910565212614E-12,null,120,5.7096285695532435E-14,1.3336949336586715E-13]
[130,8.1227109651386716E-13,1.8949864230582975E-12,null,130,1.0228086412939419E-13,2.3865288916830914E-13]
[140,1.0646065757775107E-12,2.4824034069627063E-12,null,140,1.3403338430616722E-13,3.1254669934187652E-13]
[150,1.2504832689826938E-12,2.9193059637991959E-12,null,150,1.5744473197886357E-13,3.6745091362191842E-13]
[160,1.3832267200328534E-12,3.2264637177586066E-12,null,160,1.741968698478926E-13,4.0618127281778109E-13]
[170,1.4832518467641599E-12,3.4604970956604562E-12,null,170,1.8674806357450618E-13,4.3568537154740981E-13]
[180,1.5503300323895691E-12,3.6167395216449376E-12,null,180,1.9514219870636984E-13,4.5538686758839896E-13]
[190,1.5981865114300066E-12,3.7298259583628551E-12,null,190,2.0121677169795748E-13,4.6957618475573474E-13]
[200,1.6292411349563456E-12,3.8009233644438529E-12,null,200,2.0508158781717909E-13,4.7862459951076029E-13]
[210,1.6488821041368966E-12,3.8475227209391302E-12,null,210,2.076102825215119E-13,4.8429802147073237E-13]
[220,1.6593885618470237E-12,3.8723123292843769E-12,null,220,2.0894484938593344E-13,4.8746518154680626E-13]
[230,1.6601451949393543E-12,3.8740924181023225E-12,null,230,2.089812986584579E-13,4.8763564201099417E-13]
[240,1.6564628190076062E-12,3.8659807012311219E-12,null,240,2.0854907603232007E-13,4.866774461505214E-13]
[250,1.6474733388843564E-12,3.8445217650007201E-12,null,250,2.0743249009458071E-13,4.8393202317149362E-13]
[260,1.6371489727154319E-12,3.8205867845915644E-12,null,260,2.0613347846716499E-13,4.8091353392200667E-13]
[270,1.6208892668190912E-12,3.7817829483706761E-12,null,270,2.0406707722815935E-13,4.76174106857814E-13]
[280,1.6055779149836588E-12,3.7461325680215693E-12,null,280,2.0213148844993433E-13,4.7163596982079943E-13]
[290,1.5875967153424989E-12,3.7043834266654058E-12,null,290,1.9987544363654337E-13,4.6639414110979626E-13]
[300,1.5697807603176773E-12,3.6629029449398928E-12,null,300,1.9764246336813217E-13,4.6117181505667025E-13]
[310,1.5487462915462769E-12,3.6137338116401522E-12,null,310,1.9499578350009201E-13,4.5492295956812884E-13]
[320,1.5267478522111734E-12,3.5618856485518469E-12,null,320,1.9221251451497666E-13,4.4844929495533202E-13]
[330,1.5061107622059926E-12,3.51394213061421E-12,null,330,1.8961462074750411E-13,4.4243907256614954E-13]
[340,1.4861912586359359E-12,3.4675504026870081E-12,null,340,1.8710774003236735E-13,4.3655368184611697E-13]
[350,1.4640628858217632E-12,3.4157370793778377E-12,null,350,1.8432379805013139E-13,4.3006864769304606E-13]
[360,1.4427653336085155E-12,3.366109250656567E-12,null,360,1.8161645577633488E-13,4.2383361317763105E-13]
[370,1.421913344316043E-12,3.3183376559666444E-12,null,370,1.7903031090738091E-13,4.1774283540039085E-13]
[380,1.4003892602460716E-12,3.2677954165501776E-12,null,380,1.7628823938761471E-13,4.1135939283789189E-13]
[390,1.3815261786112043E-12,3.2237318078042381E-12,null,390,1.7394397448813659E-13,4.0585553902692103E-13]
[400,1.3599406448380036E-12,3.1735638287296421E-12,null,400,1.7121458899356063E-13,3.9957392444111861E-13]
[410,1.3411459985359553E-12,3.1294810048769142E-12,null,410,1.6883535637208627E-13,3.9401031973367717E-13]
[420,1.3221108140782551E-12,3.0846555112594849E-12,null,420,1.6643533816100021E-13,3.8834163861805387E-13]
[430,1.3025141987833056E-12,3.0386899062754011E-12,null,430,1.6399503093670109E-13,3.8253285872195618E-13]
[440,1.2835487741713119E-12,2.995048344347585E-12,null,440,1.6160646723450118E-13,3.7710263516577778E-13]
[450,1.2652841002233581E-12,2.9518340978197521E-12,null,450,1.592975496223359E-13,3.7163676985797074E-13]
[460,1.2483534273996259E-12,2.9131171944276756E-12,null,460,1.5716005189353669E-13,3.667162013573367E-13]
[470,1.2301856198986218E-12,2.8702953796385871E-12,null,470,1.5485368147046499E-13,3.6133892305485984E-13]
[480,1.2116748087239235E-12,2.8276723158452577E-12,null,480,1.525500823614241E-13,3.5594112807455374E-13]
[490,1.1967427281493353E-12,2.7925323089709641E-12,null,490,1.5066726030987533E-13,3.5158150561613344E-13]
[500,1.1796496782289461E-12,2.7521100482124967E-12,null,500,1.4852381114324109E-13,3.4650504417239109E-13]
[510,1.163808636092671E-12,2.7156429131430287E-12,null,510,1.4651051951214093E-13,3.4183178748309681E-13]
[520,1.1481082317008619E-12,2.6788557073934067E-12,null,520,1.4456114614559954E-13,3.3727341961703911E-13]
[530,1.1332336696603843E-12,2.643473023498712E-12,null,530,1.4266237711351485E-13,3.3277643298314683E-13]
[540,1.1163740746750565E-12,2.6050009920373814E-12,null,540,1.4053871194076473E-13,3.2790730635377338E-13]
[550,1.1028684615190794E-12,2.5736340142728529E-12,null,550,1.3885601953602573E-13,3.2401085670213856E-13]
[560,1.088100819695567E-12,2.5389709908242509E-12,null,560,1.3699778245429907E-13,3.1961551307028438E-13]
[570,1.0727263075971154E-12,2.5029839081821137E-12,null,570,1.3506302086983372E-13,3.1509755995855224E-13]
[580,1.0596364367756124E-12,2.4723305237806931E-12,null,580,1.3341547296658749E-13,3.112639101049811E-13]
[590,1.0467330713517628E-12,2.4424529972591044E-12,null,590,1.3179650865810828E-13,3.0750251927297539E-13]
[600,1.0335457153739699E-12,2.4117512847975674E-12,null,600,1.3012238891873756E-13,3.0364327431248319E-13]
[610,1.0198515253568275E-12,2.3799984634885175E-12,null,610,1.2839885535927942E-13,2.9961614604908428E-13]
[620,1.0077935404844597E-12,2.3517267253884686E-12,null,620,1.2688902290960556E-13,2.9605208690940771E-13]
[630,9.9582872801074606E-13,2.3236978548399782E-12,null,630,1.2536766371435045E-13,2.9252226619883206E-13]
[640,9.828109892737621E-13,2.2928360972388004E-12,null,640,1.2372637429935371E-13,2.8866971298282357E-13]
[650,9.7264262906819813E-13,2.2693890950710595E-12,null,650,1.22437166064822E-13,2.8572100501148625E-13]
[660,9.6031366183831475E-13,2.2411058895000128E-12,null,660,1.2090837885983492E-13,2.8212807090390806E-13]
[670,9.4813646734850625E-13,2.2126801894232688E-12,null,670,1.1936269072159464E-13,2.7859545678026437E-13]
[680,9.3880016622721212E-13,2.1908143685412802E-12,null,680,1.1820638723594692E-13,2.7578960728745211E-13]
[690,9.2815299722058868E-13,2.1653995479259809E-12,null,690,1.1685808289730459E-13,2.7263778955698586E-13]
[700,9.1603061470025341E-13,2.137425122119107E-12,null,700,1.1533434949491108E-13,2.6907509568735887E-13]
[710,9.0683685529972932E-13,2.1162625470912678E-12,null,710,1.1417212017531973E-13,2.6639924670032688E-13]
[720,8.9551292164675274E-13,2.0894887392068031E-12,null,720,1.1273720389850177E-13,2.630681469798768E-13]
[730,8.8617248080868659E-13,2.0678792215010375E-12,null,730,1.1156724080376218E-13,2.6035652718184656E-13]
[740,8.7647661904551642E-13,2.0452951416236393E-12,null,740,1.1035952916903807E-13,2.5750114273014014E-13]
[750,8.6750165224196726E-13,2.0240656912575699E-12,null,750,1.0921823487307858E-13,2.5480860989131636E-13]
[760,8.5779834060338646E-13,2.0013250164131413E-12,null,760,1.0799031657566738E-13,2.5199271790475785E-13]
[770,8.48915845962268E-13,1.9804172757832482E-12,null,770,1.0687438947388061E-13,2.4934815170489466E-13]
[780,8.39801040015669E-13,1.9593614448981643E-12,null,780,1.0572620411837732E-13,2.4668730629426047E-13]
[790,8.3079288394250054E-13,1.938500919515236E-12,null,790,1.0459007227897199E-13,2.4404491156323446E-13]
[800,8.2211154031621596E-13,1.9183448832790582E-12,null,800,1.0351197148897208E-13,2.4152422100904119E-13]
[810,8.147140663596523E-13,1.9010472962490759E-12,null,810,1.0257182758105041E-13,2.3930262195538889E-13]
[820,8.0607598102144262E-13,1.8808706470878757E-12,null,820,1.0147810899309094E-13,2.3678248242655597E-13]
[830,7.9763138300524171E-13,1.8612478775908072E-12,null,830,1.004174503265278E-13,2.3427471707309312E-13]
[840,7.9023665495691684E-13,1.8438014482366124E-12,null,840,9.9487386572325558E-14,2.321279921998085E-13]
[850,7.8209434674424885E-13,1.8247567133195867E-12,null,850,9.8462007224940294E-14,2.2971150781719202E-13]
[860,7.745534600918194E-13,1.8069948724407793E-12,null,860,9.7511620512127557E-14,2.2751960720135186E-13]
[870,7.6683974526751993E-13,1.7890861604779404E-12,null,870,9.6541197325230454E-14,2.2522879701024426E-13]
[880,7.5979132512616119E-13,1.7728769632539904E-12,null,880,9.565018401937915E-14,2.2318864964254186E-13]
[890,7.5237180176749118E-13,1.7556237835073722E-12,null,890,9.4720319024935034E-14,2.2103131235625752E-13]
[900,7.4538301744541008E-13,1.7396659521219647E-12,null,900,9.3853374102497212E-14,2.1900552229289366E-13]
[910,7.388130136598007E-13,1.7239076279099922E-12,null,910,9.3014834801798313E-14,2.1704006547897282E-13]
[920,7.3194735899323355E-13,1.7079399075953598E-12,null,920,9.214857547822875E-14,2.1500924744741977E-13]
[930,7.2469059683882353E-13,1.6910335528300433E-12,null,930,9.1228482566895353E-14,2.1290994879517438E-13]
[940,7.185361415413609E-13,1.6766847206513003E-12,null,940,9.0455735524648636E-14,2.1107064251388154E-13]
[950,7.1149862615186643E-13,1.6600438156562747E-12,null,950,8.9584218924921734E-14,2.089887279071151E-13]
[960,7.0544685658082841E-13,1.6462169407267505E-12,null,960,8.8819412444728778E-14,2.0724281923359548E-13]
[970,6.9939958850006105E-13,1.631978534543972E-12,null,970,8.8058796517853656E-14,2.054697062942777E-13]
[980,6.9355142006809809E-13,1.6181662880926756E-12,null,980,8.7317748522659012E-14,2.0373504405512384E-13]
[990,6.8614751518647012E-13,1.601248598069476E-12,null,990,8.6396615313089351E-14,2.0159914427676403E-13]
[1000,6.8135602701629067E-13,1.5899287175505701E-12,null,1000,8.5776408869155199E-14,2.0015114126798385E-13]
[]
[]
["Saved  13/07/2022: 14:50:32  Level Number: 5"]
[]
["BREAKTHROUGH RESULTS"]
[]
["Advanced"]
["Pollutant Linkage: Stabilised Wast, Unsat MG, Sat MG, Alluvium, Chalk, Chalk haz",null,null,null,"Pollutant Linkage: Stabilised Wast, Unsat MG, Sat MG, Alluvium, Chalk, Chalk nonhaz"]
["Concentrations in mg/L in Chalk haz",null,null,null,"Concentrations in mg/L in Chalk nonhaz"]
[]
["Compared with EAL target concentration in mg/L",null,null,null,"No target concentrations specified for comparison"]
[null,5.0000000000000001E-3,1E-3]
[]
["Time(years)","Species1","Species2",null,"Time(years)","Species1","Species2"]
[null,"As","Cr",null,null,"As","Cr"]
[10,0,0,null,10,0,0]
[20,0,0,null,20,0,0]
[30,0,0,null,30,0,0]
[40,0,0,null,40,0,0]
[50,0,0,null,50,0,0]
[60,0,0,null,60,0,0]
[70,0,0,null,70,0,0]
[80,0,0,null,80,0,0]
[90,0,0,null,90,0,0]
[100,0,0,null,100,0,0]
[110,0,0,null,110,0,0]
[120,4.5371171561820148E-13,1.057910565212614E-12,null,120,5.7096285695532435E-14,1.3336949336586715E-13]
[130,8.1227109651386716E-13,1.8949864230582975E-12,null,130,1.0228086412939419E-13,2.3865288916830914E-13]
[140,1.0646065757775107E-12,2.4824034069627063E-12,null,140,1.3403338430616722E-13,3.1254669934187652E-13]
[150,1.2504832689826938E-12,2.9193059637991959E-12,null,150,1.5744473197886357E-13,3.6745091362191842E-13]
[160,1.3832267200328534E-12,3.2264637177586066E-12,null,160,1.741968698478926E-13,4.0618127281778109E-13]
[170,1.4832518467641599E-12,3.4604970956604562E-12,null,170,1.8674806357450618E-13,4.3568537154740981E-13]
[180,1.5503300323895691E-12,3.6167395216449376E-12,null,180,1.9514219870636984E-13,4.5538686758839896E-13]
[190,1.5981865114300066E-12,3.7298259583628551E-12,null,190,2.0121677169795748E-13,4.6957618475573474E-13]
[200,1.6292411349563456E-12,3.8009233644438529E-12,null,200,2.0508158781717909E-13,4.7862459951076029E-13]
[210,1.6488821041368966E-12,3.8475227209391302E-12,null,210,2.076102825215119E-13,4.8429802147073237E-13]
[220,1.6593885618470237E-12,3.8723123292843769E-12,null,220,2.0894484938593344E-13,4.8746518154680626E-13]
[230,1.6601451949393543E-12,3.8740924181023225E-12,null,230,2.089812986584579E-13,4.8763564201099417E-13]
[240,1.6564628190076062E-12,3.8659807012311219E-12,null,240,2.0854907603232007E-13,4.866774461505214E-13]
[250,1.6474733388843564E-12,3.8445217650007201E-12,null,250,2.0743249009458071E-13,4.8393202317149362E-13]
[260,1.6371489727154319E-12,3.8205867845915644E-12,null,260,2.0613347846716499E-13,4.8091353392200667E-13]
[270,1.6208892668190912E-12,3.7817829483706761E-12,null,270,2.0406707722815935E-13,4.76174106857814E-13]
[280,1.6055779149836588E-12,3.7461325680215693E-12,null,280,2.0213148844993433E-13,4.7163596982079943E-13]
[290,1.5875967153424989E-12,3.7043834266654058E-12,null,290,1.9987544363654337E-13,4.6639414110979626E-13]
[300,1.5697807603176773E-12,3.6629029449398928E-12,null,300,1.9764246336813217E-13,4.6117181505667025E-13]
[310,1.5487462915462769E-12,3.6137338116401522E-12,null,310,1.9499578350009201E-13,4.5492295956812884E-13]
[320,1.5267478522111734E-12,3.5618856485518469E-12,null,320,1.9221251451497666E-13,4.4844929495533202E-13]
[330,1.5061107622059926E-12,3.51394213061421E-12,null,330,1.8961462074750411E-13,4.4243907256614954E-13]
[340,1.4861912586359359E-12,3.4675504026870081E-12,null,340,1.8710774003236735E-13,4.3655368184611697E-13]
[350,1.4640628858217632E-12,3.4157370793778377E-12,null,350,1.8432379805013139E-13,4.3006864769304606E-13]
[360,1.4427653336085155E-12,3.366109250656567E-12,null,360,1.8161645577633488E-13,4.2383361317763105E-13]
[370,1.421913344316043E-12,3.3183376559666444E-12,null,370,1.7903031090738091E-13,4.1774283540039085E-13]
[380,1.4003892602460716E-12,3.2677954165501776E-12,null,380,1.7628823938761471E-13,4.1135939283789189E-13]
[390,1.3815261786112043E-12,3.2237318078042381E-12,null,390,1.7394397448813659E-13,4.0585553902692103E-13]
[400,1.3599406448380036E-12,3.1735638287296421E-12,null,400,1.7121458899356063E-13,3.9957392444111861E-13]
[410,1.3411459985359553E-12,3.1294810048769142E-12,null,410,1.6883535637208627E-13,3.9401031973367717E-13]
[420,1.3221108140782551E-12,3.0846555112594849E-12,null,420,1.6643533816100021E-13,3.8834163861805387E-13]
[430,1.3025141987833056E-12,3.0386899062754011E-12,null,430,1.6399503093670109E-13,3.8253285872195618E-13]
[440,1.2835487741713119E-12,2.995048344347585E-12,null,440,1.6160646723450118E-13,3.7710263516577778E-13]
[450,1.2652841002233581E-12,2.9518340978197521E-12,null,450,1.592975496223359E-13,3.7163676985797074E-13]
[460,1.2483534273996259E-12,2.9131171944276756E-12,null,460,1.5716005189353669E-13,3.667162013573367E-13]
[470,1.2301856198986218E-12,2.8702953796385871E-12,null,470,1.5485368147046499E-13,3.6133892305485984E-13]
[480,1.2116748087239235E-12,2.8276723158452577E-12,null,480,1.525500823614241E-13,3.5594112807455374E-13]
[490,1.1967427281493353E-12,2.7925323089709641E-12,null,490,1.5066726030987533E-13,3.5158150561613344E-13]
[500,1.1796496782289461E-12,2.7521100482124967E-12,null,500,1.4852381114324109E-13,3.4650504417239109E-13]
[510,1.163808636092671E-12,2.7156429131430287E-12,null,510,1.4651051951214093E-13,3.4183178748309681E-13]
[520,1.1481082317008619E-12,2.6788557073934067E-12,null,520,1.4456114614559954E-13,3.3727341961703911E-13]
[530,1.1332336696603843E-12,2.643473023498712E-12,null,530,1.4266237711351485E-13,3.3277643298314683E-13]
[540,1.1163740746750565E-12,2.6050009920373814E-12,null,540,1.4053871194076473E-13,3.2790730635377338E-13]
[550,1.1028684615190794E-12,2.5736340142728529E-12,null,550,1.3885601953602573E-13,3.2401085670213856E-13]
[560,1.088100819695567E-12,2.5389709908242509E-12,null,560,1.3699778245429907E-13,3.1961551307028438E-13]
[570,1.0727263075971154E-12,2.5029839081821137E-12,null,570,1.3506302086983372E-13,3.1509755995855224E-13]
[580,1.0596364367756124E-12,2.4723305237806931E-12,null,580,1.3341547296658749E-13,3.112639101049811E-13]
[590,1.0467330713517628E-12,2.4424529972591044E-12,null,590,1.3179650865810828E-13,3.0750251927297539E-13]
[600,1.0335457153739699E-12,2.4117512847975674E-12,null,600,1.3012238891873756E-13,3.0364327431248319E-13]
[610,1.0198515253568275E-12,2.3799984634885175E-12,null,610,1.2839885535927942E-13,2.9961614604908428E-13]
[620,1.0077935404844597E-12,2.3517267253884686E-12,null,620,1.2688902290960556E-13,2.9605208690940771E-13]
[630,9.9582872801074606E-13,2.3236978548399782E-12,null,630,1.2536766371435045E-13,2.9252226619883206E-13]
[640,9.828109892737621E-13,2.2928360972388004E-12,null,640,1.2372637429935371E-13,2.8866971298282357E-13]
[650,9.7264262906819813E-13,2.2693890950710595E-12,null,650,1.22437166064822E-13,2.8572100501148625E-13]
[660,9.6031366183831475E-13,2.2411058895000128E-12,null,660,1.2090837885983492E-13,2.8212807090390806E-13]
[670,9.4813646734850625E-13,2.2126801894232688E-12,null,670,1.1936269072159464E-13,2.7859545678026437E-13]
[680,9.3880016622721212E-13,2.1908143685412802E-12,null,680,1.1820638723594692E-13,2.7578960728745211E-13]
[690,9.2815299722058868E-13,2.1653995479259809E-12,null,690,1.1685808289730459E-13,2.7263778955698586E-13]
[700,9.1603061470025341E-13,2.137425122119107E-12,null,700,1.1533434949491108E-13,2.6907509568735887E-13]
[710,9.0683685529972932E-13,2.1162625470912678E-12,null,710,1.1417212017531973E-13,2.6639924670032688E-13]
[720,8.9551292164675274E-13,2.0894887392068031E-12,null,720,1.1273720389850177E-13,2.630681469798768E-13]
[730,8.8617248080868659E-13,2.0678792215010375E-12,null,730,1.1156724080376218E-13,2.6035652718184656E-13]
[740,8.7647661904551642E-13,2.0452951416236393E-12,null,740,1.1035952916903807E-13,2.5750114273014014E-13]
[750,8.6750165224196726E-13,2.0240656912575699E-12,null,750,1.0921823487307858E-13,2.5480860989131636E-13]
[760,8.5779834060338646E-13,2.0013250164131413E-12,null,760,1.0799031657566738E-13,2.5199271790475785E-13]
[770,8.48915845962268E-13,1.9804172757832482E-12,null,770,1.0687438947388061E-13,2.4934815170489466E-13]
[780,8.39801040015669E-13,1.9593614448981643E-12,null,780,1.0572620411837732E-13,2.4668730629426047E-13]
[790,8.3079288394250054E-13,1.938500919515236E-12,null,790,1.0459007227897199E-13,2.4404491156323446E-13]
[800,8.2211154031621596E-13,1.9183448832790582E-12,null,800,1.0351197148897208E-13,2.4152422100904119E-13]
[810,8.147140663596523E-13,1.9010472962490759E-12,null,810,1.0257182758105041E-13,2.3930262195538889E-13]
[820,8.0607598102144262E-13,1.8808706470878757E-12,null,820,1.0147810899309094E-13,2.3678248242655597E-13]
[830,7.9763138300524171E-13,1.8612478775908072E-12,null,830,1.004174503265278E-13,2.3427471707309312E-13]
[840,7.9023665495691684E-13,1.8438014482366124E-12,null,840,9.9487386572325558E-14,2.321279921998085E-13]
[850,7.8209434674424885E-13,1.8247567133195867E-12,null,850,9.8462007224940294E-14,2.2971150781719202E-13]
[860,7.745534600918194E-13,1.8069948724407793E-12,null,860,9.7511620512127557E-14,2.2751960720135186E-13]
[870,7.6683974526751993E-13,1.7890861604779404E-12,null,870,9.6541197325230454E-14,2.2522879701024426E-13]
[880,7.5979132512616119E-13,1.7728769632539904E-12,null,880,9.565018401937915E-14,2.2318864964254186E-13]
[890,7.5237180176749118E-13,1.7556237835073722E-12,null,890,9.4720319024935034E-14,2.2103131235625752E-13]
[900,7.4538301744541008E-13,1.7396659521219647E-12,null,900,9.3853374102497212E-14,2.1900552229289366E-13]
[910,7.388130136598007E-13,1.7239076279099922E-12,null,910,9.3014834801798313E-14,2.1704006547897282E-13]
[920,7.3194735899323355E-13,1.7079399075953598E-12,null,920,9.214857547822875E-14,2.1500924744741977E-13]
[930,7.2469059683882353E-13,1.6910335528300433E-12,null,930,9.1228482566895353E-14,2.1290994879517438E-13]
[940,7.185361415413609E-13,1.6766847206513003E-12,null,940,9.0455735524648636E-14,2.1107064251388154E-13]
[950,7.1149862615186643E-13,1.6600438156562747E-12,null,950,8.9584218924921734E-14,2.089887279071151E-13]
[960,7.0544685658082841E-13,1.6462169407267505E-12,null,960,8.8819412444728778E-14,2.0724281923359548E-13]
[970,6.9939958850006105E-13,1.631978534543972E-12,null,970,8.8058796517853656E-14,2.054697062942777E-13]
[980,6.9355142006809809E-13,1.6181662880926756E-12,null,980,8.7317748522659012E-14,2.0373504405512384E-13]
[990,6.8614751518647012E-13,1.601248598069476E-12,null,990,8.6396615313089351E-14,2.0159914427676403E-13]
[1000,6.8135602701629067E-13,1.5899287175505701E-12,null,1000,8.5776408869155199E-14,2.0015114126798385E-13]
[]
[]
["Saved  03/08/2022: 09:28:27  Level Number: 5"]
[]
["BREAKTHROUGH RESULTS"]
[]
["Advanced"]
["Pollutant Linkage: Stabilised Wast, Unsat MG, Sat MG, Alluvium, Chalk, Chalk haz",null,null,null,"Pollutant Linkage: Stabilised Wast, Unsat MG, Sat MG, Alluvium, Chalk, Chalk nonhaz"]
["Concentrations in mg/L in Chalk haz",null,null,null,"Concentrations in mg/L in Chalk nonhaz"]
[]
["Compared with EAL target concentration in mg/L",null,null,null,"No target concentrations specified for comparison"]
[null,5.0000000000000001E-3,1E-3]
[]
["Time(years)","Species1","Species2",null,"Time(years)","Species1","Species2"]
[null,"As","Cr",null,null,"As","Cr"]
[10,0,0,null,10,0,0]
[20,0,0,null,20,0,0]
[30,0,0,null,30,0,0]
[40,0,0,null,40,0,0]
[50,0,0,null,50,0,0]
[60,0,0,null,60,0,0]
[70,0,0,null,70,0,0]
[80,0,0,null,80,0,0]
[90,0,0,null,90,0,0]
[100,0,0,null,100,0,0]
[110,0,0,null,110,0,0]
[120,4.5371171561820148E-13,1.057910565212614E-12,null,120,5.7096285695532435E-14,1.3336949336586715E-13]
[130,8.1227109651386716E-13,1.8949864230582975E-12,null,130,1.0228086412939419E-13,2.3865288916830914E-13]
[140,1.0646065757775107E-12,2.4824034069627063E-12,null,140,1.3403338430616722E-13,3.1254669934187652E-13]
[150,1.2504832689826938E-12,2.9193059637991959E-12,null,150,1.5744473197886357E-13,3.6745091362191842E-13]
[160,1.3832267200328534E-12,3.2264637177586066E-12,null,160,1.741968698478926E-13,4.0618127281778109E-13]
[170,1.4832518467641599E-12,3.4604970956604562E-12,null,170,1.8674806357450618E-13,4.3568537154740981E-13]
[180,1.5503300323895691E-12,3.6167395216449376E-12,null,180,1.9514219870636984E-13,4.5538686758839896E-13]
[190,1.5981865114300066E-12,3.7298259583628551E-12,null,190,2.0121677169795748E-13,4.6957618475573474E-13]
[200,1.6292411349563456E-12,3.8009233644438529E-12,null,200,2.0508158781717909E-13,4.7862459951076029E-13]
[210,1.6488821041368966E-12,3.8475227209391302E-12,null,210,2.076102825215119E-13,4.8429802147073237E-13]
[220,1.6593885618470237E-12,3.8723123292843769E-12,null,220,2.0894484938593344E-13,4.8746518154680626E-13]
[230,1.6601451949393543E-12,3.8740924181023225E-12,null,230,2.089812986584579E-13,4.8763564201099417E-13]
[240,1.6564628190076062E-12,3.8659807012311219E-12,null,240,2.0854907603232007E-13,4.866774461505214E-13]
[250,1.6474733388843564E-12,3.8445217650007201E-12,null,250,2.0743249009458071E-13,4.8393202317149362E-13]
[260,1.6371489727154319E-12,3.8205867845915644E-12,null,260,2.0613347846716499E-13,4.8091353392200667E-13]
[270,1.6208892668190912E-12,3.7817829483706761E-12,null,270,2.0406707722815935E-13,4.76174106857814E-13]
[280,1.6055779149836588E-12,3.7461325680215693E-12,null,280,2.0213148844993433E-13,4.7163596982079943E-13]
[290,1.5875967153424989E-12,3.7043834266654058E-12,null,290,1.9987544363654337E-13,4.6639414110979626E-13]
[300,1.5697807603176773E-12,3.6629029449398928E-12,null,300,1.9764246336813217E-13,4.6117181505667025E-13]
[310,1.5487462915462769E-12,3.6137338116401522E-12,null,310,1.9499578350009201E-13,4.5492295956812884E-13]
[320,1.5267478522111734E-12,3.5618856485518469E-12,null,320,1.9221251451497666E-13,4.4844929495533202E-13]
[330,1.5061107622059926E-12,3.51394213061421E-12,null,330,1.8961462074750411E-13,4.4243907256614954E-13]
[340,1.4861912586359359E-12,3.4675504026870081E-12,null,340,1.8710774003236735E-13,4.3655368184611697E-13]
[350,1.4640628858217632E-12,3.4157370793778377E-12,null,350,1.8432379805013139E-13,4.3006864769304606E-13]
[360,1.4427653336085155E-12,3.366109250656567E-12,null,360,1.8161645577633488E-13,4.2383361317763105E-13]
[370,1.421913344316043E-12,3.3183376559666444E-12,null,370,1.7903031090738091E-13,4.1774283540039085E-13]
[380,1.4003892602460716E-12,3.2677954165501776E-12,null,380,1.7628823938761471E-13,4.1135939283789189E-13]
[390,1.3815261786112043E-12,3.2237318078042381E-12,null,390,1.7394397448813659E-13,4.0585553902692103E-13]
[400,1.3599406448380036E-12,3.1735638287296421E-12,null,400,1.7121458899356063E-13,3.9957392444111861E-13]
[410,1.3411459985359553E-12,3.1294810048769142E-12,null,410,1.6883535637208627E-13,3.9401031973367717E-13]
[420,1.3221108140782551E-12,3.0846555112594849E-12,null,420,1.6643533816100021E-13,3.8834163861805387E-13]
[430,1.3025141987833056E-12,3.0386899062754011E-12,null,430,1.6399503093670109E-13,3.8253285872195618E-13]
[440,1.2835487741713119E-12,2.995048344347585E-12,null,440,1.6160646723450118E-13,3.7710263516577778E-13]
[450,1.2652841002233581E-12,2.9518340978197521E-12,null,450,1.592975496223359E-13,3.7163676985797074E-13]
[460,1.2483534273996259E-12,2.9131171944276756E-12,null,460,1.5716005189353669E-13,3.667162013573367E-13]
[470,1.2301856198986218E-12,2.8702953796385871E-12,null,470,1.5485368147046499E-13,3.6133892305485984E-13]
[480,1.2116748087239235E-12,2.8276723158452577E-12,null,480,1.525500823614241E-13,3.5594112807455374E-13]
[490,1.1967427281493353E-12,2.7925323089709641E-12,null,490,1.5066726030987533E-13,3.5158150561613344E-13]
[500,1.1796496782289461E-12,2.7521100482124967E-12,null,500,1.4852381114324109E-13,3.4650504417239109E-13]
[510,1.163808636092671E-12,2.7156429131430287E-12,null,510,1.4651051951214093E-13,3.4183178748309681E-13]
[520,1.1481082317008619E-12,2.6788557073934067E-12,null,520,1.4456114614559954E-13,3.3727341961703911E-13]
[530,1.1332336696603843E-12,2.643473023498712E-12,null,530,1.4266237711351485E-13,3.3277643298314683E-13]
[540,1.1163740746750565E-12,2.6050009920373814E-12,null,540,1.4053871194076473E-13,3.2790730635377338E-13]
[550,1.1028684615190794E-12,2.5736340142728529E-12,null,550,1.3885601953602573E-13,3.2401085670213856E-13]
[560,1.088100819695567E-12,2.5389709908242509E-12,null,560,1.3699778245429907E-13,3.1961551307028438E-13]
[570,1.0727263075971154E-12,2.5029839081821137E-12,null,570,1.3506302086983372E-13,3.1509755995855224E-13]
[580,1.0596364367756124E-12,2.4723305237806931E-12,null,580,1.3341547296658749E-13,3.112639101049811E-13]
[590,1.0467330713517628E-12,2.4424529972591044E-12,null,590,1.3179650865810828E-13,3.0750251927297539E-13]
[600,1.0335457153739699E-12,2.4117512847975674E-12,null,600,1.3012238891873756E-13,3.0364327431248319E-13]
[610,1.0198515253568275E-12,2.3799984634885175E-12,null,610,1.2839885535927942E-13,2.9961614604908428E-13]
[620,1.0077935404844597E-12,2.3517267253884686E-12,null,620,1.2688902290960556E-13,2.9605208690940771E-13]
[630,9.9582872801074606E-13,2.3236978548399782E-12,null,630,1.2536766371435045E-13,2.9252226619883206E-13]
[640,9.828109892737621E-13,2.2928360972388004E-12,null,640,1.2372637429935371E-13,2.8866971298282357E-13]
[650,9.7264262906819813E-13,2.2693890950710595E-12,null,650,1.22437166064822E-13,2.8572100501148625E-13]
[660,9.6031366183831475E-13,2.2411058895000128E-12,null,660,1.2090837885983492E-13,2.8212807090390806E-13]
[670,9.4813646734850625E-13,2.2126801894232688E-12,null,670,1.1936269072159464E-13,2.7859545678026437E-13]
[680,9.3880016622721212E-13,2.1908143685412802E-12,null,680,1.1820638723594692E-13,2.7578960728745211E-13]
[690,9.2815299722058868E-13,2.1653995479259809E-12,null,690,1.1685808289730459E-13,2.7263778955698586E-13]
[700,9.1603061470025341E-13,2.137425122119107E-12,null,700,1.1533434949491108E-13,2.6907509568735887E-13]
[710,9.0683685529972932E-13,2.1162625470912678E-12,null,710,1.1417212017531973E-13,2.6639924670032688E-13]
[720,8.9551292164675274E-13,2.0894887392068031E-12,null,720,1.1273720389850177E-13,2.630681469798768E-13]
[730,8.8617248080868659E-13,2.0678792215010375E-12,null,730,1.1156724080376218E-13,2.6035652718184656E-13]
[740,8.7647661904551642E-13,2.0452951416236393E-12,null,740,1.1035952916903807E-13,2.5750114273014014E-13]
[750,8.6750165224196726E-13,2.0240656912575699E-12,null,750,1.0921823487307858E-13,2.5480860989131636E-13]
[760,8.5779834060338646E-13,2.0013250164131413E-12,null,760,1.0799031657566738E-13,2.5199271790475785E-13]
[770,8.48915845962268E-13,1.9804172757832482E-12,null,770,1.0687438947388061E-13,2.4934815170489466E-13]
[780,8.39801040015669E-13,1.9593614448981643E-12,null,780,1.0572620411837732E-13,2.4668730629426047E-13]
[790,8.3079288394250054E-13,1.938500919515236E-12,null,790,1.0459007227897199E-13,2.4404491156323446E-13]
[800,8.2211154031621596E-13,1.9183448832790582E-12,null,800,1.0351197148897208E-13,2.4152422100904119E-13]
[810,8.147140663596523E-13,1.9010472962490759E-12,null,810,1.0257182758105041E-13,2.3930262195538889E-13]
[820,8.0607598102144262E-13,1.8808706470878757E-12,null,820,1.0147810899309094E-13,2.3678248242655597E-13]
[830,7.9763138300524171E-13,1.8612478775908072E-12,null,830,1.004174503265278E-13,2.3427471707309312E-13]
[840,7.9023665495691684E-13,1.8438014482366124E-12,null,840,9.9487386572325558E-14,2.321279921998085E-13]
[850,7.8209434674424885E-13,1.8247567133195867E-12,null,850,9.8462007224940294E-14,2.2971150781719202E-13]
[860,7.745534600918194E-13,1.8069948724407793E-12,null,860,9.7511620512127557E-14,2.2751960720135186E-13]
[870,7.6683974526751993E-13,1.7890861604779404E-12,null,870,9.6541197325230454E-14,2.2522879701024426E-13]
[880,7.5979132512616119E-13,1.7728769632539904E-12,null,880,9.565018401937915E-14,2.2318864964254186E-13]
[890,7.5237180176749118E-13,1.7556237835073722E-12,null,890,9.4720319024935034E-14,2.2103131235625752E-13]
[900,7.4538301744541008E-13,1.7396659521219647E-12,null,900,9.3853374102497212E-14,2.1900552229289366E-13]
[910,7.388130136598007E-13,1.7239076279099922E-12,null,910,9.3014834801798313E-14,2.1704006547897282E-13]
[920,7.3194735899323355E-13,1.7079399075953598E-12,null,920,9.214857547822875E-14,2.1500924744741977E-13]
[930,7.2469059683882353E-13,1.6910335528300433E-12,null,930,9.1228482566895353E-14,2.1290994879517438E-13]
[940,7.185361415413609E-13,1.6766847206513003E-12,null,940,9.0455735524648636E-14,2.1107064251388154E-13]
[950,7.1149862615186643E-13,1.6600438156562747E-12,null,950,8.9584218924921734E-14,2.089887279071151E-13]
[960,7.0544685658082841E-13,1.6462169407267505E-12,null,960,8.8819412444728778E-14,2.0724281923359548E-13]
[970,6.9939958850006105E-13,1.631978534543972E-12,null,970,8.8058796517853656E-14,2.054697062942777E-13]
[980,6.9355142006809809E-13,1.6181662880926756E-12,null,980,8.7317748522659012E-14,2.0373504405512384E-13]
[990,6.8614751518647012E-13,1.601248598069476E-12,null,990,8.6396615313089351E-14,2.0159914427676403E-13]
[1000,6.8135602701629067E-13,1.5899287175505701E-12,null,1000,8.5776408869155199E-14,2.0015114126798385E-13]
[]
[]
["Saved  03/08/2022: 10:00:21  Level Number: 5"]
[]
["BREAKTHROUGH RESULTS"]
[]
["Advanced"]
["Pollutant Linkage: Stabilised Wast, Unsat MG, Sat MG, Alluvium, Chalk, Chalk haz",null,null,null,null,null,"Pollutant Linkage: Stabilised Wast, Unsat MG, Sat MG, Alluvium, Chalk, Chalk nonhaz"]
["Concentrations in mg/L in Chalk haz",null,null,null,null,null,"Concentrations in mg/L in Chalk nonhaz"]
[]
["Compared with EAL target concentration in mg/L",null,null,null,null,null,"No target concentrations specified for comparison"]
[null,1E-3,5.0000000000000001E-4,2.0000000000000002E-5,2.0000000000000001E-4]
[]
["Time(years)","Species1","Species2","Species3","Species4",null,"Time(years)","Species1","Species2","Species3","Species4"]
[null,"Cr","Phenol","Hg","Pb",null,null,"Cr","Phenol","Hg","Pb"]
[10,0,0,0,0,null,10,0,0,0,0]
[20,0,0,0,0,null,20,0,0,0,0]
[30,0,0,0,0,null,30,0,0,0,0]
[40,0,0,0,0,null,40,0,0,0,0]
[50,0,0,0,0,null,50,0,0,0,0]
[60,0,0,0,0,null,60,0,0,0,0]
[70,0,0,0,0,null,70,0,0,0,0]
[80,0,0,0,0,null,80,0,0,0,0]
[90,0,0,0,0,null,90,0,0,0,0]
[100,0,0,0,0,null,100,0,0,0,0]
[110,0,0,0,0,null,110,0,0,0,0]
[120,8.3134792781343329E-14,2.2690329706694614E-14,3.0257256218728187E-16,3.7798649233957896E-15,null,120,1.0473746634917943E-14,2.8556215296173655E-15,3.8112845828782904E-17,4.7569369402006414E-16]
[130,1.489094603023859E-13,4.0574313023193265E-14,5.4104837557670138E-16,6.76802354672572E-15,null,130,1.8738556323632801E-14,5.1098355201023967E-15,6.8088151992793808E-17,8.5197828094452457E-16]
[140,1.9505547305393234E-13,5.3187012803622272E-14,7.09054912807345E-16,8.8691924553071907E-15,null,140,2.4552889700316514E-14,6.6955798397588411E-15,8.9305369578177386E-17,1.1160328009627909E-15]
[150,2.2932081762534016E-13,6.2509577245119553E-14,8.3387154942789036E-16,1.0418712196546982E-14,null,150,2.8867887911344652E-14,7.8668559957193001E-15,1.0498816146738744E-16,1.3118416313328881E-15]
[160,2.5358122962372825E-13,6.9129602885763367E-14,9.2166525898678046E-16,1.1526945551358846E-14,null,160,3.1929843182353907E-14,8.7018161936388353E-15,1.1608236935795079E-16,1.4512592815471925E-15]
[170,2.7191651698803307E-13,7.4126420481228461E-14,9.8895723385099599E-16,1.235667193463985E-14,null,170,3.4213230740750032E-14,9.3323605605622235E-15,1.244577101230056E-16,1.5556947411492277E-15]
[180,2.8418226884624326E-13,7.7499457241858393E-14,1.0335988560251625E-15,1.2917600165230716E-14,null,180,3.5787372402570605E-14,9.7569715913801439E-15,1.300847632387934E-16,1.626511248125262E-15]
[190,2.9310476772469974E-13,7.992766230493047E-14,1.0656329708937541E-15,1.3321086686598404E-14,null,190,3.6895804006134382E-14,1.0062342820998745E-14,1.3414773828547594E-16,1.6769058890642998E-15]
[200,2.9860965446543349E-13,8.146177043495999E-14,1.0859409327894744E-15,1.3572276663114994E-14,null,200,3.7599889262619892E-14,1.0258364612415522E-14,1.3677543844715892E-16,1.7089428719563528E-15]
[210,3.0231344351677422E-13,8.2439532466750389E-14,1.099360240597994E-15,1.3743951273487808E-14,null,210,3.8062538096989497E-14,1.0379826043529479E-14,1.3841031045932702E-16,1.73047786352289E-15]
[220,3.0425191585581003E-13,8.2979381857903748E-14,1.1062732271885821E-15,1.382852782161079E-14,null,220,3.8301483699942413E-14,1.0444009293860116E-14,1.3928945921105825E-16,1.7410090882426497E-15]
[230,3.0427735099917276E-13,8.301088326596134E-14,1.1067057134172967E-15,1.3832891630035412E-14,null,230,3.8314956446827964E-14,1.0450176336097878E-14,1.3934030989774325E-16,1.7414984220013203E-15]
[240,3.0368453058324024E-13,8.284223972050006E-14,1.1043963806514092E-15,1.3804277634407809E-14,null,240,3.8240115500994903E-14,1.0430721222818937E-14,1.3906324361915245E-16,1.7379076352915706E-15]
[250,3.0208167995270375E-13,8.2377691117662836E-14,1.0983904648283602E-15,1.3728718920335997E-14,null,250,3.8027895260857423E-14,1.0369505368459077E-14,1.3828522726587942E-16,1.7285837857103634E-15]
[260,3.0014429619245349E-13,8.1844847017019503E-14,1.0913815827984903E-15,1.3642286947297269E-14,null,260,3.7788540767468903E-14,1.0306486483936727E-14,1.3740346599049712E-16,1.7175606077755842E-15]
[270,2.9708468855512412E-13,8.1052466355616392E-14,1.0805783135471553E-15,1.3508607969138558E-14,null,270,3.7415435112762266E-14,1.0205633582325728E-14,1.3606484884916758E-16,1.700967048292713E-15]
[280,2.9431903560462933E-13,8.0278711684835911E-14,1.0705421926711251E-15,1.3377807819012219E-14,null,280,3.7054637311466149E-14,1.0107000072726844E-14,1.3475751353278939E-16,1.6842687510115874E-15]
[290,2.910546943557503E-13,7.9382234415908977E-14,1.0583297544178104E-15,1.3229789837525836E-14,null,290,3.6645072437232257E-14,9.993501310282249E-15,1.3324013492280108E-16,1.6655252610647192E-15]
[300,2.8783112570068755E-13,7.8495194385118777E-14,1.0467487073501083E-15,1.3082304718506585E-14,null,300,3.6237810132405332E-14,9.8826789417008015E-15,1.3176778712833304E-16,1.6467201089023261E-15]
[310,2.8392124288448168E-13,7.7435887065215091E-14,1.0324764520294214E-15,1.2904141323827057E-14,null,310,3.5745018000148924E-14,9.7492749141173418E-15,1.2998005892993309E-16,1.6245808339798677E-15]
[320,2.7982474800704779E-13,7.6318466849384392E-14,1.0177657737441914E-15,1.2721622029588361E-14,null,320,3.5237022069662612E-14,9.6063791437650831E-15,1.2810649293530421E-16,1.6017776984633972E-15]
[330,2.7609544622380343E-13,7.5313899419071105E-14,1.0041387663956819E-15,1.2549309579901155E-14,null,330,3.4760269809436515E-14,9.4808109855978802E-15,1.2640348459162959E-16,1.580061241512711E-15]
[340,2.7243996723238155E-13,7.4303895088478231E-14,9.9067503309615803E-16,1.2382834601217781E-14,null,340,3.4297348980516335E-14,9.3531470888412886E-15,1.2471510898256236E-16,1.5590494033838114E-15]
[350,2.6841725302358713E-13,7.32036653047083E-14,9.760387075727397E-16,1.2198457203146542E-14,null,350,3.3789270878636336E-14,9.2170975152155739E-15,1.2286692530411207E-16,1.5360332811615902E-15]
[360,2.6452621974229394E-13,7.2142809387698959E-14,9.6171621389409912E-16,1.202226125377753E-14,null,360,3.3298290749812839E-14,9.0822580272479023E-15,1.2108115844164783E-16,1.5135775498720297E-15]
[370,2.6074328588341674E-13,7.1109612483703222E-14,9.4818448621437656E-16,1.185223233514769E-14,null,370,3.282709211569791E-14,8.9531086902268065E-15,1.1939057707470509E-16,1.4921537449581481E-15]
[380,2.5673184532928879E-13,7.0008984197333091E-14,9.3368238920259729E-16,1.1670897140241848E-14,null,380,3.2327940715330913E-14,8.8148739461581453E-15,1.17544720806513E-16,1.4693146174661052E-15]
[390,2.5332101269385107E-13,6.9073761220789269E-14,9.210294178422197E-16,1.1513126401435162E-14,null,390,3.1889628161905087E-14,8.6958779795385913E-15,1.1595307177493329E-16,1.4494005916289916E-15]
[400,2.4937411604773092E-13,6.8009525552109393E-14,9.0679666361522772E-16,1.1335718203236714E-14,null,400,3.139144026778108E-14,8.5626037309810827E-15,1.1415316180138901E-16,1.4271937761413367E-15]
[410,2.458738057124961E-13,6.7075903485437298E-14,8.9411449045908611E-16,1.1177139774395803E-14,null,410,3.0954137847586724E-14,8.4430963168365078E-15,1.1256177530934567E-16,1.4071625982908702E-15]
[420,2.4233435918990464E-13,6.6108557227537269E-14,8.8150265027519772E-16,1.1016459206409146E-14,null,420,3.0511985362143875E-14,8.3224973236447404E-15,1.1097075058904559E-16,1.3868508104915713E-15]
[430,2.3879774074605823E-13,6.5132095656310908E-14,8.6842672239095052E-16,1.0854162054724607E-14,null,430,3.005738078970857E-14,8.1998036460904714E-15,1.0931432735840682E-16,1.3665158019096502E-15]
[440,2.3532449691823616E-13,6.4174693261393529E-14,8.556960973073855E-16,1.0696247792717058E-14,null,440,2.9627116729078221E-14,8.0796992582659236E-15,1.0771984962306739E-16,1.3466919060313708E-15]
[450,2.3194263439218073E-13,6.3260396561792309E-14,8.4349021778346739E-16,1.0543733056588003E-14,null,450,2.9199371948455479E-14,7.9648172653598354E-15,1.0618728471534229E-16,1.3273057524292019E-15]
[460,2.2885722797461197E-13,6.2419314510630331E-14,8.3232193564627285E-16,1.0401841492481739E-14,null,460,2.8810532545340602E-14,7.8569412745627123E-15,1.0477970646688776E-16,1.3097765035111073E-15]
[470,2.2552701160520347E-13,6.1503710226234066E-14,8.1997376320720976E-16,1.0251080747116993E-14,null,470,2.8396722540794292E-14,7.7424536527791068E-15,1.0323834878723974E-16,1.2905299319571021E-15]
[480,2.2216099562905946E-13,6.0599106083859523E-14,8.0781743686732108E-16,1.0097722842152734E-14,null,480,2.7973755669765216E-14,7.6282646438110073E-15,1.0170022943549019E-16,1.2712653476565497E-15]
[490,2.1941016797631354E-13,5.9837998131411688E-14,7.9784627623936321E-16,9.9730225174829666E-15,null,490,2.7621387136201189E-14,7.5335580953523554E-15,1.0045366372980666E-16,1.2556440125143907E-15]
[500,2.163136002111119E-13,5.8997122915279578E-14,7.8643817398964061E-16,9.829773771374537E-15,null,500,2.7231391311830515E-14,7.4266690430311537E-15,9.901813165708623E-17,1.2375499063007592E-15]
[510,2.1333981087896432E-13,5.8187411597935168E-14,7.7592438082946959E-16,9.69866666765278E-15,null,510,2.6859940479900471E-14,7.3257179885728305E-15,9.7666871162763596E-17,1.2208970209822461E-15]
[520,2.1049231619981403E-13,5.7416231579070769E-14,7.6558658849065074E-16,9.5684072206908656E-15,null,520,2.6502428229479008E-14,7.2283529467997296E-15,9.6361852357095038E-17,1.20463663484275E-15]
[530,2.0771496008734061E-13,5.66492512181328E-14,7.5542795683982401E-16,9.4418264208895508E-15,null,530,2.6155510402215945E-14,7.1322799689320654E-15,9.510275681341823E-17,1.188661933313945E-15]
[540,2.046452462531253E-13,5.5816870749921328E-14,7.4422087349798353E-16,9.3013979578205552E-15,null,540,2.5765002696912244E-14,7.0266210415632056E-15,9.3696868463374498E-17,1.1710490990379705E-15]
[550,2.0220116414356009E-13,5.5149172513306781E-14,7.3530544557314595E-16,9.191175155185509E-15,null,550,2.5457068335144517E-14,6.9426068369606025E-15,9.2565627997852562E-17,1.1571880878438263E-15]
[560,1.9950956615438388E-13,5.4405587993692001E-14,7.2549059146730463E-16,9.0679774763728893E-15,null,560,2.511213179555955E-14,6.849063062439477E-15,9.1326766432487551E-17,1.1416526793774044E-15]
[570,1.9662868963200203E-13,5.3632710364982672E-14,7.1506099373990706E-16,8.9396704642417574E-15,null,570,2.4759756806465267E-14,6.7516503272308946E-15,9.0014466219960378E-17,1.1254933119256801E-15]
[580,1.9430188675445603E-13,5.2979502663093979E-14,7.0640498866116932E-16,8.8302757998193204E-15,null,580,2.4459461543724947E-14,6.6691006340364752E-15,8.8941352768538482E-17,1.1117687122315182E-15]
[590,1.9192531953952501E-13,5.234087861897083E-14,6.9773190051288201E-16,8.7225394569285322E-15,null,590,2.4161212221348413E-14,6.5894900936966658E-15,8.7843174817343482E-17,1.0981692167638589E-15]
[600,1.8949053354237674E-13,5.1684742377677589E-14,6.8902107701905518E-16,8.6126500825703234E-15,null,600,2.3856136030110187E-14,6.5069650255990777E-15,8.6750607321602736E-17,1.0843630736895768E-15]
[610,1.8696625454798897E-13,5.0995716200977984E-14,6.79920058091857E-16,8.4986240412931261E-15,null,610,2.3538122946199491E-14,6.420508930781665E-15,8.5588554427273661E-17,1.0698911156087601E-15]
[620,1.8477878082387746E-13,5.0401085213127181E-14,6.7189157697658346E-16,8.399293265477994E-15,null,620,2.3262110971772063E-14,6.3450251330837659E-15,8.4590055743574903E-17,1.0574663769576976E-15]
[630,1.8257809084679595E-13,4.9786190297218126E-14,6.6396683814287706E-16,8.2986084098697161E-15,null,630,2.2987032541913836E-14,6.2687375173004523E-15,8.358693180583438E-17,1.0447772886562586E-15]
[640,1.8015198304938602E-13,4.9139611001284221E-14,6.5510290063956366E-16,8.1894183266970283E-15,null,640,2.2679760804124212E-14,6.186228429053889E-15,8.2484750931953673E-17,1.0310091159102616E-15]
[650,1.7829632603830936E-13,4.8624731859876567E-14,6.4831615688071939E-16,8.1038921726197988E-15,null,650,2.2445381110381832E-14,6.121390951989241E-15,8.16231028325855E-17,1.0202272521119198E-15]
[660,1.7606241334852291E-13,4.8021126735702212E-14,6.4015690778712722E-16,8.0022635883359643E-15,null,660,2.2165337283959077E-14,6.0458589673645019E-15,8.0599256844738671E-17,1.0073918839269546E-15]
[670,1.7384438210174736E-13,4.74191277542228E-14,6.3212638232821108E-16,7.9025541936889793E-15,null,670,2.1884104946168756E-14,5.9697501393040428E-15,7.9586457213419491E-17,9.947908853470262E-16]
[680,1.7212642322474065E-13,4.6954160864499975E-14,6.2599372607079305E-16,7.8240515100058545E-15,null,680,2.1670993380297598E-14,5.9109078097106577E-15,7.8811996488018776E-17,9.8497986188580247E-16]
[690,1.7014514634797524E-13,4.6411623863611187E-14,6.1868840724437681E-16,7.7337112882445776E-15,null,690,2.1420192508449724E-14,5.8423293848941756E-15,7.7887426346754605E-17,9.7365390733475695E-16]
[700,1.6794434143636825E-13,4.5808743905159559E-14,6.107497339873692E-16,7.6341361490847318E-15,null,700,2.1143652235551046E-14,5.767238206950041E-15,7.6881295405870642E-17,9.6096266561052337E-16]
[710,1.6625673043826147E-13,4.5337582337836516E-14,6.0454116130097141E-16,7.5575209492004323E-15,null,710,2.093034226407566E-14,5.7084220944001117E-15,7.6113903071049093E-17,9.5155667763439728E-16]
[720,1.6418289306651596E-13,4.4772175757240704E-14,5.9700589075118556E-16,7.4637041926058342E-15,null,720,2.0668930005760984E-14,5.6355102075945776E-15,7.5166046522190791E-17,9.3959229460837151E-16]
[730,1.6246426991857799E-13,4.4311058192642756E-14,5.9088541780343629E-16,7.3847928544791973E-15,null,730,2.0454549435930379E-14,5.5799504404048554E-15,7.4381539033639025E-17,9.2961527603612025E-16]
[740,1.6068777188261474E-13,4.3823673552329203E-14,5.8447403237351816E-16,7.3041462129585543E-15,null,740,2.023124254028185E-14,5.517654988432643E-15,7.3570036879000793E-17,9.1952000228082644E-16]
[750,1.5902825705394946E-13,4.336918848234364E-14,5.7825311327820183E-16,7.2290796747317135E-15,null,750,2.0021094283217863E-14,5.4601732665079154E-15,7.2799495718122379E-17,9.1011755648874001E-16]
[760,1.5726911165798639E-13,4.2887723271167548E-14,5.7189339589391429E-16,7.1483783233417157E-15,null,760,1.9799542226510547E-14,5.3991295377645693E-15,7.1988309381596685E-17,9.0005004929889128E-16]
[770,1.5561532721068111E-13,4.2441297364695149E-14,5.6590118335502077E-16,7.0737143084657613E-15,null,770,1.9590927506858056E-14,5.3429616711608783E-15,7.1241109394863946E-17,8.9051840566222429E-16]
[780,1.5393643734739488E-13,4.1988681965264943E-14,5.5978452898048836E-16,6.9972614503010894E-15,null,780,1.9382551802254858E-14,5.2867687209148688E-15,7.0470910417472585E-17,8.8092079793840913E-16]
[790,1.5231390600214674E-13,4.1542330674240144E-14,5.5387246521773913E-16,6.923234739233625E-15,null,790,1.9177861263316204E-14,5.2306935049031562E-15,6.9732317777119431E-17,8.7164315721287832E-16]
[800,1.5073903750736473E-13,4.1106826162390966E-14,5.4811385930901242E-16,6.8513719654788374E-15,null,800,1.8974304287683504E-14,5.175015541106866E-15,6.8994779360332786E-17,8.6246682348604406E-16]
[810,1.4935981954714897E-13,4.0731315397244866E-14,5.4311465803809969E-16,6.7892312427468971E-15,null,810,1.880488773461255E-14,5.1274932580264761E-15,6.8376368303089542E-17,8.5471861873130958E-16]
[820,1.4776270668344637E-13,4.0306935601055657E-14,5.3733055700311229E-16,6.7167245990524991E-15,null,820,1.8601660839795368E-14,5.0745771488187355E-15,6.7657265215390888E-17,8.4561126860464431E-16]
[830,1.462314401017757E-13,3.9884811416667225E-14,5.3177442410597176E-16,6.6469617924671971E-15,null,830,1.841081991232489E-14,5.0209374899696339E-15,6.6942282172670763E-17,8.3681648520100472E-16]
[840,1.4487597098181827E-13,3.9509000692506226E-14,5.2677435864245211E-16,6.5840435483854018E-15,null,840,1.8236320396844707E-14,4.9737628418485102E-15,6.6318825143704585E-17,8.2891953679346378E-16]
[850,1.433885187269003E-13,3.910195946024703E-14,5.2136754806401758E-16,6.5174901011814826E-15,null,850,1.8054081017849152E-14,4.9230934341165818E-15,6.5642181256204916E-17,8.2059310480812509E-16]
[860,1.419950002606618E-13,3.8724921382171537E-14,5.164011870421725E-16,6.4545404292205187E-15,null,860,1.7877448266084406E-14,4.8751851704090602E-15,6.5007869896129079E-17,8.125533115508648E-16]
[870,1.405648997478708E-13,3.8331968069769148E-14,5.1123819152110736E-16,6.3893549192236405E-15,null,870,1.7698277410673162E-14,4.8262888579934558E-15,6.4355677541372613E-17,8.0444431736785774E-16]
[880,1.3930729532092629E-13,3.7989025320389814E-14,5.0650244003630141E-16,6.3323253787471297E-15,null,880,1.7537163430682625E-14,4.7827403738691158E-15,6.3765376456181696E-17,7.9719994733306424E-16]
[890,1.3792800377154881E-13,3.7617537263022663E-14,5.0158493832221341E-16,6.2697357604639764E-15,null,890,1.7365716783257204E-14,4.7361904516447388E-15,6.3149866230738408E-17,7.8935471825351484E-16]
[900,1.3667745031072193E-13,3.7272637731664299E-14,4.9705089961912444E-16,6.2121379654157774E-15,null,900,1.7207808394298391E-14,4.6924257060300382E-15,6.2572642382201402E-17,7.8211594542628073E-16]
[910,1.354337674202553E-13,3.6939518780668689E-14,4.9253650891637348E-16,6.1569394259227577E-15,null,910,1.7052635705884428E-14,4.6506417011309905E-15,6.2013696223391151E-17,7.7513990342266052E-16]
[920,1.3419349009945723E-13,3.6595565340218259E-14,4.87948654013618E-16,6.0997972196272332E-15,null,920,1.6894023088076449E-14,4.6071307557660946E-15,6.1435149254576221E-17,7.6794086372712575E-16]
[930,1.3285587520563018E-13,3.6238353591589864E-14,4.8315241864777736E-16,6.0394766275736341E-15,null,930,1.6729488634464682E-14,4.5625548543127474E-15,6.0829706828023664E-17,7.6036821146189533E-16]
[940,1.3172876999889208E-13,3.5925621638770441E-14,4.7905801961725337E-16,5.9881106100399164E-15,null,940,1.6584404619000219E-14,4.5228031927739452E-15,6.031003836561089E-17,7.538413395062697E-16]
[950,1.3043909127783657E-13,3.5570946953405672E-14,4.7430254387730013E-16,5.9286252801645488E-15,null,950,1.6421258234644292E-14,4.4777943890350154E-15,5.9714608041423709E-17,7.4651979507952989E-16]
[960,1.2934329369899893E-13,3.5274509557340548E-14,4.7029616262594793E-16,5.8788038464488465E-15,null,960,1.6285400010388822E-14,4.4414968944228874E-15,5.9211657661147386E-17,7.4009640629813037E-16]
[970,1.2823746283257549E-13,3.4973549737636216E-14,4.6626193781498817E-16,5.8286670048220281E-15,null,970,1.6145191077666537E-14,4.403094025971668E-15,5.8698521549584774E-17,7.3374633205336738E-16]
[980,1.2715362310373935E-13,3.4678263096814634E-14,4.6230857828521457E-16,5.7793380212321732E-15,null,980,1.6007900237894087E-14,4.3656086740776644E-15,5.8203792039128153E-17,7.2770669529073493E-16]
[990,1.2581882348872905E-13,3.4306648487000344E-14,4.5749887172081028E-16,5.7192455498490215E-15,null,990,1.5838802332574632E-14,4.3193357355893774E-15,5.7589454667677345E-17,7.2002597102447672E-16]
[1000,1.2491712521748301E-13,3.407399087102395E-14,4.5426125660114721E-16,5.6787756341946925E-15,null,1000,1.5726817161488106E-14,4.2894136469533479E-15,5.718281662483607E-17,7.1487371662608297E-16]
[]
[]
["Saved  03/08/2022: 10:13:48  Level Number: 5"]
[]
["BREAKTHROUGH RESULTS"]
[]
["Advanced"]
["Pollutant Linkage: Stabilised Wast, Unsat MG, Sat MG, Alluvium, Chalk, Chalk haz",null,null,null,null,null,"Pollutant Linkage: Stabilised Wast, Unsat MG, Sat MG, Alluvium, Chalk, Chalk nonhaz"]
["Concentrations in mg/L in Chalk haz",null,null,null,null,null,"Concentrations in mg/L in Chalk nonhaz"]
[]
["Compared with EAL target concentration in mg/L",null,null,null,null,null,"No target concentrations specified for comparison"]
[null,1E-3,5.0000000000000001E-4,2.0000000000000002E-5,2.0000000000000001E-4]
[]
["Time(years)","Species1","Species2","Species3","Species4",null,"Time(years)","Species1","Species2","Species3","Species4"]
[null,"Cr","Phenol","Hg","Pb",null,null,"Cr","Phenol","Hg","Pb"]
[10,0,5.6217039615350639E-5,0,0,null,10,0,7.0775288538775506E-6,0,0]
[20,0,2.6958423291489942E-6,0,0,null,20,0,3.3939712942218636E-7,0,0]
[30,0,9.8331392954248963E-8,0,0,null,30,0,1.2379578782761563E-8,0,0]
[40,0,3.601068999783346E-9,0,0,null,40,0,4.5336200402185811E-10,0,0]
[50,0,1.3571998747225985E-10,0,0,null,50,0,1.7086670920458606E-11,0,0]
[60,0,5.3385495001705315E-12,0,0,null,60,0,6.7210588253851596E-13,0,0]
[70,0,2.9702991441018955E-13,0,0,null,70,0,3.7393136624916868E-14,0,0]
[80,0,7.303682419138961E-14,0,0,null,80,0,9.1923874503039835E-15,0,0]
[90,0,2.2897754333372031E-14,0,0,null,90,0,2.8844308097962069E-15,0,0]
[100,0,0,0,0,null,100,0,0,0,0]
[110,0,0,0,0,null,110,0,0,0,0]
[120,0,0,0,0,null,120,0,0,0,0]
[130,0,0,0,0,null,130,0,0,0,0]
[140,0,0,0,0,null,140,0,0,0,0]
[150,0,0,0,0,null,150,0,0,0,0]
[160,0,0,0,0,null,160,0,0,0,0]
[170,0,0,0,0,null,170,0,0,0,0]
[180,0,0,0,0,null,180,0,0,0,0]
[190,0,0,0,0,null,190,0,0,0,0]
[200,0,0,0,0,null,200,0,0,0,0]
[210,0,0,0,0,null,210,0,0,0,0]
[220,0,0,0,0,null,220,0,0,0,0]
[230,0,0,0,0,null,230,0,0,0,0]
[240,0,0,0,0,null,240,0,0,0,0]
[250,0,0,0,0,null,250,0,0,0,0]
[260,0,0,0,0,null,260,0,0,0,0]
[270,0,0,0,0,null,270,0,0,0,0]
[280,0,0,0,0,null,280,0,0,0,0]
[290,0,0,0,0,null,290,0,0,0,0]
[300,0,0,0,0,null,300,0,0,0,0]
[310,0,0,0,0,null,310,0,0,0,0]
[320,0,0,0,0,null,320,0,0,0,0]
[330,0,0,0,0,null,330,0,0,0,0]
[340,0,0,0,0,null,340,0,0,0,0]
[350,0,0,0,0,null,350,0,0,0,0]
[360,0,0,0,0,null,360,0,0,0,0]
[370,0,0,0,0,null,370,0,0,0,0]
[380,0,0,0,0,null,380,0,0,0,0]
[390,0,0,0,0,null,390,0,0,0,0]
[400,0,0,0,0,null,400,0,0,0,0]
[410,0,0,0,0,null,410,0,0,0,0]
[420,0,0,0,0,null,420,0,0,0,0]
[430,0,0,0,0,null,430,0,0,0,0]
[440,0,0,0,0,null,440,0,0,0,0]
[450,0,0,0,0,null,450,0,0,0,0]
[460,0,0,0,0,null,460,0,0,0,0]
[470,0,0,0,0,null,470,0,0,0,0]
[480,0,0,0,0,null,480,0,0,0,0]
[490,0,0,0,0,null,490,0,0,0,0]
[500,0,0,0,0,null,500,0,0,0,0]
[510,0,0,0,0,null,510,0,0,0,0]
[520,0,0,0,0,null,520,0,0,0,0]
[530,0,0,0,0,null,530,0,0,0,0]
[540,0,0,0,0,null,540,0,0,0,0]
[550,0,0,0,0,null,550,0,0,0,0]
[560,0,0,0,0,null,560,0,0,0,0]
[570,0,0,0,0,null,570,0,0,0,0]
[580,0,0,0,0,null,580,0,0,0,0]
[590,0,0,0,0,null,590,0,0,0,0]
[600,0,0,0,0,null,600,0,0,0,0]
[610,0,0,0,0,null,610,0,0,0,0]
[620,0,0,0,0,null,620,0,0,0,0]
[630,0,0,0,0,null,630,0,0,0,0]
[640,0,0,0,0,null,640,0,0,0,0]
[650,0,0,0,0,null,650,0,0,0,0]
[660,0,0,0,0,null,660,0,0,0,0]
[670,0,0,0,0,null,670,0,0,0,0]
[680,0,0,0,0,null,680,0,0,0,0]
[690,0,0,0,0,null,690,0,0,0,0]
[700,0,0,0,0,null,700,0,0,0,0]
[710,0,0,0,0,null,710,0,0,0,0]
[720,0,0,0,0,null,720,0,0,0,0]
[730,0,0,0,0,null,730,0,0,0,0]
[740,0,0,0,0,null,740,0,0,0,0]
[750,0,0,0,0,null,750,0,0,0,0]
[760,0,0,0,0,null,760,0,0,0,0]
[770,0,0,0,0,null,770,0,0,0,0]
[780,0,0,0,0,null,780,0,0,0,0]
[790,0,0,0,0,null,790,0,0,0,0]
[800,0,0,0,0,null,800,0,0,0,0]
[810,0,0,0,0,null,810,0,0,0,0]
[820,0,0,0,0,null,820,0,0,0,0]
[830,0,0,0,0,null,830,0,0,0,0]
[840,0,0,0,0,null,840,0,0,0,0]
[850,0,0,0,0,null,850,0,0,0,0]
[860,0,0,0,0,null,860,0,0,0,0]
[870,0,0,0,0,null,870,0,0,0,0]
[880,0,0,0,0,null,880,0,0,0,0]
[890,0,0,0,0,null,890,0,0,0,0]
[900,0,0,0,0,null,900,0,0,0,0]
[910,0,0,0,0,null,910,0,0,0,0]
[920,0,0,0,0,null,920,0,0,0,0]
[930,0,0,0,0,null,930,0,0,0,0]
[940,0,0,0,0,null,940,0,0,0,0]
[950,0,0,0,0,null,950,0,0,0,0]
[960,0,0,0,0,null,960,0,0,0,0]
[970,0,0,0,0,null,970,0,0,0,0]
[980,0,0,0,0,null,980,0,0,0,0]
[990,0,0,0,0,null,990,0,0,0,0]
[1000,0,0,0,0,null,1000,0,0,0,0]
[]
[]
["Saved  03/08/2022: 11:21:23  Level Number: 5"]
[]
["BREAKTHROUGH RESULTS"]
[]
["Advanced"]
["Pollutant Linkage: Stabilised Wast, Unsat MG, Sat MG, Alluvium, Chalk, Chalk haz",null,null,null,null,null,"Pollutant Linkage: Stabilised Wast, Unsat MG, Sat MG, Alluvium, Chalk, Chalk nonhaz"]
["Concentrations in mg/L in Chalk haz",null,null,null,null,null,"Concentrations in mg/L in Chalk nonhaz"]
[]
["Compared with EAL target concentration in mg/L",null,null,null,null,null,"No target concentrations specified for comparison"]
[null,1E-3,5.0000000000000001E-4,2.0000000000000002E-5,2.0000000000000001E-4]
[]
["Time(years)","Species1","Species2","Species3","Species4",null,"Time(years)","Species1","Species2","Species3","Species4"]
[null,"Cr","Phenol","Hg","Pb",null,null,"Cr","Phenol","Hg","Pb"]
[10,0,1.5314876025872835E-4,0,0,null,10,0,1.9280893783861909E-5,0,0]
[20,0,7.7288529172755737E-6,0,0,null,20,0,9.7303557611087569E-7,0,0]
[30,0,2.8265768489123222E-7,0,0,null,30,0,3.5585614861573659E-8,0,0]
[40,0,1.0339553358931922E-8,0,0,null,40,0,1.3017136421442398E-9,0,0]
[50,0,3.8907267215584101E-10,0,0,null,50,0,4.8982886326478314E-11,0,0]
[60,0,1.5229866698216585E-11,0,0,null,60,0,1.9173871273217245E-12,0,0]
[70,0,8.2269982323818155E-13,0,0,null,70,0,1.0357643637347965E-13,0,0]
[80,0,2.2423418104350018E-13,0,0,null,80,0,2.8229650690578038E-14,0,0]
[90,0,1.2352733900615161E-13,0,0,null,90,0,1.5554674018325726E-14,0,0]
[100,0,1.3936727525325628E-14,0,0,null,100,0,1.75352552706267E-15,0,0]
[110,0,0,0,0,null,110,0,0,0,0]
[120,0,0,0,0,null,120,0,0,0,0]
[130,0,0,0,0,null,130,0,0,0,0]
[140,0,0,0,0,null,140,0,0,0,0]
[150,0,0,0,0,null,150,0,0,0,0]
[160,0,0,0,0,null,160,0,0,0,0]
[170,0,0,0,0,null,170,0,0,0,0]
[180,0,0,0,0,null,180,0,0,0,0]
[190,0,0,0,0,null,190,0,0,0,0]
[200,0,0,0,0,null,200,0,0,0,0]
[210,0,0,0,0,null,210,0,0,0,0]
[220,0,0,0,0,null,220,0,0,0,0]
[230,0,0,0,0,null,230,0,0,0,0]
[240,0,0,0,0,null,240,0,0,0,0]
[250,0,0,0,0,null,250,0,0,0,0]
[260,0,0,0,0,null,260,0,0,0,0]
[270,0,0,0,0,null,270,0,0,0,0]
[280,0,0,0,0,null,280,0,0,0,0]
[290,0,0,0,0,null,290,0,0,0,0]
[300,0,0,0,0,null,300,0,0,0,0]
[310,0,0,0,0,null,310,0,0,0,0]
[320,0,0,0,0,null,320,0,0,0,0]
[330,0,0,0,0,null,330,0,0,0,0]
[340,0,0,0,0,null,340,0,0,0,0]
[350,0,0,0,0,null,350,0,0,0,0]
[360,0,0,0,0,null,360,0,0,0,0]
[370,0,0,0,0,null,370,0,0,0,0]
[380,0,0,0,0,null,380,0,0,0,0]
[390,0,0,0,0,null,390,0,0,0,0]
[400,0,0,0,0,null,400,0,0,0,0]
[410,0,0,0,0,null,410,0,0,0,0]
[420,0,0,0,0,null,420,0,0,0,0]
[430,0,0,0,0,null,430,0,0,0,0]
[440,0,0,0,0,null,440,0,0,0,0]
[450,0,0,0,0,null,450,0,0,0,0]
[460,0,0,0,0,null,460,0,0,0,0]
[470,0,0,0,0,null,470,0,0,0,0]
[480,0,0,0,0,null,480,0,0,0,0]
[490,0,0,0,0,null,490,0,0,0,0]
[500,0,0,0,0,null,500,0,0,0,0]
[510,0,0,0,0,null,510,0,0,0,0]
[520,0,0,0,0,null,520,0,0,0,0]
[530,0,0,0,0,null,530,0,0,0,0]
[540,0,0,0,0,null,540,0,0,0,0]
[550,0,0,0,0,null,550,0,0,0,0]
[560,0,0,0,0,null,560,0,0,0,0]
[570,0,0,0,0,null,570,0,0,0,0]
[580,0,0,0,0,null,580,0,0,0,0]
[590,0,0,0,0,null,590,0,0,0,0]
[600,0,0,0,0,null,600,0,0,0,0]
[610,0,0,0,0,null,610,0,0,0,0]
[620,0,0,0,0,null,620,0,0,0,0]
[630,0,0,0,0,null,630,0,0,0,0]
[640,0,0,0,0,null,640,0,0,0,0]
[650,0,0,0,0,null,650,0,0,0,0]
[660,0,0,0,0,null,660,0,0,0,0]
[670,0,0,0,0,null,670,0,0,0,0]
[680,0,0,0,0,null,680,0,0,0,0]
[690,0,0,0,0,null,690,0,0,0,0]
[700,0,0,0,0,null,700,0,0,0,0]
[710,0,0,0,0,null,710,0,0,0,0]
[720,0,0,0,0,null,720,0,0,0,0]
[730,0,0,0,0,null,730,0,0,0,0]
[740,0,0,0,0,null,740,0,0,0,0]
[750,0,0,0,0,null,750,0,0,0,0]
[760,0,0,0,0,null,760,0,0,0,0]
[770,0,0,0,0,null,770,0,0,0,0]
[780,0,0,0,0,null,780,0,0,0,0]
[790,0,0,0,0,null,790,0,0,0,0]
[800,0,0,0,0,null,800,0,0,0,0]
[810,0,0,0,0,null,810,0,0,0,0]
[820,0,0,0,0,null,820,0,0,0,0]
[830,0,0,0,0,null,830,0,0,0,0]
[840,0,0,0,0,null,840,0,0,0,0]
[850,0,0,0,0,null,850,0,0,0,0]
[860,0,0,0,0,null,860,0,0,0,0]
[870,0,0,0,0,null,870,0,0,0,0]
[880,0,0,0,0,null,880,0,0,0,0]
[890,0,0,0,0,null,890,0,0,0,0]
[900,0,0,0,0,null,900,0,0,0,0]
[910,0,0,0,0,null,910,0,0,0,0]
[920,0,0,0,0,null,920,0,0,0,0]
[930,0,0,0,0,null,930,0,0,0,0]
[940,0,0,0,0,null,940,0,0,0,0]
[950,0,0,0,0,null,950,0,0,0,0]
[960,0,0,0,0,null,960,0,0,0,0]
[970,0,0,0,0,null,970,0,0,0,0]
[980,0,0,0,0,null,980,0,0,0,0]
[990,0,0,0,0,null,990,0,0,0,0]
[1000,0,0,0,0,null,1000,0,0,0,0]
[]
[]
["Saved  03/08/2022: 11:24:21  Level Number: 5"]
[]
["BREAKTHROUGH RESULTS"]
[]
["Advanced"]
["Pollutant Linkage: Stabilised Wast, Unsat MG, Sat MG, Alluvium, Chalk, Chalk haz",null,null,null,null,null,"Pollutant Linkage: Stabilised Wast, Unsat MG, Sat MG, Alluvium, Chalk, Chalk nonhaz"]
["Concentrations in mg/L in Chalk haz",null,null,null,null,null,"Concentrations in mg/L in Chalk nonhaz"]
[]
["Compared with EAL target concentration in mg/L",null,null,null,null,null,"No target concentrations specified for comparison"]
[null,1E-3,5.0000000000000001E-4,2.0000000000000002E-5,2.0000000000000001E-4]
[]
["Time(years)","Species1","Species2","Species3","Species4",null,"Time(years)","Species1","Species2","Species3","Species4"]
[null,"Cr","Phenol","Hg","Pb",null,null,"Cr","Phenol","Hg","Pb"]
[10,0,1.4741187456866635E-12,0,0,null,10,0,1.8558639917097405E-13,0,0]
[20,0,0,0,0,null,20,0,0,0,0]
[30,0,3.6329492708597209E-17,0,0,null,30,0,4.5733487257214196E-18,0,0]
[40,0,2.6236211889172986E-17,0,0,null,40,0,3.3030110274677089E-18,0,0]
[50,0,0,0,0,null,50,0,0,0,0]
[60,0,0,0,0,null,60,0,0,0,0]
[70,0,0,0,0,null,70,0,0,0,0]
[80,0,0,0,0,null,80,0,0,0,0]
[90,0,0,0,0,null,90,0,0,0,0]
[100,0,0,0,0,null,100,0,0,0,0]
[110,0,0,0,0,null,110,0,0,0,0]
[120,0,0,0,0,null,120,0,0,0,0]
[130,0,0,0,0,null,130,0,0,0,0]
[140,0,0,0,0,null,140,0,0,0,0]
[150,0,0,0,0,null,150,0,0,0,0]
[160,0,0,0,0,null,160,0,0,0,0]
[170,0,0,0,0,null,170,0,0,0,0]
[180,0,0,0,0,null,180,0,0,0,0]
[190,0,0,0,0,null,190,0,0,0,0]
[200,0,0,0,0,null,200,0,0,0,0]
[210,0,0,0,0,null,210,0,0,0,0]
[220,0,0,0,0,null,220,0,0,0,0]
[230,0,0,0,0,null,230,0,0,0,0]
[240,0,0,0,0,null,240,0,0,0,0]
[250,0,0,0,0,null,250,0,0,0,0]
[260,0,0,0,0,null,260,0,0,0,0]
[270,0,0,0,0,null,270,0,0,0,0]
[280,0,0,0,0,null,280,0,0,0,0]
[290,0,0,0,0,null,290,0,0,0,0]
[300,0,0,0,0,null,300,0,0,0,0]
[310,0,0,0,0,null,310,0,0,0,0]
[320,0,0,0,0,null,320,0,0,0,0]
[330,0,0,0,0,null,330,0,0,0,0]
[340,0,0,0,0,null,340,0,0,0,0]
[350,0,0,0,0,null,350,0,0,0,0]
[360,0,0,0,0,null,360,0,0,0,0]
[370,0,0,0,0,null,370,0,0,0,0]
[380,0,0,0,0,null,380,0,0,0,0]
[390,0,0,0,0,null,390,0,0,0,0]
[400,0,0,0,0,null,400,0,0,0,0]
[410,0,0,0,0,null,410,0,0,0,0]
[420,0,0,0,0,null,420,0,0,0,0]
[430,0,0,0,0,null,430,0,0,0,0]
[440,0,0,0,0,null,440,0,0,0,0]
[450,0,0,0,0,null,450,0,0,0,0]
[460,0,0,0,0,null,460,0,0,0,0]
[470,0,0,0,0,null,470,0,0,0,0]
[480,0,0,0,0,null,480,0,0,0,0]
[490,0,0,0,0,null,490,0,0,0,0]
[500,0,0,0,0,null,500,0,0,0,0]
[510,0,0,0,0,null,510,0,0,0,0]
[520,0,0,0,0,null,520,0,0,0,0]
[530,0,0,0,0,null,530,0,0,0,0]
[540,0,0,0,0,null,540,0,0,0,0]
[550,0,0,0,0,null,550,0,0,0,0]
[560,0,0,0,0,null,560,0,0,0,0]
[570,0,0,0,0,null,570,0,0,0,0]
[580,0,0,0,0,null,580,0,0,0,0]
[590,0,0,0,0,null,590,0,0,0,0]
[600,0,0,0,0,null,600,0,0,0,0]
[610,0,0,0,0,null,610,0,0,0,0]
[620,0,0,0,0,null,620,0,0,0,0]
[630,0,0,0,0,null,630,0,0,0,0]
[640,0,0,0,0,null,640,0,0,0,0]
[650,0,0,0,0,null,650,0,0,0,0]
[660,0,0,0,0,null,660,0,0,0,0]
[670,0,0,0,0,null,670,0,0,0,0]
[680,0,0,0,0,null,680,0,0,0,0]
[690,0,0,0,0,null,690,0,0,0,0]
[700,0,0,0,0,null,700,0,0,0,0]
[710,0,0,0,0,null,710,0,0,0,0]
[720,0,0,0,0,null,720,0,0,0,0]
[730,0,0,0,0,null,730,0,0,0,0]
[740,0,0,0,0,null,740,0,0,0,0]
[750,0,0,0,0,null,750,0,0,0,0]
[760,0,0,0,0,null,760,0,0,0,0]
[770,0,0,0,0,null,770,0,0,0,0]
[780,0,0,0,0,null,780,0,0,0,0]
[790,0,0,0,0,null,790,0,0,0,0]
[800,0,0,0,0,null,800,0,0,0,0]
[810,0,0,0,0,null,810,0,0,0,0]
[820,0,0,0,0,null,820,0,0,0,0]
[830,0,0,0,0,null,830,0,0,0,0]
[840,0,0,0,0,null,840,0,0,0,0]
[850,0,3.7419351894656541E-20,0,0,null,850,0,4.7103740205867374E-21,0,0]
[860,0,7.8527515919692518E-20,0,0,null,860,0,9.8613317917962886E-21,0,0]
[870,0,1.1782161938305271E-19,0,0,null,870,0,1.483623688586581E-20,0,0]
[880,0,1.5979313136290995E-19,0,0,null,880,0,2.0120363633208414E-20,0,0]
[890,0,1.9202017768250943E-19,0,0,null,890,0,2.4226800501825576E-20,0,0]
[900,0,2.2596105268409748E-19,0,0,null,900,0,2.8418202387322586E-20,0,0]
[910,0,2.6316710023135256E-19,0,0,null,910,0,3.311910836354812E-20,0,0]
[920,0,2.9377710264739088E-19,0,0,null,920,0,3.6980588991557654E-20,0,0]
[930,0,3.2346792080716105E-19,0,0,null,930,0,4.0702713160314161E-20,0,0]
[940,0,3.5254085384511704E-19,0,0,null,940,0,4.4353072063884331E-20,0,0]
[950,0,3.8078634863934078E-19,0,0,null,950,0,4.7972275103720403E-20,0,0]
[960,0,4.0904313889421631E-19,0,0,null,960,0,5.1532477576371452E-20,0,0]
[970,0,4.3365748268821276E-19,0,0,null,970,0,5.4603225066836717E-20,0,0]
[980,0,4.6344453116354688E-19,0,0,null,980,0,5.8361863580198362E-20,0,0]
[990,0,4.7591351045435629E-19,0,0,null,990,0,5.9893791672767948E-20,0,0]
[1000,0,5.0546934789983728E-19,0,0,null,1000,0,6.3659012533229596E-20,0,0]
[]
[]
["Saved  03/08/2022: 11:28:53  Level Number: 5"]
[]
["BREAKTHROUGH RESULTS"]
[]
["Advanced"]
["Pollutant Linkage: Stabilised Wast, Unsat MG, Sat MG, Alluvium, Chalk, Chalk haz",null,null,null,null,null,"Pollutant Linkage: Stabilised Wast, Unsat MG, Sat MG, Alluvium, Chalk, Chalk nonhaz"]
["Concentrations in mg/L in Chalk haz",null,null,null,null,null,"Concentrations in mg/L in Chalk nonhaz"]
[]
["Compared with EAL target concentration in mg/L",null,null,null,null,null,"No target concentrations specified for comparison"]
[null,1E-3,5.0000000000000001E-4,2.0000000000000002E-5,2.0000000000000001E-4]
[]
["Time(years)","Species1","Species2","Species3","Species4",null,"Time(years)","Species1","Species2","Species3","Species4"]
[null,"Cr","Phenol","Hg","Pb",null,null,"Cr","Phenol","Hg","Pb"]
[10,0,1.4741187456866635E-12,0,0,null,10,0,1.8558639917097405E-13,0,0]
[20,0,0,0,0,null,20,0,0,0,0]
[30,0,3.6329492708597209E-17,0,0,null,30,0,4.5733487257214196E-18,0,0]
[40,0,2.6236211889172986E-17,0,0,null,40,0,3.3030110274677089E-18,0,0]
[50,0,0,0,0,null,50,0,0,0,0]
[60,0,0,0,0,null,60,0,0,0,0]
[70,0,0,0,0,null,70,0,0,0,0]
[80,0,0,0,0,null,80,0,0,0,0]
[90,0,0,0,0,null,90,0,0,0,0]
[100,0,0,0,0,null,100,0,0,0,0]
[110,0,0,0,0,null,110,0,0,0,0]
[120,0,0,0,0,null,120,0,0,0,0]
[130,0,0,0,0,null,130,0,0,0,0]
[140,0,0,0,0,null,140,0,0,0,0]
[150,0,0,0,0,null,150,0,0,0,0]
[160,0,0,0,0,null,160,0,0,0,0]
[170,0,0,0,0,null,170,0,0,0,0]
[180,0,0,0,0,null,180,0,0,0,0]
[190,0,0,0,0,null,190,0,0,0,0]
[200,0,0,0,0,null,200,0,0,0,0]
[210,0,0,0,0,null,210,0,0,0,0]
[220,0,0,0,0,null,220,0,0,0,0]
[230,0,0,0,0,null,230,0,0,0,0]
[240,0,0,0,0,null,240,0,0,0,0]
[250,0,0,0,0,null,250,0,0,0,0]
[260,0,0,0,0,null,260,0,0,0,0]
[270,0,0,0,0,null,270,0,0,0,0]
[280,0,0,0,0,null,280,0,0,0,0]
[290,0,0,0,0,null,290,0,0,0,0]
[300,0,0,0,0,null,300,0,0,0,0]
[310,0,0,0,0,null,310,0,0,0,0]
[320,0,0,0,0,null,320,0,0,0,0]
[330,0,0,0,0,null,330,0,0,0,0]
[340,0,0,0,0,null,340,0,0,0,0]
[350,0,0,0,0,null,350,0,0,0,0]
[360,0,0,0,0,null,360,0,0,0,0]
[370,0,0,0,0,null,370,0,0,0,0]
[380,0,0,0,0,null,380,0,0,0,0]
[390,0,0,0,0,null,390,0,0,0,0]
[400,0,0,0,0,null,400,0,0,0,0]
[410,0,0,0,0,null,410,0,0,0,0]
[420,0,0,0,0,null,420,0,0,0,0]
[430,0,0,0,0,null,430,0,0,0,0]
[440,0,0,0,0,null,440,0,0,0,0]
[450,0,0,0,0,null,450,0,0,0,0]
[460,0,0,0,0,null,460,0,0,0,0]
[470,0,0,0,0,null,470,0,0,0,0]
[480,0,0,0,0,null,480,0,0,0,0]
[490,0,0,0,0,null,490,0,0,0,0]
[500,0,0,0,0,null,500,0,0,0,0]
[510,0,0,0,0,null,510,0,0,0,0]
[520,0,0,0,0,null,520,0,0,0,0]
[530,0,0,0,0,null,530,0,0,0,0]
[540,0,0,0,0,null,540,0,0,0,0]
[550,0,0,0,0,null,550,0,0,0,0]
[560,0,0,0,0,null,560,0,0,0,0]
[570,0,0,0,0,null,570,0,0,0,0]
[580,0,0,0,0,null,580,0,0,0,0]
[590,0,0,0,0,null,590,0,0,0,0]
[600,0,0,0,0,null,600,0,0,0,0]
[610,0,0,0,0,null,610,0,0,0,0]
[620,0,0,0,0,null,620,0,0,0,0]
[630,0,0,0,0,null,630,0,0,0,0]
[640,0,0,0,0,null,640,0,0,0,0]
[650,0,0,0,0,null,650,0,0,0,0]
[660,0,0,0,0,null,660,0,0,0,0]
[670,0,0,0,0,null,670,0,0,0,0]
[680,0,0,0,0,null,680,0,0,0,0]
[690,0,0,0,0,null,690,0,0,0,0]
[700,0,0,0,0,null,700,0,0,0,0]
[710,0,0,0,0,null,710,0,0,0,0]
[720,0,0,0,0,null,720,0,0,0,0]
[730,0,0,0,0,null,730,0,0,0,0]
[740,0,0,0,0,null,740,0,0,0,0]
[750,0,0,0,0,null,750,0,0,0,0]
[760,0,0,0,0,null,760,0,0,0,0]
[770,0,0,0,0,null,770,0,0,0,0]
[780,0,0,0,0,null,780,0,0,0,0]
[790,0,0,0,0,null,790,0,0,0,0]
[800,0,0,0,0,null,800,0,0,0,0]
[810,0,0,0,0,null,810,0,0,0,0]
[820,0,0,0,0,null,820,0,0,0,0]
[830,0,0,0,0,null,830,0,0,0,0]
[840,0,0,0,0,null,840,0,0,0,0]
[850,0,3.7419351894656541E-20,0,0,null,850,0,4.7103740205867374E-21,0,0]
[860,0,7.8527515919692518E-20,0,0,null,860,0,9.8613317917962886E-21,0,0]
[870,0,1.1782161938305271E-19,0,0,null,870,0,1.483623688586581E-20,0,0]
[880,0,1.5979313136290995E-19,0,0,null,880,0,2.0120363633208414E-20,0,0]
[890,0,1.9202017768250943E-19,0,0,null,890,0,2.4226800501825576E-20,0,0]
[900,0,2.2596105268409748E-19,0,0,null,900,0,2.8418202387322586E-20,0,0]
[910,0,2.6316710023135256E-19,0,0,null,910,0,3.311910836354812E-20,0,0]
[920,0,2.9377710264739088E-19,0,0,null,920,0,3.6980588991557654E-20,0,0]
[930,0,3.2346792080716105E-19,0,0,null,930,0,4.0702713160314161E-20,0,0]
[940,0,3.5254085384511704E-19,0,0,null,940,0,4.4353072063884331E-20,0,0]
[950,0,3.8078634863934078E-19,0,0,null,950,0,4.7972275103720403E-20,0,0]
[960,0,4.0904313889421631E-19,0,0,null,960,0,5.1532477576371452E-20,0,0]
[970,0,4.3365748268821276E-19,0,0,null,970,0,5.4603225066836717E-20,0,0]
[980,0,4.6344453116354688E-19,0,0,null,980,0,5.8361863580198362E-20,0,0]
[990,0,4.7591351045435629E-19,0,0,null,990,0,5.9893791672767948E-20,0,0]
[1000,0,5.0546934789983728E-19,0,0,null,1000,0,6.3659012533229596E-20,0,0]

{"sheet":"user_results","index":11,"n_rows":111,"n_cols":15,"rows_kept":111,"cut":false,"hidden":false,"merged":[]}
["BREAKTHROUGH RESULTS"]
["Site Name: \"Crown Quay\""]
["Advanced"]
["Pollutant Linkage: Stabilised Wast, Unsat MG, Sat MG, Alluvium, Chalk, Chalk haz/non-haz"]
["Concentrations in mg/L in Chalk haz"]
[]
["Compared with EAL target concentration in mg/L"]
[null,{"$f":"(Quality_Standard_1   Contaminants_Species1)","v":1E-3},{"$f":"(Quality_Standard_1   Contaminants_Species2)","v":5.0000000000000001E-4},{"$f":"(Quality_Standard_1   Contaminants_Species3)","v":2.0000000000000002E-5},{"$f":"(Quality_Standard_1   Contaminants_Species4)","v":2.0000000000000001E-4}]
[]
["Time(years)","Species1","Species2"]
[null,{"$f":"(Contaminants_Source_determinand_names  Contaminants_Species1)","v":"Cr"},{"$f":"(Contaminants_Source_determinand_names  Contaminants_Species2)","v":"Phenol"},{"$f":"(Contaminants_Source_determinand_names  Contaminants_Species3)","v":"Hg"},{"$f":"(Contaminants_Source_determinand_names  Contaminants_Species4)","v":"Pb"}]
[0.1,{"$f":" IF(OR(converge=0, RUN_RAM=0),0,RAMData(converge,$A12*s_per_year, sigma, nu, omega, 0, nsum, Calcs_pvals_path1_species1))","v":{"$error":"#VALUE!"}},{"$f":" IF(OR(converge=0, RUN_RAM=0),0,RAMData(converge,$A12*s_per_year, sigma, nu, omega, 0, nsum, Calcs_pvals_path1_species2))","v":{"$error":"#VALUE!"}},{"$f":" IF(OR(converge=0, RUN_RAM=0),0,RAMData(converge,$A12*s_per_year, sigma, nu, omega, 0, nsum, Calcs_pvals_path1_species3))","v":{"$error":"#VALUE!"}},{"$f":" IF(OR(converge=0, RUN_RAM=0),0,RAMData(converge,$A12*s_per_year, sigma, nu, omega, 0, nsum, Calcs_pvals_path1_species4))","v":{"$error":"#VALUE!"}}]
[0.2,{"$f":" IF(OR(converge=0, RUN_RAM=0),0,RAMData(converge,$A13*s_per_year, sigma, nu, omega, 0, nsum, Calcs_pvals_path1_species1))","v":{"$error":"#VALUE!"}},{"$f":" IF(OR(converge=0, RUN_RAM=0),0,RAMData(converge,$A13*s_per_year, sigma, nu, omega, 0, nsum, Calcs_pvals_path1_species2))","v":{"$error":"#VALUE!"}},{"$f":" IF(OR(converge=0, RUN_RAM=0),0,RAMData(converge,$A13*s_per_year, sigma, nu, omega, 0, nsum, Calcs_pvals_path1_species3))","v":{"$error":"#VALUE!"}},{"$f":" IF(OR(converge=0, RUN_RAM=0),0,RAMData(converge,$A13*s_per_year, sigma, nu, omega, 0, nsum, Calcs_pvals_path1_species4))","v":{"$error":"#VALUE!"}}]
[0.3,{"$f":" IF(OR(converge=0, RUN_RAM=0),0,RAMData(converge,$A14*s_per_year, sigma, nu, omega, 0, nsum, Calcs_pvals_path1_species1))","v":{"$error":"#VALUE!"}},{"$f":" IF(OR(converge=0, RUN_RAM=0),0,RAMData(converge,$A14*s_per_year, sigma, nu, omega, 0, nsum, Calcs_pvals_path1_species2))","v":{"$error":"#VALUE!"}},{"$f":" IF(OR(converge=0, RUN_RAM=0),0,RAMData(converge,$A14*s_per_year, sigma, nu, omega, 0, nsum, Calcs_pvals_path1_species3))","v":{"$error":"#VALUE!"}},{"$f":" IF(OR(converge=0, RUN_RAM=0),0,RAMData(converge,$A14*s_per_year, sigma, nu, omega, 0, nsum, Calcs_pvals_path1_species4))","v":{"$error":"#VALUE!"}}]
[0.4,{"$f":" IF(OR(converge=0, RUN_RAM=0),0,RAMData(converge,$A15*s_per_year, sigma, nu, omega, 0, nsum, Calcs_pvals_path1_species1))","v":{"$error":"#VALUE!"}},{"$f":" IF(OR(converge=0, RUN_RAM=0),0,RAMData(converge,$A15*s_per_year, sigma, nu, omega, 0, nsum, Calcs_pvals_path1_species2))","v":{"$error":"#VALUE!"}},{"$f":" IF(OR(converge=0, RUN_RAM=0),0,RAMData(converge,$A15*s_per_year, sigma, nu, omega, 0, nsum, Calcs_pvals_path1_species3))","v":{"$error":"#VALUE!"}},{"$f":" IF(OR(converge=0, RUN_RAM=0),0,RAMData(converge,$A15*s_per_year, sigma, nu, omega, 0, nsum, Calcs_pvals_path1_species4))","v":{"$error":"#VALUE!"}}]
[0.5,{"$f":" IF(OR(converge=0, RUN_RAM=0),0,RAMData(converge,$A16*s_per_year, sigma, nu, omega, 0, nsum, Calcs_pvals_path1_species1))","v":{"$error":"#VALUE!"}},{"$f":" IF(OR(converge=0, RUN_RAM=0),0,RAMData(converge,$A16*s_per_year, sigma, nu, omega, 0, nsum, Calcs_pvals_path1_species2))","v":{"$error":"#VALUE!"}},{"$f":" IF(OR(converge=0, RUN_RAM=0),0,RAMData(converge,$A16*s_per_year, sigma, nu, omega, 0, nsum, Calcs_pvals_path1_species3))","v":{"$error":"#VALUE!"}},{"$f":" IF(OR(converge=0, RUN_RAM=0),0,RAMData(converge,$A16*s_per_year, sigma, nu, omega, 0, nsum, Calcs_pvals_path1_species4))","v":{"$error":"#VALUE!"}}]
[0.6,{"$f":" IF(OR(converge=0, RUN_RAM=0),0,RAMData(converge,$A17*s_per_year, sigma, nu, omega, 0, nsum, Calcs_pvals_path1_species1))","v":{"$error":"#VALUE!"}},{"$f":" IF(OR(converge=0, RUN_RAM=0),0,RAMData(converge,$A17*s_per_year, sigma, nu, omega, 0, nsum, Calcs_pvals_path1_species2))","v":{"$error":"#VALUE!"}},{"$f":" IF(OR(converge=0, RUN_RAM=0),0,RAMData(converge,$A17*s_per_year, sigma, nu, omega, 0, nsum, Calcs_pvals_path1_species3))","v":{"$error":"#VALUE!"}},{"$f":" IF(OR(converge=0, RUN_RAM=0),0,RAMData(converge,$A17*s_per_year, sigma, nu, omega, 0, nsum, Calcs_pvals_path1_species4))","v":{"$error":"#VALUE!"}}]
[0.7,{"$f":" IF(OR(converge=0, RUN_RAM=0),0,RAMData(converge,$A18*s_per_year, sigma, nu, omega, 0, nsum, Calcs_pvals_path1_species1))","v":{"$error":"#VALUE!"}},{"$f":" IF(OR(converge=0, RUN_RAM=0),0,RAMData(converge,$A18*s_per_year, sigma, nu, omega, 0, nsum, Calcs_pvals_path1_species2))","v":{"$error":"#VALUE!"}},{"$f":" IF(OR(converge=0, RUN_RAM=0),0,RAMData(converge,$A18*s_per_year, sigma, nu, omega, 0, nsum, Calcs_pvals_path1_species3))","v":{"$error":"#VALUE!"}},{"$f":" IF(OR(converge=0, RUN_RAM=0),0,RAMData(converge,$A18*s_per_year, sigma, nu, omega, 0, nsum, Calcs_pvals_path1_species4))","v":{"$error":"#VALUE!"}}]
[0.8,{"$f":" IF(OR(converge=0, RUN_RAM=0),0,RAMData(converge,$A19*s_per_year, sigma, nu, omega, 0, nsum, Calcs_pvals_path1_species1))","v":{"$error":"#VALUE!"}},{"$f":" IF(OR(converge=0, RUN_RAM=0),0,RAMData(converge,$A19*s_per_year, sigma, nu, omega, 0, nsum, Calcs_pvals_path1_species2))","v":{"$error":"#VALUE!"}},{"$f":" IF(OR(converge=0, RUN_RAM=0),0,RAMData(converge,$A19*s_per_year, sigma, nu, omega, 0, nsum, Calcs_pvals_path1_species3))","v":{"$error":"#VALUE!"}},{"$f":" IF(OR(converge=0, RUN_RAM=0),0,RAMData(converge,$A19*s_per_year, sigma, nu, omega, 0, nsum, Calcs_pvals_path1_species4))","v":{"$error":"#VALUE!"}}]
[0.9,{"$f":" IF(OR(converge=0, RUN_RAM=0),0,RAMData(converge,$A20*s_per_year, sigma, nu, omega, 0, nsum, Calcs_pvals_path1_species1))","v":{"$error":"#VALUE!"}},{"$f":" IF(OR(converge=0, RUN_RAM=0),0,RAMData(converge,$A20*s_per_year, sigma, nu, omega, 0, nsum, Calcs_pvals_path1_species2))","v":{"$error":"#VALUE!"}},{"$f":" IF(OR(converge=0, RUN_RAM=0),0,RAMData(converge,$A20*s_per_year, sigma, nu, omega, 0, nsum, Calcs_pvals_path1_species3))","v":{"$error":"#VALUE!"}},{"$f":" IF(OR(converge=0, RUN_RAM=0),0,RAMData(converge,$A20*s_per_year, sigma, nu, omega, 0, nsum, Calcs_pvals_path1_species4))","v":{"$error":"#VALUE!"}}]
[1,{"$f":" IF(OR(converge=0, RUN_RAM=0),0,RAMData(converge,$A21*s_per_year, sigma, nu, omega, 0, nsum, Calcs_pvals_path1_species1))","v":{"$error":"#VALUE!"}},{"$f":" IF(OR(converge=0, RUN_RAM=0),0,RAMData(converge,$A21*s_per_year, sigma, nu, omega, 0, nsum, Calcs_pvals_path1_species2))","v":{"$error":"#VALUE!"}},{"$f":" IF(OR(converge=0, RUN_RAM=0),0,RAMData(converge,$A21*s_per_year, sigma, nu, omega, 0, nsum, Calcs_pvals_path1_species3))","v":{"$error":"#VALUE!"}},{"$f":" IF(OR(converge=0, RUN_RAM=0),0,RAMData(converge,$A21*s_per_year, sigma, nu, omega, 0, nsum, Calcs_pvals_path1_species4))","v":{"$error":"#VALUE!"}}]
[1.1000000000000001,{"$f":" IF(OR(converge=0, RUN_RAM=0),0,RAMData(converge,$A22*s_per_year, sigma, nu, omega, 0, nsum, Calcs_pvals_path1_species1))","v":{"$error":"#VALUE!"}},{"$f":" IF(OR(converge=0, RUN_RAM=0),0,RAMData(converge,$A22*s_per_year, sigma, nu, omega, 0, nsum, Calcs_pvals_path1_species2))","v":{"$error":"#VALUE!"}},{"$f":" IF(OR(converge=0, RUN_RAM=0),0,RAMData(converge,$A22*s_per_year, sigma, nu, omega, 0, nsum, Calcs_pvals_path1_species3))","v":{"$error":"#VALUE!"}},{"$f":" IF(OR(converge=0, RUN_RAM=0),0,RAMData(converge,$A22*s_per_year, sigma, nu, omega, 0, nsum, Calcs_pvals_path1_species4))","v":{"$error":"#VALUE!"}}]
[1.2,{"$f":" IF(OR(converge=0, RUN_RAM=0),0,RAMData(converge,$A23*s_per_year, sigma, nu, omega, 0, nsum, Calcs_pvals_path1_species1))","v":{"$error":"#VALUE!"}},{"$f":" IF(OR(converge=0, RUN_RAM=0),0,RAMData(converge,$A23*s_per_year, sigma, nu, omega, 0, nsum, Calcs_pvals_path1_species2))","v":{"$error":"#VALUE!"}},{"$f":" IF(OR(converge=0, RUN_RAM=0),0,RAMData(converge,$A23*s_per_year, sigma, nu, omega, 0, nsum, Calcs_pvals_path1_species3))","v":{"$error":"#VALUE!"}},{"$f":" IF(OR(converge=0, RUN_RAM=0),0,RAMData(converge,$A23*s_per_year, sigma, nu, omega, 0, nsum, Calcs_pvals_path1_species4))","v":{"$error":"#VALUE!"}}]
[1.3,{"$f":" IF(OR(converge=0, RUN_RAM=0),0,RAMData(converge,$A24*s_per_year, sigma, nu, omega, 0, nsum, Calcs_pvals_path1_species1))","v":{"$error":"#VALUE!"}},{"$f":" IF(OR(converge=0, RUN_RAM=0),0,RAMData(converge,$A24*s_per_year, sigma, nu, omega, 0, nsum, Calcs_pvals_path1_species2))","v":{"$error":"#VALUE!"}},{"$f":" IF(OR(converge=0, RUN_RAM=0),0,RAMData(converge,$A24*s_per_year, sigma, nu, omega, 0, nsum, Calcs_pvals_path1_species3))","v":{"$error":"#VALUE!"}},{"$f":" IF(OR(converge=0, RUN_RAM=0),0,RAMData(converge,$A24*s_per_year, sigma, nu, omega, 0, nsum, Calcs_pvals_path1_species4))","v":{"$error":"#VALUE!"}}]
[1.4,{"$f":" IF(OR(converge=0, RUN_RAM=0),0,RAMData(converge,$A25*s_per_year, sigma, nu, omega, 0, nsum, Calcs_pvals_path1_species1))","v":{"$error":"#VALUE!"}},{"$f":" IF(OR(converge=0, RUN_RAM=0),0,RAMData(converge,$A25*s_per_year, sigma, nu, omega, 0, nsum, Calcs_pvals_path1_species2))","v":{"$error":"#VALUE!"}},{"$f":" IF(OR(converge=0, RUN_RAM=0),0,RAMData(converge,$A25*s_per_year, sigma, nu, omega, 0, nsum, Calcs_pvals_path1_species3))","v":{"$error":"#VALUE!"}},{"$f":" IF(OR(converge=0, RUN_RAM=0),0,RAMData(converge,$A25*s_per_year, sigma, nu, omega, 0, nsum, Calcs_pvals_path1_species4))","v":{"$error":"#VALUE!"}}]
[1.5,{"$f":" IF(OR(converge=0, RUN_RAM=0),0,RAMData(converge,$A26*s_per_year, sigma, nu, omega, 0, nsum, Calcs_pvals_path1_species1))","v":{"$error":"#VALUE!"}},{"$f":" IF(OR(converge=0, RUN_RAM=0),0,RAMData(converge,$A26*s_per_year, sigma, nu, omega, 0, nsum, Calcs_pvals_path1_species2))","v":{"$error":"#VALUE!"}},{"$f":" IF(OR(converge=0, RUN_RAM=0),0,RAMData(converge,$A26*s_per_year, sigma, nu, omega, 0, nsum, Calcs_pvals_path1_species3))","v":{"$error":"#VALUE!"}},{"$f":" IF(OR(converge=0, RUN_RAM=0),0,RAMData(converge,$A26*s_per_year, sigma, nu, omega, 0, nsum, Calcs_pvals_path1_species4))","v":{"$error":"#VALUE!"}}]
[1.6,{"$f":" IF(OR(converge=0, RUN_RAM=0),0,RAMData(converge,$A27*s_per_year, sigma, nu, omega, 0, nsum, Calcs_pvals_path1_species1))","v":{"$error":"#VALUE!"}},{"$f":" IF(OR(converge=0, RUN_RAM=0),0,RAMData(converge,$A27*s_per_year, sigma, nu, omega, 0, nsum, Calcs_pvals_path1_species2))","v":{"$error":"#VALUE!"}},{"$f":" IF(OR(converge=0, RUN_RAM=0),0,RAMData(converge,$A27*s_per_year, sigma, nu, omega, 0, nsum, Calcs_pvals_path1_species3))","v":{"$error":"#VALUE!"}},{"$f":" IF(OR(converge=0, RUN_RAM=0),0,RAMData(converge,$A27*s_per_year, sigma, nu, omega, 0, nsum, Calcs_pvals_path1_species4))","v":{"$error":"#VALUE!"}}]
[1.7,{"$f":" IF(OR(converge=0, RUN_RAM=0),0,RAMData(converge,$A28*s_per_year, sigma, nu, omega, 0, nsum, Calcs_pvals_path1_species1))","v":{"$error":"#VALUE!"}},{"$f":" IF(OR(converge=0, RUN_RAM=0),0,RAMData(converge,$A28*s_per_year, sigma, nu, omega, 0, nsum, Calcs_pvals_path1_species2))","v":{"$error":"#VALUE!"}},{"$f":" IF(OR(converge=0, RUN_RAM=0),0,RAMData(converge,$A28*s_per_year, sigma, nu, omega, 0, nsum, Calcs_pvals_path1_species3))","v":{"$error":"#VALUE!"}},{"$f":" IF(OR(converge=0, RUN_RAM=0),0,RAMData(converge,$A28*s_per_year, sigma, nu, omega, 0, nsum, Calcs_pvals_path1_species4))","v":{"$error":"#VALUE!"}}]
[1.8,{"$f":" IF(OR(converge=0, RUN_RAM=0),0,RAMData(converge,$A29*s_per_year, sigma, nu, omega, 0, nsum, Calcs_pvals_path1_species1))","v":{"$error":"#VALUE!"}},{"$f":" IF(OR(converge=0, RUN_RAM=0),0,RAMData(converge,$A29*s_per_year, sigma, nu, omega, 0, nsum, Calcs_pvals_path1_species2))","v":{"$error":"#VALUE!"}},{"$f":" IF(OR(converge=0, RUN_RAM=0),0,RAMData(converge,$A29*s_per_year, sigma, nu, omega, 0, nsum, Calcs_pvals_path1_species3))","v":{"$error":"#VALUE!"}},{"$f":" IF(OR(converge=0, RUN_RAM=0),0,RAMData(converge,$A29*s_per_year, sigma, nu, omega, 0, nsum, Calcs_pvals_path1_species4))","v":{"$error":"#VALUE!"}}]
[1.9,{"$f":" IF(OR(converge=0, RUN_RAM=0),0,RAMData(converge,$A30*s_per_year, sigma, nu, omega, 0, nsum, Calcs_pvals_path1_species1))","v":{"$error":"#VALUE!"}},{"$f":" IF(OR(converge=0, RUN_RAM=0),0,RAMData(converge,$A30*s_per_year, sigma, nu, omega, 0, nsum, Calcs_pvals_path1_species2))","v":{"$error":"#VALUE!"}},{"$f":" IF(OR(converge=0, RUN_RAM=0),0,RAMData(converge,$A30*s_per_year, sigma, nu, omega, 0, nsum, Calcs_pvals_path1_species3))","v":{"$error":"#VALUE!"}},{"$f":" IF(OR(converge=0, RUN_RAM=0),0,RAMData(converge,$A30*s_per_year, sigma, nu, omega, 0, nsum, Calcs_pvals_path1_species4))","v":{"$error":"#VALUE!"}}]
[2,{"$f":" IF(OR(converge=0, RUN_RAM=0),0,RAMData(converge,$A31*s_per_year, sigma, nu, omega, 0, nsum, Calcs_pvals_path1_species1))","v":{"$error":"#VALUE!"}},{"$f":" IF(OR(converge=0, RUN_RAM=0),0,RAMData(converge,$A31*s_per_year, sigma, nu, omega, 0, nsum, Calcs_pvals_path1_species2))","v":{"$error":"#VALUE!"}},{"$f":" IF(OR(converge=0, RUN_RAM=0),0,RAMData(converge,$A31*s_per_year, sigma, nu, omega, 0, nsum, Calcs_pvals_path1_species3))","v":{"$error":"#VALUE!"}},{"$f":" IF(OR(converge=0, RUN_RAM=0),0,RAMData(converge,$A31*s_per_year, sigma, nu, omega, 0, nsum, Calcs_pvals_path1_species4))","v":{"$error":"#VALUE!"}}]
[2.1,{"$f":" IF(OR(converge=0, RUN_RAM=0),0,RAMData(converge,$A32*s_per_year, sigma, nu, omega, 0, nsum, Calcs_pvals_path1_species1))","v":{"$error":"#VALUE!"}},{"$f":" IF(OR(converge=0, RUN_RAM=0),0,RAMData(converge,$A32*s_per_year, sigma, nu, omega, 0, nsum, Calcs_pvals_path1_species2))","v":{"$error":"#VALUE!"}},{"$f":" IF(OR(converge=0, RUN_RAM=0),0,RAMData(converge,$A32*s_per_year, sigma, nu, omega, 0, nsum, Calcs_pvals_path1_species3))","v":{"$error":"#VALUE!"}},{"$f":" IF(OR(converge=0, RUN_RAM=0),0,RAMData(converge,$A32*s_per_year, sigma, nu, omega, 0, nsum, Calcs_pvals_path1_species4))","v":{"$error":"#VALUE!"}}]
[2.2000000000000002,{"$f":" IF(OR(converge=0, RUN_RAM=0),0,RAMData(converge,$A33*s_per_year, sigma, nu, omega, 0, nsum, Calcs_pvals_path1_species1))","v":{"$error":"#VALUE!"}},{"$f":" IF(OR(converge=0, RUN_RAM=0),0,RAMData(converge,$A33*s_per_year, sigma, nu, omega, 0, nsum, Calcs_pvals_path1_species2))","v":{"$error":"#VALUE!"}},{"$f":" IF(OR(converge=0, RUN_RAM=0),0,RAMData(converge,$A33*s_per_year, sigma, nu, omega, 0, nsum, Calcs_pvals_path1_species3))","v":{"$error":"#VALUE!"}},{"$f":" IF(OR(converge=0, RUN_RAM=0),0,RAMData(converge,$A33*s_per_year, sigma, nu, omega, 0, nsum, Calcs_pvals_path1_species4))","v":{"$error":"#VALUE!"}}]
[2.2999999999999998,{"$f":" IF(OR(converge=0, RUN_RAM=0),0,RAMData(converge,$A34*s_per_year, sigma, nu, omega, 0, nsum, Calcs_pvals_path1_species1))","v":{"$error":"#VALUE!"}},{"$f":" IF(OR(converge=0, RUN_RAM=0),0,RAMData(converge,$A34*s_per_year, sigma, nu, omega, 0, nsum, Calcs_pvals_path1_species2))","v":{"$error":"#VALUE!"}},{"$f":" IF(OR(converge=0, RUN_RAM=0),0,RAMData(converge,$A34*s_per_year, sigma, nu, omega, 0, nsum, Calcs_pvals_path1_species3))","v":{"$error":"#VALUE!"}},{"$f":" IF(OR(converge=0, RUN_RAM=0),0,RAMData(converge,$A34*s_per_year, sigma, nu, omega, 0, nsum, Calcs_pvals_path1_species4))","v":{"$error":"#VALUE!"}},null,null,"Compared with Background target concentration in mg/L"]
[2.4,{"$f":" IF(OR(converge=0, RUN_RAM=0),0,RAMData(converge,$A35*s_per_year, sigma, nu, omega, 0, nsum, Calcs_pvals_path1_species1))","v":{"$error":"#VALUE!"}},{"$f":" IF(OR(converge=0, RUN_RAM=0),0,RAMData(converge,$A35*s_per_year, sigma, nu, omega, 0, nsum, Calcs_pvals_path1_species2))","v":{"$error":"#VALUE!"}},{"$f":" IF(OR(converge=0, RUN_RAM=0),0,RAMData(converge,$A35*s_per_year, sigma, nu, omega, 0, nsum, Calcs_pvals_path1_species3))","v":{"$error":"#VALUE!"}},{"$f":" IF(OR(converge=0, RUN_RAM=0),0,RAMData(converge,$A35*s_per_year, sigma, nu, omega, 0, nsum, Calcs_pvals_path1_species4))","v":{"$error":"#VALUE!"}},null,null,null,{"$f":"(Quality_Standard_1   Contaminants_Species1)","v":1E-3},null,{"$f":"(Quality_Standard_1   Contaminants_Species2)","v":5.0000000000000001E-4},null,{"$f":"(Quality_Standard_1   Contaminants_Species3)","v":2.0000000000000002E-5},null,{"$f":"(Quality_Standard_1   Contaminants_Species4)","v":2.0000000000000001E-4}]
[2.5,{"$f":" IF(OR(converge=0, RUN_RAM=0),0,RAMData(converge,$A36*s_per_year, sigma, nu, omega, 0, nsum, Calcs_pvals_path1_species1))","v":{"$error":"#VALUE!"}},{"$f":" IF(OR(converge=0, RUN_RAM=0),0,RAMData(converge,$A36*s_per_year, sigma, nu, omega, 0, nsum, Calcs_pvals_path1_species2))","v":{"$error":"#VALUE!"}},{"$f":" IF(OR(converge=0, RUN_RAM=0),0,RAMData(converge,$A36*s_per_year, sigma, nu, omega, 0, nsum, Calcs_pvals_path1_species3))","v":{"$error":"#VALUE!"}},{"$f":" IF(OR(converge=0, RUN_RAM=0),0,RAMData(converge,$A36*s_per_year, sigma, nu, omega, 0, nsum, Calcs_pvals_path1_species4))","v":{"$error":"#VALUE!"}},null,null,null,"Species1",null,"Species2",null,"Species3",null,"Species4"]
[2.6,{"$f":" IF(OR(converge=0, RUN_RAM=0),0,RAMData(converge,$A37*s_per_year, sigma, nu, omega, 0, nsum, Calcs_pvals_path1_species1))","v":{"$error":"#VALUE!"}},{"$f":" IF(OR(converge=0, RUN_RAM=0),0,RAMData(converge,$A37*s_per_year, sigma, nu, omega, 0, nsum, Calcs_pvals_path1_species2))","v":{"$error":"#VALUE!"}},{"$f":" IF(OR(converge=0, RUN_RAM=0),0,RAMData(converge,$A37*s_per_year, sigma, nu, omega, 0, nsum, Calcs_pvals_path1_species3))","v":{"$error":"#VALUE!"}},{"$f":" IF(OR(converge=0, RUN_RAM=0),0,RAMData(converge,$A37*s_per_year, sigma, nu, omega, 0, nsum, Calcs_pvals_path1_species4))","v":{"$error":"#VALUE!"}},null,null,0,1]
[2.7,{"$f":" IF(OR(converge=0, RUN_RAM=0),0,RAMData(converge,$A38*s_per_year, sigma, nu, omega, 0, nsum, Calcs_pvals_path1_species1))","v":{"$error":"#VALUE!"}},{"$f":" IF(OR(converge=0, RUN_RAM=0),0,RAMData(converge,$A38*s_per_year, sigma, nu, omega, 0, nsum, Calcs_pvals_path1_species2))","v":{"$error":"#VALUE!"}},{"$f":" IF(OR(converge=0, RUN_RAM=0),0,RAMData(converge,$A38*s_per_year, sigma, nu, omega, 0, nsum, Calcs_pvals_path1_species3))","v":{"$error":"#VALUE!"}},{"$f":" IF(OR(converge=0, RUN_RAM=0),0,RAMData(converge,$A38*s_per_year, sigma, nu, omega, 0, nsum, Calcs_pvals_path1_species4))","v":{"$error":"#VALUE!"}},null,null,"Time(years)",{"$f":"(Contaminants_Source_determinand_names  Contaminants_Species1)","v":"Cr"},"Time(years)",{"$f":"(Contaminants_Source_determinand_names  Contaminants_Species2)","v":"Phenol"},"Time(years)",{"$f":"(Contaminants_Source_determinand_names  Contaminants_Species3)","v":"Hg"},"Time(years)",{"$f":"(Contaminants_Source_determinand_names  Contaminants_Species4)","v":"Pb"}]
[2.8,{"$f":" IF(OR(converge=0, RUN_RAM=0),0,RAMData(converge,$A39*s_per_year, sigma, nu, omega, 0, nsum, Calcs_pvals_path1_species1))","v":{"$error":"#VALUE!"}},{"$f":" IF(OR(converge=0, RUN_RAM=0),0,RAMData(converge,$A39*s_per_year, sigma, nu, omega, 0, nsum, Calcs_pvals_path1_species2))","v":{"$error":"#VALUE!"}},{"$f":" IF(OR(converge=0, RUN_RAM=0),0,RAMData(converge,$A39*s_per_year, sigma, nu, omega, 0, nsum, Calcs_pvals_path1_species3))","v":{"$error":"#VALUE!"}},{"$f":" IF(OR(converge=0, RUN_RAM=0),0,RAMData(converge,$A39*s_per_year, sigma, nu, omega, 0, nsum, Calcs_pvals_path1_species4))","v":{"$error":"#VALUE!"}},null,null,{"$f":"RAMMaxTime(converge,H$41, sigma, nu, omega, 0, nsum, Calcs_pvals_path1_species1,$H37,H$40,H$41,H$42)/s_per_year","v":{"$error":"#NAME?"}},{"$f":" RAMData(converge,H$39*s_per_year, sigma, nu, omega, 0, nsum, Calcs_pvals_path1_species1)","v":{"$error":"#NAME?"}},{"$f":"RAMMaxTime(converge,J$41, sigma, nu, omega, 0, nsum, Calcs_pvals_path1_species2,$H37,J$40,J$41,J$42)/s_per_year","v":{"$error":"#NAME?"}},{"$f":" RAMData(converge,J$39*s_per_year, sigma, nu, omega, 0, nsum, Calcs_pvals_path1_species2)","v":{"$error":"#NAME?"}},{"$f":"RAMMaxTime(converge,L$41, sigma, nu, omega, 0, nsum, Calcs_pvals_path1_species3,$H37,L$40,L$41,L$42)/s_per_year","v":{"$error":"#NAME?"}},{"$f":" RAMData(converge,L$39*s_per_year, sigma, nu, omega, 0, nsum, Calcs_pvals_path1_species3)","v":{"$error":"#NAME?"}},{"$f":"RAMMaxTime(converge,N$41, sigma, nu, omega, 0, nsum, Calcs_pvals_path1_species4,$H37,N$40,N$41,N$42)/s_per_year","v":{"$error":"#NAME?"}},{"$f":" RAMData(converge,N$39*s_per_year, sigma, nu, omega, 0, nsum, Calcs_pvals_path1_species4)","v":{"$error":"#NAME?"}}]
[2.9,{"$f":" IF(OR(converge=0, RUN_RAM=0),0,RAMData(converge,$A40*s_per_year, sigma, nu, omega, 0, nsum, Calcs_pvals_path1_species1))","v":{"$error":"#VALUE!"}},{"$f":" IF(OR(converge=0, RUN_RAM=0),0,RAMData(converge,$A40*s_per_year, sigma, nu, omega, 0, nsum, Calcs_pvals_path1_species2))","v":{"$error":"#VALUE!"}},{"$f":" IF(OR(converge=0, RUN_RAM=0),0,RAMData(converge,$A40*s_per_year, sigma, nu, omega, 0, nsum, Calcs_pvals_path1_species3))","v":{"$error":"#VALUE!"}},{"$f":" IF(OR(converge=0, RUN_RAM=0),0,RAMData(converge,$A40*s_per_year, sigma, nu, omega, 0, nsum, Calcs_pvals_path1_species4))","v":{"$error":"#VALUE!"}},null,null,1,null,1,null,1,null,1]
[3,{"$f":" IF(OR(converge=0, RUN_RAM=0),0,RAMData(converge,$A41*s_per_year, sigma, nu, omega, 0, nsum, Calcs_pvals_path1_species1))","v":{"$error":"#VALUE!"}},{"$f":" IF(OR(converge=0, RUN_RAM=0),0,RAMData(converge,$A41*s_per_year, sigma, nu, omega, 0, nsum, Calcs_pvals_path1_species2))","v":{"$error":"#VALUE!"}},{"$f":" IF(OR(converge=0, RUN_RAM=0),0,RAMData(converge,$A41*s_per_year, sigma, nu, omega, 0, nsum, Calcs_pvals_path1_species3))","v":{"$error":"#VALUE!"}},{"$f":" IF(OR(converge=0, RUN_RAM=0),0,RAMData(converge,$A41*s_per_year, sigma, nu, omega, 0, nsum, Calcs_pvals_path1_species4))","v":{"$error":"#VALUE!"}},null,null,{"$f":"Attenuation!C33*(Pathways!I10/Pathways!I8)","v":252640626799.19421},null,{"$f":"Attenuation!C63*(Pathways!I10/Pathways!I8)","v":31643077.420368258},null,{"$f":"Attenuation!E93*(Pathways!$I$10/Pathways!$I$8)","v":2460893614356.9102},null,{"$f":"Attenuation!E123*(Pathways!$I$10/Pathways!$I$8)","v":155041643853452.69}]
[3.1,{"$f":" IF(OR(converge=0, RUN_RAM=0),0,RAMData(converge,$A42*s_per_year, sigma, nu, omega, 0, nsum, Calcs_pvals_path1_species1))","v":{"$error":"#VALUE!"}},{"$f":" IF(OR(converge=0, RUN_RAM=0),0,RAMData(converge,$A42*s_per_year, sigma, nu, omega, 0, nsum, Calcs_pvals_path1_species2))","v":{"$error":"#VALUE!"}},{"$f":" IF(OR(converge=0, RUN_RAM=0),0,RAMData(converge,$A42*s_per_year, sigma, nu, omega, 0, nsum, Calcs_pvals_path1_species3))","v":{"$error":"#VALUE!"}},{"$f":" IF(OR(converge=0, RUN_RAM=0),0,RAMData(converge,$A42*s_per_year, sigma, nu, omega, 0, nsum, Calcs_pvals_path1_species4))","v":{"$error":"#VALUE!"}},null,null,9.9999999999999995E-21,null,9.9999999999999995E-21,null,9.9999999999999995E-21,null,9.9999999999999995E-21]
[3.2,{"$f":" IF(OR(converge=0, RUN_RAM=0),0,RAMData(converge,$A43*s_per_year, sigma, nu, omega, 0, nsum, Calcs_pvals_path1_species1))","v":{"$error":"#VALUE!"}},{"$f":" IF(OR(converge=0, RUN_RAM=0),0,RAMData(converge,$A43*s_per_year, sigma, nu, omega, 0, nsum, Calcs_pvals_path1_species2))","v":{"$error":"#VALUE!"}},{"$f":" IF(OR(converge=0, RUN_RAM=0),0,RAMData(converge,$A43*s_per_year, sigma, nu, omega, 0, nsum, Calcs_pvals_path1_species3))","v":{"$error":"#VALUE!"}},{"$f":" IF(OR(converge=0, RUN_RAM=0),0,RAMData(converge,$A43*s_per_year, sigma, nu, omega, 0, nsum, Calcs_pvals_path1_species4))","v":{"$error":"#VALUE!"}},null,null,{"$f":"H41/s_per_year","v":8005.6983674041821},null,{"$f":"J41/s_per_year","v":1.0027086160027461},null,{"$f":"L41/s_per_year","v":77981.012952724865},null,{"$f":"N41/s_per_year","v":4912973.2252596105}]
[3.3,{"$f":" IF(OR(converge=0, RUN_RAM=0),0,RAMData(converge,$A44*s_per_year, sigma, nu, omega, 0, nsum, Calcs_pvals_path1_species1))","v":{"$error":"#VALUE!"}},{"$f":" IF(OR(converge=0, RUN_RAM=0),0,RAMData(converge,$A44*s_per_year, sigma, nu, omega, 0, nsum, Calcs_pvals_path1_species2))","v":{"$error":"#VALUE!"}},{"$f":" IF(OR(converge=0, RUN_RAM=0),0,RAMData(converge,$A44*s_per_year, sigma, nu, omega, 0, nsum, Calcs_pvals_path1_species3))","v":{"$error":"#VALUE!"}},{"$f":" IF(OR(converge=0, RUN_RAM=0),0,RAMData(converge,$A44*s_per_year, sigma, nu, omega, 0, nsum, Calcs_pvals_path1_species4))","v":{"$error":"#VALUE!"}}]
[3.4,{"$f":" IF(OR(converge=0, RUN_RAM=0),0,RAMData(converge,$A45*s_per_year, sigma, nu, omega, 0, nsum, Calcs_pvals_path1_species1))","v":{"$error":"#VALUE!"}},{"$f":" IF(OR(converge=0, RUN_RAM=0),0,RAMData(converge,$A45*s_per_year, sigma, nu, omega, 0, nsum, Calcs_pvals_path1_species2))","v":{"$error":"#VALUE!"}},{"$f":" IF(OR(converge=0, RUN_RAM=0),0,RAMData(converge,$A45*s_per_year, sigma, nu, omega, 0, nsum, Calcs_pvals_path1_species3))","v":{"$error":"#VALUE!"}},{"$f":" IF(OR(converge=0, RUN_RAM=0),0,RAMData(converge,$A45*s_per_year, sigma, nu, omega, 0, nsum, Calcs_pvals_path1_species4))","v":{"$error":"#VALUE!"}}]
[3.5,{"$f":" IF(OR(converge=0, RUN_RAM=0),0,RAMData(converge,$A46*s_per_year, sigma, nu, omega, 0, nsum, Calcs_pvals_path1_species1))","v":{"$error":"#VALUE!"}},{"$f":" IF(OR(converge=0, RUN_RAM=0),0,RAMData(converge,$A46*s_per_year, sigma, nu, omega, 0, nsum, Calcs_pvals_path1_species2))","v":{"$error":"#VALUE!"}},{"$f":" IF(OR(converge=0, RUN_RAM=0),0,RAMData(converge,$A46*s_per_year, sigma, nu, omega, 0, nsum, Calcs_pvals_path1_species3))","v":{"$error":"#VALUE!"}},{"$f":" IF(OR(converge=0, RUN_RAM=0),0,RAMData(converge,$A46*s_per_year, sigma, nu, omega, 0, nsum, Calcs_pvals_path1_species4))","v":{"$error":"#VALUE!"}}]
[3.6,{"$f":" IF(OR(converge=0, RUN_RAM=0),0,RAMData(converge,$A47*s_per_year, sigma, nu, omega, 0, nsum, Calcs_pvals_path1_species1))","v":{"$error":"#VALUE!"}},{"$f":" IF(OR(converge=0, RUN_RAM=0),0,RAMData(converge,$A47*s_per_year, sigma, nu, omega, 0, nsum, Calcs_pvals_path1_species2))","v":{"$error":"#VALUE!"}},{"$f":" IF(OR(converge=0, RUN_RAM=0),0,RAMData(converge,$A47*s_per_year, sigma, nu, omega, 0, nsum, Calcs_pvals_path1_species3))","v":{"$error":"#VALUE!"}},{"$f":" IF(OR(converge=0, RUN_RAM=0),0,RAMData(converge,$A47*s_per_year, sigma, nu, omega, 0, nsum, Calcs_pvals_path1_species4))","v":{"$error":"#VALUE!"}}]
[3.7,{"$f":" IF(OR(converge=0, RUN_RAM=0),0,RAMData(converge,$A48*s_per_year, sigma, nu, omega, 0, nsum, Calcs_pvals_path1_species1))","v":{"$error":"#VALUE!"}},{"$f":" IF(OR(converge=0, RUN_RAM=0),0,RAMData(converge,$A48*s_per_year, sigma, nu, omega, 0, nsum, Calcs_pvals_path1_species2))","v":{"$error":"#VALUE!"}},{"$f":" IF(OR(converge=0, RUN_RAM=0),0,RAMData(converge,$A48*s_per_year, sigma, nu, omega, 0, nsum, Calcs_pvals_path1_species3))","v":{"$error":"#VALUE!"}},{"$f":" IF(OR(converge=0, RUN_RAM=0),0,RAMData(converge,$A48*s_per_year, sigma, nu, omega, 0, nsum, Calcs_pvals_path1_species4))","v":{"$error":"#VALUE!"}}]
[3.8,{"$f":" IF(OR(converge=0, RUN_RAM=0),0,RAMData(converge,$A49*s_per_year, sigma, nu, omega, 0, nsum, Calcs_pvals_path1_species1))","v":{"$error":"#VALUE!"}},{"$f":" IF(OR(converge=0, RUN_RAM=0),0,RAMData(converge,$A49*s_per_year, sigma, nu, omega, 0, nsum, Calcs_pvals_path1_species2))","v":{"$error":"#VALUE!"}},{"$f":" IF(OR(converge=0, RUN_RAM=0),0,RAMData(converge,$A49*s_per_year, sigma, nu, omega, 0, nsum, Calcs_pvals_path1_species3))","v":{"$error":"#VALUE!"}},{"$f":" IF(OR(converge=0, RUN_RAM=0),0,RAMData(converge,$A49*s_per_year, sigma, nu, omega, 0, nsum, Calcs_pvals_path1_species4))","v":{"$error":"#VALUE!"}}]
[3.9,{"$f":" IF(OR(converge=0, RUN_RAM=0),0,RAMData(converge,$A50*s_per_year, sigma, nu, omega, 0, nsum, Calcs_pvals_path1_species1))","v":{"$error":"#VALUE!"}},{"$f":" IF(OR(converge=0, RUN_RAM=0),0,RAMData(converge,$A50*s_per_year, sigma, nu, omega, 0, nsum, Calcs_pvals_path1_species2))","v":{"$error":"#VALUE!"}},{"$f":" IF(OR(converge=0, RUN_RAM=0),0,RAMData(converge,$A50*s_per_year, sigma, nu, omega, 0, nsum, Calcs_pvals_path1_species3))","v":{"$error":"#VALUE!"}},{"$f":" IF(OR(converge=0, RUN_RAM=0),0,RAMData(converge,$A50*s_per_year, sigma, nu, omega, 0, nsum, Calcs_pvals_path1_species4))","v":{"$error":"#VALUE!"}}]
[4,{"$f":" IF(OR(converge=0, RUN_RAM=0),0,RAMData(converge,$A51*s_per_year, sigma, nu, omega, 0, nsum, Calcs_pvals_path1_species1))","v":{"$error":"#VALUE!"}},{"$f":" IF(OR(converge=0, RUN_RAM=0),0,RAMData(converge,$A51*s_per_year, sigma, nu, omega, 0, nsum, Calcs_pvals_path1_species2))","v":{"$error":"#VALUE!"}},{"$f":" IF(OR(converge=0, RUN_RAM=0),0,RAMData(converge,$A51*s_per_year, sigma, nu, omega, 0, nsum, Calcs_pvals_path1_species3))","v":{"$error":"#VALUE!"}},{"$f":" IF(OR(converge=0, RUN_RAM=0),0,RAMData(converge,$A51*s_per_year, sigma, nu, omega, 0, nsum, Calcs_pvals_path1_species4))","v":{"$error":"#VALUE!"}}]
[4.0999999999999996,{"$f":" IF(OR(converge=0, RUN_RAM=0),0,RAMData(converge,$A52*s_per_year, sigma, nu, omega, 0, nsum, Calcs_pvals_path1_species1))","v":{"$error":"#VALUE!"}},{"$f":" IF(OR(converge=0, RUN_RAM=0),0,RAMData(converge,$A52*s_per_year, sigma, nu, omega, 0, nsum, Calcs_pvals_path1_species2))","v":{"$error":"#VALUE!"}},{"$f":" IF(OR(converge=0, RUN_RAM=0),0,RAMData(converge,$A52*s_per_year, sigma, nu, omega, 0, nsum, Calcs_pvals_path1_species3))","v":{"$error":"#VALUE!"}},{"$f":" IF(OR(converge=0, RUN_RAM=0),0,RAMData(converge,$A52*s_per_year, sigma, nu, omega, 0, nsum, Calcs_pvals_path1_species4))","v":{"$error":"#VALUE!"}}]
[4.2,{"$f":" IF(OR(converge=0, RUN_RAM=0),0,RAMData(converge,$A53*s_per_year, sigma, nu, omega, 0, nsum, Calcs_pvals_path1_species1))","v":{"$error":"#VALUE!"}},{"$f":" IF(OR(converge=0, RUN_RAM=0),0,RAMData(converge,$A53*s_per_year, sigma, nu, omega, 0, nsum, Calcs_pvals_path1_species2))","v":{"$error":"#VALUE!"}},{"$f":" IF(OR(converge=0, RUN_RAM=0),0,RAMData(converge,$A53*s_per_year, sigma, nu, omega, 0, nsum, Calcs_pvals_path1_species3))","v":{"$error":"#VALUE!"}},{"$f":" IF(OR(converge=0, RUN_RAM=0),0,RAMData(converge,$A53*s_per_year, sigma, nu, omega, 0, nsum, Calcs_pvals_path1_species4))","v":{"$error":"#VALUE!"}}]
[4.3,{"$f":" IF(OR(converge=0, RUN_RAM=0),0,RAMData(converge,$A54*s_per_year, sigma, nu, omega, 0, nsum, Calcs_pvals_path1_species1))","v":{"$error":"#VALUE!"}},{"$f":" IF(OR(converge=0, RUN_RAM=0),0,RAMData(converge,$A54*s_per_year, sigma, nu, omega, 0, nsum, Calcs_pvals_path1_species2))","v":{"$error":"#VALUE!"}},{"$f":" IF(OR(converge=0, RUN_RAM=0),0,RAMData(converge,$A54*s_per_year, sigma, nu, omega, 0, nsum, Calcs_pvals_path1_species3))","v":{"$error":"#VALUE!"}},{"$f":" IF(OR(converge=0, RUN_RAM=0),0,RAMData(converge,$A54*s_per_year, sigma, nu, omega, 0, nsum, Calcs_pvals_path1_species4))","v":{"$error":"#VALUE!"}}]
[4.4000000000000004,{"$f":" IF(OR(converge=0, RUN_RAM=0),0,RAMData(converge,$A55*s_per_year, sigma, nu, omega, 0, nsum, Calcs_pvals_path1_species1))","v":{"$error":"#VALUE!"}},{"$f":" IF(OR(converge=0, RUN_RAM=0),0,RAMData(converge,$A55*s_per_year, sigma, nu, omega, 0, nsum, Calcs_pvals_path1_species2))","v":{"$error":"#VALUE!"}},{"$f":" IF(OR(converge=0, RUN_RAM=0),0,RAMData(converge,$A55*s_per_year, sigma, nu, omega, 0, nsum, Calcs_pvals_path1_species3))","v":{"$error":"#VALUE!"}},{"$f":" IF(OR(converge=0, RUN_RAM=0),0,RAMData(converge,$A55*s_per_year, sigma, nu, omega, 0, nsum, Calcs_pvals_path1_species4))","v":{"$error":"#VALUE!"}}]
[4.5,{"$f":" IF(OR(converge=0, RUN_RAM=0),0,RAMData(converge,$A56*s_per_year, sigma, nu, omega, 0, nsum, Calcs_pvals_path1_species1))","v":{"$error":"#VALUE!"}},{"$f":" IF(OR(converge=0, RUN_RAM=0),0,RAMData(converge,$A56*s_per_year, sigma, nu, omega, 0, nsum, Calcs_pvals_path1_species2))","v":{"$error":"#VALUE!"}},{"$f":" IF(OR(converge=0, RUN_RAM=0),0,RAMData(converge,$A56*s_per_year, sigma, nu, omega, 0, nsum, Calcs_pvals_path1_species3))","v":{"$error":"#VALUE!"}},{"$f":" IF(OR(converge=0, RUN_RAM=0),0,RAMData(converge,$A56*s_per_year, sigma, nu, omega, 0, nsum, Calcs_pvals_path1_species4))","v":{"$error":"#VALUE!"}}]
[4.5999999999999996,{"$f":" IF(OR(converge=0, RUN_RAM=0),0,RAMData(converge,$A57*s_per_year, sigma, nu, omega, 0, nsum, Calcs_pvals_path1_species1))","v":{"$error":"#VALUE!"}},{"$f":" IF(OR(converge=0, RUN_RAM=0),0,RAMData(converge,$A57*s_per_year, sigma, nu, omega, 0, nsum, Calcs_pvals_path1_species2))","v":{"$error":"#VALUE!"}},{"$f":" IF(OR(converge=0, RUN_RAM=0),0,RAMData(converge,$A57*s_per_year, sigma, nu, omega, 0, nsum, Calcs_pvals_path1_species3))","v":{"$error":"#VALUE!"}},{"$f":" IF(OR(converge=0, RUN_RAM=0),0,RAMData(converge,$A57*s_per_year, sigma, nu, omega, 0, nsum, Calcs_pvals_path1_species4))","v":{"$error":"#VALUE!"}}]
[4.7,{"$f":" IF(OR(converge=0, RUN_RAM=0),0,RAMData(converge,$A58*s_per_year, sigma, nu, omega, 0, nsum, Calcs_pvals_path1_species1))","v":{"$error":"#VALUE!"}},{"$f":" IF(OR(converge=0, RUN_RAM=0),0,RAMData(converge,$A58*s_per_year, sigma, nu, omega, 0, nsum, Calcs_pvals_path1_species2))","v":{"$error":"#VALUE!"}},{"$f":" IF(OR(converge=0, RUN_RAM=0),0,RAMData(converge,$A58*s_per_year, sigma, nu, omega, 0, nsum, Calcs_pvals_path1_species3))","v":{"$error":"#VALUE!"}},{"$f":" IF(OR(converge=0, RUN_RAM=0),0,RAMData(converge,$A58*s_per_year, sigma, nu, omega, 0, nsum, Calcs_pvals_path1_species4))","v":{"$error":"#VALUE!"}}]
[4.8,{"$f":" IF(OR(converge=0, RUN_RAM=0),0,RAMData(converge,$A59*s_per_year, sigma, nu, omega, 0, nsum, Calcs_pvals_path1_species1))","v":{"$error":"#VALUE!"}},{"$f":" IF(OR(converge=0, RUN_RAM=0),0,RAMData(converge,$A59*s_per_year, sigma, nu, omega, 0, nsum, Calcs_pvals_path1_species2))","v":{"$error":"#VALUE!"}},{"$f":" IF(OR(converge=0, RUN_RAM=0),0,RAMData(converge,$A59*s_per_year, sigma, nu, omega, 0, nsum, Calcs_pvals_path1_species3))","v":{"$error":"#VALUE!"}},{"$f":" IF(OR(converge=0, RUN_RAM=0),0,RAMData(converge,$A59*s_per_year, sigma, nu, omega, 0, nsum, Calcs_pvals_path1_species4))","v":{"$error":"#VALUE!"}}]
[4.9000000000000004,{"$f":" IF(OR(converge=0, RUN_RAM=0),0,RAMData(converge,$A60*s_per_year, sigma, nu, omega, 0, nsum, Calcs_pvals_path1_species1))","v":{"$error":"#VALUE!"}},{"$f":" IF(OR(converge=0, RUN_RAM=0),0,RAMData(converge,$A60*s_per_year, sigma, nu, omega, 0, nsum, Calcs_pvals_path1_species2))","v":{"$error":"#VALUE!"}},{"$f":" IF(OR(converge=0, RUN_RAM=0),0,RAMData(converge,$A60*s_per_year, sigma, nu, omega, 0, nsum, Calcs_pvals_path1_species3))","v":{"$error":"#VALUE!"}},{"$f":" IF(OR(converge=0, RUN_RAM=0),0,RAMData(converge,$A60*s_per_year, sigma, nu, omega, 0, nsum, Calcs_pvals_path1_species4))","v":{"$error":"#VALUE!"}}]
[5,{"$f":" IF(OR(converge=0, RUN_RAM=0),0,RAMData(converge,$A61*s_per_year, sigma, nu, omega, 0, nsum, Calcs_pvals_path1_species1))","v":{"$error":"#VALUE!"}},{"$f":" IF(OR(converge=0, RUN_RAM=0),0,RAMData(converge,$A61*s_per_year, sigma, nu, omega, 0, nsum, Calcs_pvals_path1_species2))","v":{"$error":"#VALUE!"}},{"$f":" IF(OR(converge=0, RUN_RAM=0),0,RAMData(converge,$A61*s_per_year, sigma, nu, omega, 0, nsum, Calcs_pvals_path1_species3))","v":{"$error":"#VALUE!"}},{"$f":" IF(OR(converge=0, RUN_RAM=0),0,RAMData(converge,$A61*s_per_year, sigma, nu, omega, 0, nsum, Calcs_pvals_path1_species4))","v":{"$error":"#VALUE!"}}]
[5.0999999999999996,{"$f":" IF(OR(converge=0, RUN_RAM=0),0,RAMData(converge,$A62*s_per_year, sigma, nu, omega, 0, nsum, Calcs_pvals_path1_species1))","v":{"$error":"#VALUE!"}},{"$f":" IF(OR(converge=0, RUN_RAM=0),0,RAMData(converge,$A62*s_per_year, sigma, nu, omega, 0, nsum, Calcs_pvals_path1_species2))","v":{"$error":"#VALUE!"}},{"$f":" IF(OR(converge=0, RUN_RAM=0),0,RAMData(converge,$A62*s_per_year, sigma, nu, omega, 0, nsum, Calcs_pvals_path1_species3))","v":{"$error":"#VALUE!"}},{"$f":" IF(OR(converge=0, RUN_RAM=0),0,RAMData(converge,$A62*s_per_year, sigma, nu, omega, 0, nsum, Calcs_pvals_path1_species4))","v":{"$error":"#VALUE!"}}]
[5.2,{"$f":" IF(OR(converge=0, RUN_RAM=0),0,RAMData(converge,$A63*s_per_year, sigma, nu, omega, 0, nsum, Calcs_pvals_path1_species1))","v":{"$error":"#VALUE!"}},{"$f":" IF(OR(converge=0, RUN_RAM=0),0,RAMData(converge,$A63*s_per_year, sigma, nu, omega, 0, nsum, Calcs_pvals_path1_species2))","v":{"$error":"#VALUE!"}},{"$f":" IF(OR(converge=0, RUN_RAM=0),0,RAMData(converge,$A63*s_per_year, sigma, nu, omega, 0, nsum, Calcs_pvals_path1_species3))","v":{"$error":"#VALUE!"}},{"$f":" IF(OR(converge=0, RUN_RAM=0),0,RAMData(converge,$A63*s_per_year, sigma, nu, omega, 0, nsum, Calcs_pvals_path1_species4))","v":{"$error":"#VALUE!"}}]
[5.3,{"$f":" IF(OR(converge=0, RUN_RAM=0),0,RAMData(converge,$A64*s_per_year, sigma, nu, omega, 0, nsum, Calcs_pvals_path1_species1))","v":{"$error":"#VALUE!"}},{"$f":" IF(OR(converge=0, RUN_RAM=0),0,RAMData(converge,$A64*s_per_year, sigma, nu, omega, 0, nsum, Calcs_pvals_path1_species2))","v":{"$error":"#VALUE!"}},{"$f":" IF(OR(converge=0, RUN_RAM=0),0,RAMData(converge,$A64*s_per_year, sigma, nu, omega, 0, nsum, Calcs_pvals_path1_species3))","v":{"$error":"#VALUE!"}},{"$f":" IF(OR(converge=0, RUN_RAM=0),0,RAMData(converge,$A64*s_per_year, sigma, nu, omega, 0, nsum, Calcs_pvals_path1_species4))","v":{"$error":"#VALUE!"}}]
[5.4,{"$f":" IF(OR(converge=0, RUN_RAM=0),0,RAMData(converge,$A65*s_per_year, sigma, nu, omega, 0, nsum, Calcs_pvals_path1_species1))","v":{"$error":"#VALUE!"}},{"$f":" IF(OR(converge=0, RUN_RAM=0),0,RAMData(converge,$A65*s_per_year, sigma, nu, omega, 0, nsum, Calcs_pvals_path1_species2))","v":{"$error":"#VALUE!"}},{"$f":" IF(OR(converge=0, RUN_RAM=0),0,RAMData(converge,$A65*s_per_year, sigma, nu, omega, 0, nsum, Calcs_pvals_path1_species3))","v":{"$error":"#VALUE!"}},{"$f":" IF(OR(converge=0, RUN_RAM=0),0,RAMData(converge,$A65*s_per_year, sigma, nu, omega, 0, nsum, Calcs_pvals_path1_species4))","v":{"$error":"#VALUE!"}}]
[5.5,{"$f":" IF(OR(converge=0, RUN_RAM=0),0,RAMData(converge,$A66*s_per_year, sigma, nu, omega, 0, nsum, Calcs_pvals_path1_species1))","v":{"$error":"#VALUE!"}},{"$f":" IF(OR(converge=0, RUN_RAM=0),0,RAMData(converge,$A66*s_per_year, sigma, nu, omega, 0, nsum, Calcs_pvals_path1_species2))","v":{"$error":"#VALUE!"}},{"$f":" IF(OR(converge=0, RUN_RAM=0),0,RAMData(converge,$A66*s_per_year, sigma, nu, omega, 0, nsum, Calcs_pvals_path1_species3))","v":{"$error":"#VALUE!"}},{"$f":" IF(OR(converge=0, RUN_RAM=0),0,RAMData(converge,$A66*s_per_year, sigma, nu, omega, 0, nsum, Calcs_pvals_path1_species4))","v":{"$error":"#VALUE!"}}]
[5.6,{"$f":" IF(OR(converge=0, RUN_RAM=0),0,RAMData(converge,$A67*s_per_year, sigma, nu, omega, 0, nsum, Calcs_pvals_path1_species1))","v":{"$error":"#VALUE!"}},{"$f":" IF(OR(converge=0, RUN_RAM=0),0,RAMData(converge,$A67*s_per_year, sigma, nu, omega, 0, nsum, Calcs_pvals_path1_species2))","v":{"$error":"#VALUE!"}},{"$f":" IF(OR(converge=0, RUN_RAM=0),0,RAMData(converge,$A67*s_per_year, sigma, nu, omega, 0, nsum, Calcs_pvals_path1_species3))","v":{"$error":"#VALUE!"}},{"$f":" IF(OR(converge=0, RUN_RAM=0),0,RAMData(converge,$A67*s_per_year, sigma, nu, omega, 0, nsum, Calcs_pvals_path1_species4))","v":{"$error":"#VALUE!"}}]
[5.7,{"$f":" IF(OR(converge=0, RUN_RAM=0),0,RAMData(converge,$A68*s_per_year, sigma, nu, omega, 0, nsum, Calcs_pvals_path1_species1))","v":{"$error":"#VALUE!"}},{"$f":" IF(OR(converge=0, RUN_RAM=0),0,RAMData(converge,$A68*s_per_year, sigma, nu, omega, 0, nsum, Calcs_pvals_path1_species2))","v":{"$error":"#VALUE!"}},{"$f":" IF(OR(converge=0, RUN_RAM=0),0,RAMData(converge,$A68*s_per_year, sigma, nu, omega, 0, nsum, Calcs_pvals_path1_species3))","v":{"$error":"#VALUE!"}},{"$f":" IF(OR(converge=0, RUN_RAM=0),0,RAMData(converge,$A68*s_per_year, sigma, nu, omega, 0, nsum, Calcs_pvals_path1_species4))","v":{"$error":"#VALUE!"}}]
[5.8,{"$f":" IF(OR(converge=0, RUN_RAM=0),0,RAMData(converge,$A69*s_per_year, sigma, nu, omega, 0, nsum, Calcs_pvals_path1_species1))","v":{"$error":"#VALUE!"}},{"$f":" IF(OR(converge=0, RUN_RAM=0),0,RAMData(converge,$A69*s_per_year, sigma, nu, omega, 0, nsum, Calcs_pvals_path1_species2))","v":{"$error":"#VALUE!"}},{"$f":" IF(OR(converge=0, RUN_RAM=0),0,RAMData(converge,$A69*s_per_year, sigma, nu, omega, 0, nsum, Calcs_pvals_path1_species3))","v":{"$error":"#VALUE!"}},{"$f":" IF(OR(converge=0, RUN_RAM=0),0,RAMData(converge,$A69*s_per_year, sigma, nu, omega, 0, nsum, Calcs_pvals_path1_species4))","v":{"$error":"#VALUE!"}}]
[5.9,{"$f":" IF(OR(converge=0, RUN_RAM=0),0,RAMData(converge,$A70*s_per_year, sigma, nu, omega, 0, nsum, Calcs_pvals_path1_species1))","v":{"$error":"#VALUE!"}},{"$f":" IF(OR(converge=0, RUN_RAM=0),0,RAMData(converge,$A70*s_per_year, sigma, nu, omega, 0, nsum, Calcs_pvals_path1_species2))","v":{"$error":"#VALUE!"}},{"$f":" IF(OR(converge=0, RUN_RAM=0),0,RAMData(converge,$A70*s_per_year, sigma, nu, omega, 0, nsum, Calcs_pvals_path1_species3))","v":{"$error":"#VALUE!"}},{"$f":" IF(OR(converge=0, RUN_RAM=0),0,RAMData(converge,$A70*s_per_year, sigma, nu, omega, 0, nsum, Calcs_pvals_path1_species4))","v":{"$error":"#VALUE!"}}]
[6,{"$f":" IF(OR(converge=0, RUN_RAM=0),0,RAMData(converge,$A71*s_per_year, sigma, nu, omega, 0, nsum, Calcs_pvals_path1_species1))","v":{"$error":"#VALUE!"}},{"$f":" IF(OR(converge=0, RUN_RAM=0),0,RAMData(converge,$A71*s_per_year, sigma, nu, omega, 0, nsum, Calcs_pvals_path1_species2))","v":{"$error":"#VALUE!"}},{"$f":" IF(OR(converge=0, RUN_RAM=0),0,RAMData(converge,$A71*s_per_year, sigma, nu, omega, 0, nsum, Calcs_pvals_path1_species3))","v":{"$error":"#VALUE!"}},{"$f":" IF(OR(converge=0, RUN_RAM=0),0,RAMData(converge,$A71*s_per_year, sigma, nu, omega, 0, nsum, Calcs_pvals_path1_species4))","v":{"$error":"#VALUE!"}}]
[6.1,{"$f":" IF(OR(converge=0, RUN_RAM=0),0,RAMData(converge,$A72*s_per_year, sigma, nu, omega, 0, nsum, Calcs_pvals_path1_species1))","v":{"$error":"#VALUE!"}},{"$f":" IF(OR(converge=0, RUN_RAM=0),0,RAMData(converge,$A72*s_per_year, sigma, nu, omega, 0, nsum, Calcs_pvals_path1_species2))","v":{"$error":"#VALUE!"}},{"$f":" IF(OR(converge=0, RUN_RAM=0),0,RAMData(converge,$A72*s_per_year, sigma, nu, omega, 0, nsum, Calcs_pvals_path1_species3))","v":{"$error":"#VALUE!"}},{"$f":" IF(OR(converge=0, RUN_RAM=0),0,RAMData(converge,$A72*s_per_year, sigma, nu, omega, 0, nsum, Calcs_pvals_path1_species4))","v":{"$error":"#VALUE!"}}]
[6.2,{"$f":" IF(OR(converge=0, RUN_RAM=0),0,RAMData(converge,$A73*s_per_year, sigma, nu, omega, 0, nsum, Calcs_pvals_path1_species1))","v":{"$error":"#VALUE!"}},{"$f":" IF(OR(converge=0, RUN_RAM=0),0,RAMData(converge,$A73*s_per_year, sigma, nu, omega, 0, nsum, Calcs_pvals_path1_species2))","v":{"$error":"#VALUE!"}},{"$f":" IF(OR(converge=0, RUN_RAM=0),0,RAMData(converge,$A73*s_per_year, sigma, nu, omega, 0, nsum, Calcs_pvals_path1_species3))","v":{"$error":"#VALUE!"}},{"$f":" IF(OR(converge=0, RUN_RAM=0),0,RAMData(converge,$A73*s_per_year, sigma, nu, omega, 0, nsum, Calcs_pvals_path1_species4))","v":{"$error":"#VALUE!"}}]
[6.3,{"$f":" IF(OR(converge=0, RUN_RAM=0),0,RAMData(converge,$A74*s_per_year, sigma, nu, omega, 0, nsum, Calcs_pvals_path1_species1))","v":{"$error":"#VALUE!"}},{"$f":" IF(OR(converge=0, RUN_RAM=0),0,RAMData(converge,$A74*s_per_year, sigma, nu, omega, 0, nsum, Calcs_pvals_path1_species2))","v":{"$error":"#VALUE!"}},{"$f":" IF(OR(converge=0, RUN_RAM=0),0,RAMData(converge,$A74*s_per_year, sigma, nu, omega, 0, nsum, Calcs_pvals_path1_species3))","v":{"$error":"#VALUE!"}},{"$f":" IF(OR(converge=0, RUN_RAM=0),0,RAMData(converge,$A74*s_per_year, sigma, nu, omega, 0, nsum, Calcs_pvals_path1_species4))","v":{"$error":"#VALUE!"}}]
[6.4,{"$f":" IF(OR(converge=0, RUN_RAM=0),0,RAMData(converge,$A75*s_per_year, sigma, nu, omega, 0, nsum, Calcs_pvals_path1_species1))","v":{"$error":"#VALUE!"}},{"$f":" IF(OR(converge=0, RUN_RAM=0),0,RAMData(converge,$A75*s_per_year, sigma, nu, omega, 0, nsum, Calcs_pvals_path1_species2))","v":{"$error":"#VALUE!"}},{"$f":" IF(OR(converge=0, RUN_RAM=0),0,RAMData(converge,$A75*s_per_year, sigma, nu, omega, 0, nsum, Calcs_pvals_path1_species3))","v":{"$error":"#VALUE!"}},{"$f":" IF(OR(converge=0, RUN_RAM=0),0,RAMData(converge,$A75*s_per_year, sigma, nu, omega, 0, nsum, Calcs_pvals_path1_species4))","v":{"$error":"#VALUE!"}}]
[6.5,{"$f":" IF(OR(converge=0, RUN_RAM=0),0,RAMData(converge,$A76*s_per_year, sigma, nu, omega, 0, nsum, Calcs_pvals_path1_species1))","v":{"$error":"#VALUE!"}},{"$f":" IF(OR(converge=0, RUN_RAM=0),0,RAMData(converge,$A76*s_per_year, sigma, nu, omega, 0, nsum, Calcs_pvals_path1_species2))","v":{"$error":"#VALUE!"}},{"$f":" IF(OR(converge=0, RUN_RAM=0),0,RAMData(converge,$A76*s_per_year, sigma, nu, omega, 0, nsum, Calcs_pvals_path1_species3))","v":{"$error":"#VALUE!"}},{"$f":" IF(OR(converge=0, RUN_RAM=0),0,RAMData(converge,$A76*s_per_year, sigma, nu, omega, 0, nsum, Calcs_pvals_path1_species4))","v":{"$error":"#VALUE!"}}]
[6.6,{"$f":" IF(OR(converge=0, RUN_RAM=0),0,RAMData(converge,$A77*s_per_year, sigma, nu, omega, 0, nsum, Calcs_pvals_path1_species1))","v":{"$error":"#VALUE!"}},{"$f":" IF(OR(converge=0, RUN_RAM=0),0,RAMData(converge,$A77*s_per_year, sigma, nu, omega, 0, nsum, Calcs_pvals_path1_species2))","v":{"$error":"#VALUE!"}},{"$f":" IF(OR(converge=0, RUN_RAM=0),0,RAMData(converge,$A77*s_per_year, sigma, nu, omega, 0, nsum, Calcs_pvals_path1_species3))","v":{"$error":"#VALUE!"}},{"$f":" IF(OR(converge=0, RUN_RAM=0),0,RAMData(converge,$A77*s_per_year, sigma, nu, omega, 0, nsum, Calcs_pvals_path1_species4))","v":{"$error":"#VALUE!"}}]
[6.7,{"$f":" IF(OR(converge=0, RUN_RAM=0),0,RAMData(converge,$A78*s_per_year, sigma, nu, omega, 0, nsum, Calcs_pvals_path1_species1))","v":{"$error":"#VALUE!"}},{"$f":" IF(OR(converge=0, RUN_RAM=0),0,RAMData(converge,$A78*s_per_year, sigma, nu, omega, 0, nsum, Calcs_pvals_path1_species2))","v":{"$error":"#VALUE!"}},{"$f":" IF(OR(converge=0, RUN_RAM=0),0,RAMData(converge,$A78*s_per_year, sigma, nu, omega, 0, nsum, Calcs_pvals_path1_species3))","v":{"$error":"#VALUE!"}},{"$f":" IF(OR(converge=0, RUN_RAM=0),0,RAMData(converge,$A78*s_per_year, sigma, nu, omega, 0, nsum, Calcs_pvals_path1_species4))","v":{"$error":"#VALUE!"}}]
[6.8,{"$f":" IF(OR(converge=0, RUN_RAM=0),0,RAMData(converge,$A79*s_per_year, sigma, nu, omega, 0, nsum, Calcs_pvals_path1_species1))","v":{"$error":"#VALUE!"}},{"$f":" IF(OR(converge=0, RUN_RAM=0),0,RAMData(converge,$A79*s_per_year, sigma, nu, omega, 0, nsum, Calcs_pvals_path1_species2))","v":{"$error":"#VALUE!"}},{"$f":" IF(OR(converge=0, RUN_RAM=0),0,RAMData(converge,$A79*s_per_year, sigma, nu, omega, 0, nsum, Calcs_pvals_path1_species3))","v":{"$error":"#VALUE!"}},{"$f":" IF(OR(converge=0, RUN_RAM=0),0,RAMData(converge,$A79*s_per_year, sigma, nu, omega, 0, nsum, Calcs_pvals_path1_species4))","v":{"$error":"#VALUE!"}}]
[6.9,{"$f":" IF(OR(converge=0, RUN_RAM=0),0,RAMData(converge,$A80*s_per_year, sigma, nu, omega, 0, nsum, Calcs_pvals_path1_species1))","v":{"$error":"#VALUE!"}},{"$f":" IF(OR(converge=0, RUN_RAM=0),0,RAMData(converge,$A80*s_per_year, sigma, nu, omega, 0, nsum, Calcs_pvals_path1_species2))","v":{"$error":"#VALUE!"}},{"$f":" IF(OR(converge=0, RUN_RAM=0),0,RAMData(converge,$A80*s_per_year, sigma, nu, omega, 0, nsum, Calcs_pvals_path1_species3))","v":{"$error":"#VALUE!"}},{"$f":" IF(OR(converge=0, RUN_RAM=0),0,RAMData(converge,$A80*s_per_year, sigma, nu, omega, 0, nsum, Calcs_pvals_path1_species4))","v":{"$error":"#VALUE!"}}]
[7,{"$f":" IF(OR(converge=0, RUN_RAM=0),0,RAMData(converge,$A81*s_per_year, sigma, nu, omega, 0, nsum, Calcs_pvals_path1_species1))","v":{"$error":"#VALUE!"}},{"$f":" IF(OR(converge=0, RUN_RAM=0),0,RAMData(converge,$A81*s_per_year, sigma, nu, omega, 0, nsum, Calcs_pvals_path1_species2))","v":{"$error":"#VALUE!"}},{"$f":" IF(OR(converge=0, RUN_RAM=0),0,RAMData(converge,$A81*s_per_year, sigma, nu, omega, 0, nsum, Calcs_pvals_path1_species3))","v":{"$error":"#VALUE!"}},{"$f":" IF(OR(converge=0, RUN_RAM=0),0,RAMData(converge,$A81*s_per_year, sigma, nu, omega, 0, nsum, Calcs_pvals_path1_species4))","v":{"$error":"#VALUE!"}}]
[7.1,{"$f":" IF(OR(converge=0, RUN_RAM=0),0,RAMData(converge,$A82*s_per_year, sigma, nu, omega, 0, nsum, Calcs_pvals_path1_species1))","v":{"$error":"#VALUE!"}},{"$f":" IF(OR(converge=0, RUN_RAM=0),0,RAMData(converge,$A82*s_per_year, sigma, nu, omega, 0, nsum, Calcs_pvals_path1_species2))","v":{"$error":"#VALUE!"}},{"$f":" IF(OR(converge=0, RUN_RAM=0),0,RAMData(converge,$A82*s_per_year, sigma, nu, omega, 0, nsum, Calcs_pvals_path1_species3))","v":{"$error":"#VALUE!"}},{"$f":" IF(OR(converge=0, RUN_RAM=0),0,RAMData(converge,$A82*s_per_year, sigma, nu, omega, 0, nsum, Calcs_pvals_path1_species4))","v":{"$error":"#VALUE!"}}]
[7.2,{"$f":" IF(OR(converge=0, RUN_RAM=0),0,RAMData(converge,$A83*s_per_year, sigma, nu, omega, 0, nsum, Calcs_pvals_path1_species1))","v":{"$error":"#VALUE!"}},{"$f":" IF(OR(converge=0, RUN_RAM=0),0,RAMData(converge,$A83*s_per_year, sigma, nu, omega, 0, nsum, Calcs_pvals_path1_species2))","v":{"$error":"#VALUE!"}},{"$f":" IF(OR(converge=0, RUN_RAM=0),0,RAMData(converge,$A83*s_per_year, sigma, nu, omega, 0, nsum, Calcs_pvals_path1_species3))","v":{"$error":"#VALUE!"}},{"$f":" IF(OR(converge=0, RUN_RAM=0),0,RAMData(converge,$A83*s_per_year, sigma, nu, omega, 0, nsum, Calcs_pvals_path1_species4))","v":{"$error":"#VALUE!"}}]
[7.3,{"$f":" IF(OR(converge=0, RUN_RAM=0),0,RAMData(converge,$A84*s_per_year, sigma, nu, omega, 0, nsum, Calcs_pvals_path1_species1))","v":{"$error":"#VALUE!"}},{"$f":" IF(OR(converge=0, RUN_RAM=0),0,RAMData(converge,$A84*s_per_year, sigma, nu, omega, 0, nsum, Calcs_pvals_path1_species2))","v":{"$error":"#VALUE!"}},{"$f":" IF(OR(converge=0, RUN_RAM=0),0,RAMData(converge,$A84*s_per_year, sigma, nu, omega, 0, nsum, Calcs_pvals_path1_species3))","v":{"$error":"#VALUE!"}},{"$f":" IF(OR(converge=0, RUN_RAM=0),0,RAMData(converge,$A84*s_per_year, sigma, nu, omega, 0, nsum, Calcs_pvals_path1_species4))","v":{"$error":"#VALUE!"}}]
[7.4,{"$f":" IF(OR(converge=0, RUN_RAM=0),0,RAMData(converge,$A85*s_per_year, sigma, nu, omega, 0, nsum, Calcs_pvals_path1_species1))","v":{"$error":"#VALUE!"}},{"$f":" IF(OR(converge=0, RUN_RAM=0),0,RAMData(converge,$A85*s_per_year, sigma, nu, omega, 0, nsum, Calcs_pvals_path1_species2))","v":{"$error":"#VALUE!"}},{"$f":" IF(OR(converge=0, RUN_RAM=0),0,RAMData(converge,$A85*s_per_year, sigma, nu, omega, 0, nsum, Calcs_pvals_path1_species3))","v":{"$error":"#VALUE!"}},{"$f":" IF(OR(converge=0, RUN_RAM=0),0,RAMData(converge,$A85*s_per_year, sigma, nu, omega, 0, nsum, Calcs_pvals_path1_species4))","v":{"$error":"#VALUE!"}}]
[7.5,{"$f":" IF(OR(converge=0, RUN_RAM=0),0,RAMData(converge,$A86*s_per_year, sigma, nu, omega, 0, nsum, Calcs_pvals_path1_species1))","v":{"$error":"#VALUE!"}},{"$f":" IF(OR(converge=0, RUN_RAM=0),0,RAMData(converge,$A86*s_per_year, sigma, nu, omega, 0, nsum, Calcs_pvals_path1_species2))","v":{"$error":"#VALUE!"}},{"$f":" IF(OR(converge=0, RUN_RAM=0),0,RAMData(converge,$A86*s_per_year, sigma, nu, omega, 0, nsum, Calcs_pvals_path1_species3))","v":{"$error":"#VALUE!"}},{"$f":" IF(OR(converge=0, RUN_RAM=0),0,RAMData(converge,$A86*s_per_year, sigma, nu, omega, 0, nsum, Calcs_pvals_path1_species4))","v":{"$error":"#VALUE!"}}]
[7.6,{"$f":" IF(OR(converge=0, RUN_RAM=0),0,RAMData(converge,$A87*s_per_year, sigma, nu, omega, 0, nsum, Calcs_pvals_path1_species1))","v":{"$error":"#VALUE!"}},{"$f":" IF(OR(converge=0, RUN_RAM=0),0,RAMData(converge,$A87*s_per_year, sigma, nu, omega, 0, nsum, Calcs_pvals_path1_species2))","v":{"$error":"#VALUE!"}},{"$f":" IF(OR(converge=0, RUN_RAM=0),0,RAMData(converge,$A87*s_per_year, sigma, nu, omega, 0, nsum, Calcs_pvals_path1_species3))","v":{"$error":"#VALUE!"}},{"$f":" IF(OR(converge=0, RUN_RAM=0),0,RAMData(converge,$A87*s_per_year, sigma, nu, omega, 0, nsum, Calcs_pvals_path1_species4))","v":{"$error":"#VALUE!"}}]
[7.7,{"$f":" IF(OR(converge=0, RUN_RAM=0),0,RAMData(converge,$A88*s_per_year, sigma, nu, omega, 0, nsum, Calcs_pvals_path1_species1))","v":{"$error":"#VALUE!"}},{"$f":" IF(OR(converge=0, RUN_RAM=0),0,RAMData(converge,$A88*s_per_year, sigma, nu, omega, 0, nsum, Calcs_pvals_path1_species2))","v":{"$error":"#VALUE!"}},{"$f":" IF(OR(converge=0, RUN_RAM=0),0,RAMData(converge,$A88*s_per_year, sigma, nu, omega, 0, nsum, Calcs_pvals_path1_species3))","v":{"$error":"#VALUE!"}},{"$f":" IF(OR(converge=0, RUN_RAM=0),0,RAMData(converge,$A88*s_per_year, sigma, nu, omega, 0, nsum, Calcs_pvals_path1_species4))","v":{"$error":"#VALUE!"}}]
[7.8,{"$f":" IF(OR(converge=0, RUN_RAM=0),0,RAMData(converge,$A89*s_per_year, sigma, nu, omega, 0, nsum, Calcs_pvals_path1_species1))","v":{"$error":"#VALUE!"}},{"$f":" IF(OR(converge=0, RUN_RAM=0),0,RAMData(converge,$A89*s_per_year, sigma, nu, omega, 0, nsum, Calcs_pvals_path1_species2))","v":{"$error":"#VALUE!"}},{"$f":" IF(OR(converge=0, RUN_RAM=0),0,RAMData(converge,$A89*s_per_year, sigma, nu, omega, 0, nsum, Calcs_pvals_path1_species3))","v":{"$error":"#VALUE!"}},{"$f":" IF(OR(converge=0, RUN_RAM=0),0,RAMData(converge,$A89*s_per_year, sigma, nu, omega, 0, nsum, Calcs_pvals_path1_species4))","v":{"$error":"#VALUE!"}}]
[7.9,{"$f":" IF(OR(converge=0, RUN_RAM=0),0,RAMData(converge,$A90*s_per_year, sigma, nu, omega, 0, nsum, Calcs_pvals_path1_species1))","v":{"$error":"#VALUE!"}},{"$f":" IF(OR(converge=0, RUN_RAM=0),0,RAMData(converge,$A90*s_per_year, sigma, nu, omega, 0, nsum, Calcs_pvals_path1_species2))","v":{"$error":"#VALUE!"}},{"$f":" IF(OR(converge=0, RUN_RAM=0),0,RAMData(converge,$A90*s_per_year, sigma, nu, omega, 0, nsum, Calcs_pvals_path1_species3))","v":{"$error":"#VALUE!"}},{"$f":" IF(OR(converge=0, RUN_RAM=0),0,RAMData(converge,$A90*s_per_year, sigma, nu, omega, 0, nsum, Calcs_pvals_path1_species4))","v":{"$error":"#VALUE!"}}]
[8,{"$f":" IF(OR(converge=0, RUN_RAM=0),0,RAMData(converge,$A91*s_per_year, sigma, nu, omega, 0, nsum, Calcs_pvals_path1_species1))","v":{"$error":"#VALUE!"}},{"$f":" IF(OR(converge=0, RUN_RAM=0),0,RAMData(converge,$A91*s_per_year, sigma, nu, omega, 0, nsum, Calcs_pvals_path1_species2))","v":{"$error":"#VALUE!"}},{"$f":" IF(OR(converge=0, RUN_RAM=0),0,RAMData(converge,$A91*s_per_year, sigma, nu, omega, 0, nsum, Calcs_pvals_path1_species3))","v":{"$error":"#VALUE!"}},{"$f":" IF(OR(converge=0, RUN_RAM=0),0,RAMData(converge,$A91*s_per_year, sigma, nu, omega, 0, nsum, Calcs_pvals_path1_species4))","v":{"$error":"#VALUE!"}}]
[8.1,{"$f":" IF(OR(converge=0, RUN_RAM=0),0,RAMData(converge,$A92*s_per_year, sigma, nu, omega, 0, nsum, Calcs_pvals_path1_species1))","v":{"$error":"#VALUE!"}},{"$f":" IF(OR(converge=0, RUN_RAM=0),0,RAMData(converge,$A92*s_per_year, sigma, nu, omega, 0, nsum, Calcs_pvals_path1_species2))","v":{"$error":"#VALUE!"}},{"$f":" IF(OR(converge=0, RUN_RAM=0),0,RAMData(converge,$A92*s_per_year, sigma, nu, omega, 0, nsum, Calcs_pvals_path1_species3))","v":{"$error":"#VALUE!"}},{"$f":" IF(OR(converge=0, RUN_RAM=0),0,RAMData(converge,$A92*s_per_year, sigma, nu, omega, 0, nsum, Calcs_pvals_path1_species4))","v":{"$error":"#VALUE!"}}]
[8.1999999999999993,{"$f":" IF(OR(converge=0, RUN_RAM=0),0,RAMData(converge,$A93*s_per_year, sigma, nu, omega, 0, nsum, Calcs_pvals_path1_species1))","v":{"$error":"#VALUE!"}},{"$f":" IF(OR(converge=0, RUN_RAM=0),0,RAMData(converge,$A93*s_per_year, sigma, nu, omega, 0, nsum, Calcs_pvals_path1_species2))","v":{"$error":"#VALUE!"}},{"$f":" IF(OR(converge=0, RUN_RAM=0),0,RAMData(converge,$A93*s_per_year, sigma, nu, omega, 0, nsum, Calcs_pvals_path1_species3))","v":{"$error":"#VALUE!"}},{"$f":" IF(OR(converge=0, RUN_RAM=0),0,RAMData(converge,$A93*s_per_year, sigma, nu, omega, 0, nsum, Calcs_pvals_path1_species4))","v":{"$error":"#VALUE!"}}]
[8.3000000000000007,{"$f":" IF(OR(converge=0, RUN_RAM=0),0,RAMData(converge,$A94*s_per_year, sigma, nu, omega, 0, nsum, Calcs_pvals_path1_species1))","v":{"$error":"#VALUE!"}},{"$f":" IF(OR(converge=0, RUN_RAM=0),0,RAMData(converge,$A94*s_per_year, sigma, nu, omega, 0, nsum, Calcs_pvals_path1_species2))","v":{"$error":"#VALUE!"}},{"$f":" IF(OR(converge=0, RUN_RAM=0),0,RAMData(converge,$A94*s_per_year, sigma, nu, omega, 0, nsum, Calcs_pvals_path1_species3))","v":{"$error":"#VALUE!"}},{"$f":" IF(OR(converge=0, RUN_RAM=0),0,RAMData(converge,$A94*s_per_year, sigma, nu, omega, 0, nsum, Calcs_pvals_path1_species4))","v":{"$error":"#VALUE!"}}]
[8.4,{"$f":" IF(OR(converge=0, RUN_RAM=0),0,RAMData(converge,$A95*s_per_year, sigma, nu, omega, 0, nsum, Calcs_pvals_path1_species1))","v":{"$error":"#VALUE!"}},{"$f":" IF(OR(converge=0, RUN_RAM=0),0,RAMData(converge,$A95*s_per_year, sigma, nu, omega, 0, nsum, Calcs_pvals_path1_species2))","v":{"$error":"#VALUE!"}},{"$f":" IF(OR(converge=0, RUN_RAM=0),0,RAMData(converge,$A95*s_per_year, sigma, nu, omega, 0, nsum, Calcs_pvals_path1_species3))","v":{"$error":"#VALUE!"}},{"$f":" IF(OR(converge=0, RUN_RAM=0),0,RAMData(converge,$A95*s_per_year, sigma, nu, omega, 0, nsum, Calcs_pvals_path1_species4))","v":{"$error":"#VALUE!"}}]
[8.5,{"$f":" IF(OR(converge=0, RUN_RAM=0),0,RAMData(converge,$A96*s_per_year, sigma, nu, omega, 0, nsum, Calcs_pvals_path1_species1))","v":{"$error":"#VALUE!"}},{"$f":" IF(OR(converge=0, RUN_RAM=0),0,RAMData(converge,$A96*s_per_year, sigma, nu, omega, 0, nsum, Calcs_pvals_path1_species2))","v":{"$error":"#VALUE!"}},{"$f":" IF(OR(converge=0, RUN_RAM=0),0,RAMData(converge,$A96*s_per_year, sigma, nu, omega, 0, nsum, Calcs_pvals_path1_species3))","v":{"$error":"#VALUE!"}},{"$f":" IF(OR(converge=0, RUN_RAM=0),0,RAMData(converge,$A96*s_per_year, sigma, nu, omega, 0, nsum, Calcs_pvals_path1_species4))","v":{"$error":"#VALUE!"}}]
[8.6,{"$f":" IF(OR(converge=0, RUN_RAM=0),0,RAMData(converge,$A97*s_per_year, sigma, nu, omega, 0, nsum, Calcs_pvals_path1_species1))","v":{"$error":"#VALUE!"}},{"$f":" IF(OR(converge=0, RUN_RAM=0),0,RAMData(converge,$A97*s_per_year, sigma, nu, omega, 0, nsum, Calcs_pvals_path1_species2))","v":{"$error":"#VALUE!"}},{"$f":" IF(OR(converge=0, RUN_RAM=0),0,RAMData(converge,$A97*s_per_year, sigma, nu, omega, 0, nsum, Calcs_pvals_path1_species3))","v":{"$error":"#VALUE!"}},{"$f":" IF(OR(converge=0, RUN_RAM=0),0,RAMData(converge,$A97*s_per_year, sigma, nu, omega, 0, nsum, Calcs_pvals_path1_species4))","v":{"$error":"#VALUE!"}}]
[8.6999999999999993,{"$f":" IF(OR(converge=0, RUN_RAM=0),0,RAMData(converge,$A98*s_per_year, sigma, nu, omega, 0, nsum, Calcs_pvals_path1_species1))","v":{"$error":"#VALUE!"}},{"$f":" IF(OR(converge=0, RUN_RAM=0),0,RAMData(converge,$A98*s_per_year, sigma, nu, omega, 0, nsum, Calcs_pvals_path1_species2))","v":{"$error":"#VALUE!"}},{"$f":" IF(OR(converge=0, RUN_RAM=0),0,RAMData(converge,$A98*s_per_year, sigma, nu, omega, 0, nsum, Calcs_pvals_path1_species3))","v":{"$error":"#VALUE!"}},{"$f":" IF(OR(converge=0, RUN_RAM=0),0,RAMData(converge,$A98*s_per_year, sigma, nu, omega, 0, nsum, Calcs_pvals_path1_species4))","v":{"$error":"#VALUE!"}}]
[8.8000000000000007,{"$f":" IF(OR(converge=0, RUN_RAM=0),0,RAMData(converge,$A99*s_per_year, sigma, nu, omega, 0, nsum, Calcs_pvals_path1_species1))","v":{"$error":"#VALUE!"}},{"$f":" IF(OR(converge=0, RUN_RAM=0),0,RAMData(converge,$A99*s_per_year, sigma, nu, omega, 0, nsum, Calcs_pvals_path1_species2))","v":{"$error":"#VALUE!"}},{"$f":" IF(OR(converge=0, RUN_RAM=0),0,RAMData(converge,$A99*s_per_year, sigma, nu, omega, 0, nsum, Calcs_pvals_path1_species3))","v":{"$error":"#VALUE!"}},{"$f":" IF(OR(converge=0, RUN_RAM=0),0,RAMData(converge,$A99*s_per_year, sigma, nu, omega, 0, nsum, Calcs_pvals_path1_species4))","v":{"$error":"#VALUE!"}}]
[8.9,{"$f":" IF(OR(converge=0, RUN_RAM=0),0,RAMData(converge,$A100*s_per_year, sigma, nu, omega, 0, nsum, Calcs_pvals_path1_species1))","v":{"$error":"#VALUE!"}},{"$f":" IF(OR(converge=0, RUN_RAM=0),0,RAMData(converge,$A100*s_per_year, sigma, nu, omega, 0, nsum, Calcs_pvals_path1_species2))","v":{"$error":"#VALUE!"}},{"$f":" IF(OR(converge=0, RUN_RAM=0),0,RAMData(converge,$A100*s_per_year, sigma, nu, omega, 0, nsum, Calcs_pvals_path1_species3))","v":{"$error":"#VALUE!"}},{"$f":" IF(OR(converge=0, RUN_RAM=0),0,RAMData(converge,$A100*s_per_year, sigma, nu, omega, 0, nsum, Calcs_pvals_path1_species4))","v":{"$error":"#VALUE!"}}]
[9,{"$f":" IF(OR(converge=0, RUN_RAM=0),0,RAMData(converge,$A101*s_per_year, sigma, nu, omega, 0, nsum, Calcs_pvals_path1_species1))","v":{"$error":"#VALUE!"}},{"$f":" IF(OR(converge=0, RUN_RAM=0),0,RAMData(converge,$A101*s_per_year, sigma, nu, omega, 0, nsum, Calcs_pvals_path1_species2))","v":{"$error":"#VALUE!"}},{"$f":" IF(OR(converge=0, RUN_RAM=0),0,RAMData(converge,$A101*s_per_year, sigma, nu, omega, 0, nsum, Calcs_pvals_path1_species3))","v":{"$error":"#VALUE!"}},{"$f":" IF(OR(converge=0, RUN_RAM=0),0,RAMData(converge,$A101*s_per_year, sigma, nu, omega, 0, nsum, Calcs_pvals_path1_species4))","v":{"$error":"#VALUE!"}}]
[9.1,{"$f":" IF(OR(converge=0, RUN_RAM=0),0,RAMData(converge,$A102*s_per_year, sigma, nu, omega, 0, nsum, Calcs_pvals_path1_species1))","v":{"$error":"#VALUE!"}},{"$f":" IF(OR(converge=0, RUN_RAM=0),0,RAMData(converge,$A102*s_per_year, sigma, nu, omega, 0, nsum, Calcs_pvals_path1_species2))","v":{"$error":"#VALUE!"}},{"$f":" IF(OR(converge=0, RUN_RAM=0),0,RAMData(converge,$A102*s_per_year, sigma, nu, omega, 0, nsum, Calcs_pvals_path1_species3))","v":{"$error":"#VALUE!"}},{"$f":" IF(OR(converge=0, RUN_RAM=0),0,RAMData(converge,$A102*s_per_year, sigma, nu, omega, 0, nsum, Calcs_pvals_path1_species4))","v":{"$error":"#VALUE!"}}]
[9.1999999999999993,{"$f":" IF(OR(converge=0, RUN_RAM=0),0,RAMData(converge,$A103*s_per_year, sigma, nu, omega, 0, nsum, Calcs_pvals_path1_species1))","v":{"$error":"#VALUE!"}},{"$f":" IF(OR(converge=0, RUN_RAM=0),0,RAMData(converge,$A103*s_per_year, sigma, nu, omega, 0, nsum, Calcs_pvals_path1_species2))","v":{"$error":"#VALUE!"}},{"$f":" IF(OR(converge=0, RUN_RAM=0),0,RAMData(converge,$A103*s_per_year, sigma, nu, omega, 0, nsum, Calcs_pvals_path1_species3))","v":{"$error":"#VALUE!"}},{"$f":" IF(OR(converge=0, RUN_RAM=0),0,RAMData(converge,$A103*s_per_year, sigma, nu, omega, 0, nsum, Calcs_pvals_path1_species4))","v":{"$error":"#VALUE!"}}]
[9.3000000000000007,{"$f":" IF(OR(converge=0, RUN_RAM=0),0,RAMData(converge,$A104*s_per_year, sigma, nu, omega, 0, nsum, Calcs_pvals_path1_species1))","v":{"$error":"#VALUE!"}},{"$f":" IF(OR(converge=0, RUN_RAM=0),0,RAMData(converge,$A104*s_per_year, sigma, nu, omega, 0, nsum, Calcs_pvals_path1_species2))","v":{"$error":"#VALUE!"}},{"$f":" IF(OR(converge=0, RUN_RAM=0),0,RAMData(converge,$A104*s_per_year, sigma, nu, omega, 0, nsum, Calcs_pvals_path1_species3))","v":{"$error":"#VALUE!"}},{"$f":" IF(OR(converge=0, RUN_RAM=0),0,RAMData(converge,$A104*s_per_year, sigma, nu, omega, 0, nsum, Calcs_pvals_path1_species4))","v":{"$error":"#VALUE!"}}]
[9.4,{"$f":" IF(OR(converge=0, RUN_RAM=0),0,RAMData(converge,$A105*s_per_year, sigma, nu, omega, 0, nsum, Calcs_pvals_path1_species1))","v":{"$error":"#VALUE!"}},{"$f":" IF(OR(converge=0, RUN_RAM=0),0,RAMData(converge,$A105*s_per_year, sigma, nu, omega, 0, nsum, Calcs_pvals_path1_species2))","v":{"$error":"#VALUE!"}},{"$f":" IF(OR(converge=0, RUN_RAM=0),0,RAMData(converge,$A105*s_per_year, sigma, nu, omega, 0, nsum, Calcs_pvals_path1_species3))","v":{"$error":"#VALUE!"}},{"$f":" IF(OR(converge=0, RUN_RAM=0),0,RAMData(converge,$A105*s_per_year, sigma, nu, omega, 0, nsum, Calcs_pvals_path1_species4))","v":{"$error":"#VALUE!"}}]
[9.5,{"$f":" IF(OR(converge=0, RUN_RAM=0),0,RAMData(converge,$A106*s_per_year, sigma, nu, omega, 0, nsum, Calcs_pvals_path1_species1))","v":{"$error":"#VALUE!"}},{"$f":" IF(OR(converge=0, RUN_RAM=0),0,RAMData(converge,$A106*s_per_year, sigma, nu, omega, 0, nsum, Calcs_pvals_path1_species2))","v":{"$error":"#VALUE!"}},{"$f":" IF(OR(converge=0, RUN_RAM=0),0,RAMData(converge,$A106*s_per_year, sigma, nu, omega, 0, nsum, Calcs_pvals_path1_species3))","v":{"$error":"#VALUE!"}},{"$f":" IF(OR(converge=0, RUN_RAM=0),0,RAMData(converge,$A106*s_per_year, sigma, nu, omega, 0, nsum, Calcs_pvals_path1_species4))","v":{"$error":"#VALUE!"}}]
[9.6,{"$f":" IF(OR(converge=0, RUN_RAM=0),0,RAMData(converge,$A107*s_per_year, sigma, nu, omega, 0, nsum, Calcs_pvals_path1_species1))","v":{"$error":"#VALUE!"}},{"$f":" IF(OR(converge=0, RUN_RAM=0),0,RAMData(converge,$A107*s_per_year, sigma, nu, omega, 0, nsum, Calcs_pvals_path1_species2))","v":{"$error":"#VALUE!"}},{"$f":" IF(OR(converge=0, RUN_RAM=0),0,RAMData(converge,$A107*s_per_year, sigma, nu, omega, 0, nsum, Calcs_pvals_path1_species3))","v":{"$error":"#VALUE!"}},{"$f":" IF(OR(converge=0, RUN_RAM=0),0,RAMData(converge,$A107*s_per_year, sigma, nu, omega, 0, nsum, Calcs_pvals_path1_species4))","v":{"$error":"#VALUE!"}}]
[9.6999999999999993,{"$f":" IF(OR(converge=0, RUN_RAM=0),0,RAMData(converge,$A108*s_per_year, sigma, nu, omega, 0, nsum, Calcs_pvals_path1_species1))","v":{"$error":"#VALUE!"}},{"$f":" IF(OR(converge=0, RUN_RAM=0),0,RAMData(converge,$A108*s_per_year, sigma, nu, omega, 0, nsum, Calcs_pvals_path1_species2))","v":{"$error":"#VALUE!"}},{"$f":" IF(OR(converge=0, RUN_RAM=0),0,RAMData(converge,$A108*s_per_year, sigma, nu, omega, 0, nsum, Calcs_pvals_path1_species3))","v":{"$error":"#VALUE!"}},{"$f":" IF(OR(converge=0, RUN_RAM=0),0,RAMData(converge,$A108*s_per_year, sigma, nu, omega, 0, nsum, Calcs_pvals_path1_species4))","v":{"$error":"#VALUE!"}}]
[9.8000000000000007,{"$f":" IF(OR(converge=0, RUN_RAM=0),0,RAMData(converge,$A109*s_per_year, sigma, nu, omega, 0, nsum, Calcs_pvals_path1_species1))","v":{"$error":"#VALUE!"}},{"$f":" IF(OR(converge=0, RUN_RAM=0),0,RAMData(converge,$A109*s_per_year, sigma, nu, omega, 0, nsum, Calcs_pvals_path1_species2))","v":{"$error":"#VALUE!"}},{"$f":" IF(OR(converge=0, RUN_RAM=0),0,RAMData(converge,$A109*s_per_year, sigma, nu, omega, 0, nsum, Calcs_pvals_path1_species3))","v":{"$error":"#VALUE!"}},{"$f":" IF(OR(converge=0, RUN_RAM=0),0,RAMData(converge,$A109*s_per_year, sigma, nu, omega, 0, nsum, Calcs_pvals_path1_species4))","v":{"$error":"#VALUE!"}}]
[9.9,{"$f":" IF(OR(converge=0, RUN_RAM=0),0,RAMData(converge,$A110*s_per_year, sigma, nu, omega, 0, nsum, Calcs_pvals_path1_species1))","v":{"$error":"#VALUE!"}},{"$f":" IF(OR(converge=0, RUN_RAM=0),0,RAMData(converge,$A110*s_per_year, sigma, nu, omega, 0, nsum, Calcs_pvals_path1_species2))","v":{"$error":"#VALUE!"}},{"$f":" IF(OR(converge=0, RUN_RAM=0),0,RAMData(converge,$A110*s_per_year, sigma, nu, omega, 0, nsum, Calcs_pvals_path1_species3))","v":{"$error":"#VALUE!"}},{"$f":" IF(OR(converge=0, RUN_RAM=0),0,RAMData(converge,$A110*s_per_year, sigma, nu, omega, 0, nsum, Calcs_pvals_path1_species4))","v":{"$error":"#VALUE!"}}]
[10,{"$f":" IF(OR(converge=0, RUN_RAM=0),0,RAMData(converge,$A111*s_per_year, sigma, nu, omega, 0, nsum, Calcs_pvals_path1_species1))","v":{"$error":"#VALUE!"}},{"$f":" IF(OR(converge=0, RUN_RAM=0),0,RAMData(converge,$A111*s_per_year, sigma, nu, omega, 0, nsum, Calcs_pvals_path1_species2))","v":{"$error":"#VALUE!"}},{"$f":" IF(OR(converge=0, RUN_RAM=0),0,RAMData(converge,$A111*s_per_year, sigma, nu, omega, 0, nsum, Calcs_pvals_path1_species3))","v":{"$error":"#VALUE!"}},{"$f":" IF(OR(converge=0, RUN_RAM=0),0,RAMData(converge,$A111*s_per_year, sigma, nu, omega, 0, nsum, Calcs_pvals_path1_species4))","v":{"$error":"#VALUE!"}}]