{"text_format":"1","workbook":"xlsx","n_sheets":5,"sheets":["Assessment","Calculations","Guidance","Further Information","References"],"not_rendered":{"charts":0,"images":3,"macros":1,"external_links":0,"defined_names":0,"comments":0,"pivot_tables":0},"unopened":[],"bounds":{"document_bytes":16777216,"sheet_cells":100000,"rows_first":2000,"rows_last":500,"rows_between":2000,"halvings":0,"cell_chars":16384,"cell_head_chars":4096},"cells_cut":0,"cells_raw":0,"read":"whole","date_system":"1900"}

{"sheet":"Assessment","index":0,"n_rows":71,"n_cols":16,"rows_kept":71,"cut":false,"hidden":false,"merged":[[1,1,1,7],[1,0,2,0],[1,10,2,10],[58,2,58,3],[59,1,64,3],[22,2,24,2],[19,2,21,2],[37,2,38,2],[41,2,42,2],[39,2,40,2],[49,1,50,1],[45,2,46,2],[64,0,66,0],[66,1,66,7],[63,10,66,10],[59,7,64,7],[3,1,3,7],[5,2,6,2],[7,7,18,7],[7,6,18,6],[7,2,18,2],[5,1,6,1],[7,1,18,1],[45,1,48,1],[43,1,44,1],[37,1,42,1],[29,2,30,2],[19,1,36,1]]}
[]
[null,"FPP Assessment Pro Forma v3.13"]
[null,"Factors","Topics within FPP Guidance V3 July 2016","Specific risk reduction element","Sufficient measures in FPP?","Potential positive score","Score","Comments\nNote: N/A should only be used when the operator has stated they will not do the activity (e.g. hot works, treatment, in building storage) rather than it is omitted from the plan"]
[]
[null,"3 Who this guidance doesn't apply to","3 Must still consider non-waste materials","Consideration and mitigation for gas cylinders, aerosols, combustible liquids and chemicals. Also covered in 6.2 and 11.1.","Yes",2,{"$f":"VALUE(IF(E5=\"Yes\",\"2\",IF(E5=\"N/A\",\"2\",\"0\")))","v":2}]
[null,"5 Fire Prevention measures","5 Using your fire prevention plan","Plan sets out the fire prevention measures and procedures you must put in place and use on your site.  You must have regular exercises to test how well your plan works and make sure that staff understand.","Yes - meets standards",10,{"$f":"VALUE(IF(E6=\"Yes - meets standards\",\"10\",IF(E6=\"Yes - alternative standards\",\"10\",\"0\")))","v":10},"FPP 5.2 Regular exercise to test how well the fire reponse works. 4.2.1 Emergency action procedure; 4.3 Fire fighting techniques."]
[null,null,null,"Fire prevention plan must be a standalone document, so that site staff can easily refer to it.","Yes - meets standards",10,{"$f":"VALUE(IF(E7=\"Yes - meets standards\",\"10\",IF(E7=\"Yes - alternative standards\",\"10\",\"0\")))","v":10},"FPP Title Report no 20937/2, May 2021."]
[null,"6 Site plan(s)","6.2 Site plans and maps","Drawn to scale","Yes",20,{"$f":"VALUE(IF(E8=\"No\",\"-60\",(IF(E9=\"No\",\"-60\",(IF(E10=\"No\",\"-60\",(IF(E11=\"No\",\"-60\",(IF(E12=\"No\",\"-60\",(IF(E13=\"No\",\"-60\",(IF(E14=\"No\",\"-60\",(IF(E15=\"No\",\"-60\",(IF(E16=\"No\",\"-60\",(IF(E17=\"No\",\"-60\",(IF(E18=\"No\",\"-60\",(IF(E19=\"No\",\"-60\",\"20\"))))))))))))))))))))))))","v":-60},"Drawing Fire Prevention Plan, drawing no. 20937/04. Access: FPP 1.3.2 states access is off Link Road.  Unclear where the access is, not marked on plan. Fire hydrant (Link Road) is not clearly marked on the plan in Appendix A. 4.5.1 states that 'surface water drains via series of grids into the industrial estate stormwater system. Clay drain mats will be placed over the grids to stop water entering the sewer system'. 4.5.4 the drain mats are located on the wall of the processing building. NB: waste operations are in a building except RDF storage, which is directly into a vehicle in the yard (FPP 2.1.5).  No mention of prevailing wind direction, no compass rose."]
[null,null,null,"Layout of buildings","Yes"]
[null,null,null,"Hazardous material storage","Yes"]
[null,null,null,"Access (main and perimeter)","No"]
[null,null,null,"Hydrants and water supplies","No"]
[null,null,null,"Natural or unmade ground (if applicable)","Yes",null,null,null,null," "]
[null,null,null,"Fixed and mobile plant","Yes",null,null,null,null,null,null,null,null,null,null," "]
[null,null,null,"Drainage, pollution control and firewater containment","Yes"]
[null,null,null,"Storage areas (individual piles) and fire walls","Yes"]
[null,null,null,"Quarantine area","Yes"]
[null,null,null,"Sensitive receptors","Yes"]
[null,null,null,"Compass rose and prevailing wind","No"]
[null,"7. Manage common causes of fire","7.1 Arson","CCTV","Yes - meets standards",2,{"$f":"VALUE(IF(E20=\"Yes - meets standards\",\"2\",IF(E20=\"Yes - alternative standards\",\"2\",\"0\")))","v":2},"FPP 3.2."]
[null,null,null,"Secure boundary","Yes - meets standards",2,{"$f":"VALUE(IF(E21=\"Yes - meets standards\",\"2\",IF(E21=\"Yes - alternative standards\",\"2\",\"0\")))","v":2},"FPP 3.2. Concrete walls and fencing. "]
[null,null,null,"Out of hours security monitoring","Yes - meets standards",2,{"$f":"VALUE(IF(E22=\"Yes - meets standards\",\"2\",IF(E22=\"Yes - alternative standards\",\"2\",\"0\")))","v":2},"FPP 3.2 Night-time security guard."]
[null,null,"7.2 Plant and Equipment","Documented maintenance and inspection program for static and mobile equipment.","No",2,{"$f":"VALUE(IF(E23=\"Yes - meets standards\",\"2\",IF(E23=\"Yes - alternative standards\",\"2\",IF(E23=\"N/A\",\"2\",\"0\"))))","v":0},"FPP 3.2 Maintenance programme in place but it is not clear how is it documented. ",null,null,null," ",null," "]
[null,null,null,"Vehicles fitted with fire extinguishers.","Yes - meets standards",2,{"$f":"VALUE(IF(E24=\"Yes - meets standards\",\"2\",IF(E24=\"Yes - alternative standards\",\"2\",IF(E24=\"N/A\",\"2\",\"0\"))))","v":2},"FPP Table 3 fire extinguishers are fitted within all vehicles. "]
[null,null,null,"Keep mobile plant that isn’t being used away from combustible waste.","Yes - meets standards",2,2,"FPP 4.3.1"]
[null,null,"7.3 Electrical faults including damaged or exposed electrical cables    ","Electrics on site must be fully certified by a qualified electrician and written procedures must be in place that set out regular maintenance.","Yes",2,{"$f":"VALUE(IF(E26=\"Yes\",\"2\",\"0\"))","v":2},"FPP Table 3. "]
[null,null,"7.4 Smoking Materials","You must apply a no smoking policy or have designated smoking areas a safe distance from combustible wastes to prevent accidental ignition.","Yes",2,{"$f":"VALUE(IF(E27=\"Yes\",\"2\",\"0\"))","v":2},"FPP Table 3. "]
[null,null,"7.5 Hot works","You must ensure safe working practices when carrying out hot works and carry out a fire watch for a suitable period after hot works have ended.","Yes - meets standards",2,{"$f":"VALUE(IF(E28=\"Yes - meets standards\",\"2\",IF(E28=\"Yes - alternative standards\",\"2\",IF(E28=\"N/A\",\"2\",\"0\"))))","v":2},"FPP Table 3. "]
[null,null,"7.6 Industrial Heaters  ","You must have written procedures that set out the use and regular maintenance of industrial heaters.","N/A",2,{"$f":"VALUE(IF(E29=\"Yes\",\"2\",IF(E29=\"N/A\",\"2\",\"0\")))","v":2}]
[null,null,"7.7 Hot Exhausts  ","Carry out a fire watch at regular intervals during the working day to detect signs of a fire.","Yes - meets standards",2,{"$f":"VALUE(IF(E30=\"Yes - meets standards\",\"2\",IF(E30=\"Yes - alternative standards\",\"2\",IF(E30=\"N/A\",\"2\",\"0\"))))","v":2},"FPP Table 3 Monitoring of exhausts during operations by site operatives. "]
{"$rows_left_out":42}
{"sheet":"Calculations","index":1,"n_rows":71,"n_cols":6,"rows_kept":71,"cut":false,"hidden":false,"merged":[[19,0,19,4],[20,0,20,4]]}
["Water Supply Calculation"]
[]
[null,"Maximum pile size (cubic metres)","Water supply required (litres/minute)","Overall water supply required (litres/3 hours)"]
["e.g.  ",300,{"$f":"(6.66666666666667*B4)","v":2000.0000000000009},{"$f":"(C4*180)","v":360000.00000000017}]
[null,750,{"$f":"(6.66666666666667*B5)","v":5000.0000000000018},{"$f":"(C5*180)","v":900000.00000000035}]
[null,null,0,0]
[]
[null,"Proposed water supply (litres/minute)","Equivalent max. pile size (cubic metres)"]
["e.g.",2000,{"$f":"(B9/6.66666666666667)","v":299.99999999999989}]
[null,1000,{"$f":"(B10/6.66666666666667)","v":149.99999999999994}]
[null,1150,172.49999999999991]
[]
[null,"Proposed overall water supply (litres/3 hours)","Equivalent max. pile size (cubic metres)"]
["e.g.",360000,{"$f":"(B14/180)/6.66666666666667","v":299.99999999999989}]
[null,207000,{"$f":"(B15/180)/6.66666666666667","v":172.49999999999991}]
[null,null,0]
[]
["Volume of Pile Calculation (estimation from pile shape and dimensions)"]
[]
["Please note, the following calculations are for simple geometric shapes. They are provided to allow you to assess whether the dimensions the operator has proposed are sensible when compared to the volume claimed. They will not give you accurate volumes for waste piles unless the piles themselves are near perfect shapes.\n\ne.g."]
["The shape in the first image above would give an idea of volume (using the pyramid calculation below) - not accurate figures. If more accuracy is needed, a closer fitting shape should be selected (as with the truncated square pyramid above) and the appropriate equation used (as seen - this is still an estimation). "]
[]
["Cuboid Pile Shape (e.g. stacked RDF, baled waste, waste in bays)"]
[]
[null,"Length (m)"]
[null,"Width (m)"]
[null,"Height (m)"]
[null,"Volume (cubic metres)",{"$f":"(C25*C26*C27)","v":0}]
[null,"Length (m)",null," "]
[null,"Width (m)"]
{"$rows_left_out":42}
{"sheet":"Guidance","index":2,"n_rows":38,"n_cols":3,"rows_kept":38,"cut":false,"hidden":false,"merged":[[5,0,9,0],[5,3,9,3],[0,0,0,3],[4,0,4,3],[3,0,3,3],[2,0,2,3],[1,0,1,3],[13,0,13,3],[24,0,24,3],[28,0,28,3],[32,0,32,3],[11,0,11,3],[15,0,15,3],[17,0,23,0],[26,0,26,3],[17,1,17,3],[18,1,18,3],[22,1,22,3],[33,1,33,3],[34,1,34,3],[35,1,35,3],[37,0,37,3],[30,0,30,3]]}
["Scoring Guidance"]
["This is a technical assessment proforma for fire prevention plans."]
["To carry out a technical assessment you will need all of the information set out in the permitting/pre-app checklist."]
[]
["This technical assessment proforma will generate an overall score, which will indicate whether the FPP is satisfactory.  The following indicative scoring can be used a guide:   \n"]
[null,"Final Assesment Score","Likely Quality of FPP"]
[null,"100+ (as well as 50+ for both prevention and reduction)","Satisfactory"]
[null,"80-99","Minor Deficiencies"]
[null,"40-79","Major Deficiencies"]
[null,"<40","Serious Flaws "]
[]
["If the FPP has failed assessment and needs further information, please refer to the 'further information' tab which details suggested questions for a schedule 5 request. "]
[]
["Copying Schedule 5 Questions"]
[]
["When copying the questions from the 'further information' tab to a word document:"]
[]
[null,"1. Copy the suggested questions (press 'B' at the top of the column and ctrl+c) and paste (ctrl+v) into a blank word document"]
[null,"2. Highlight the whole table using the arrowed square in the top left corner -"]
[null,"3. Select the 'layout' tab which appears in the ribbon under 'table tools'"]
[null,"4. Click 'Convert to Text' in the Data group of the ribbon (furthest right of the ribbon)"]
[null,"5. Leave the options as selected in the pop up box and press 'OK'"]
[null,"6. Renumber, reformat and reword as needed."]
[]
["Printing this document"]
[]
["To print this pro forma, ensure that the 'Fit all columns on One page' option is selected in the scaling drop down menu when in the 'Print' menu"]
[]
["How to save to EDRM"]
[]
{"$rows_left_out":9}
{"sheet":"Further Information","index":3,"n_rows":66,"n_cols":4,"rows_kept":66,"cut":false,"hidden":false,"merged":[]}
[]
[null,"Assessment of a Fire Prevention Plan"]
[]
[null,"EAWML (EPR/ /) Applicant name"]
[null,"Site name"]
[]
[null,"Documents included in the assessment:"]
[]
[null,"Include list of documents that form the Fire Prevention Plan."]
[]
[null,"The following is required for the FPP to pass assessment:"]
[]
[null,"The following questions are based on the FPP guidance and reflect the answers provided in the 'Assessment' tab of this proforma.  Please re-number and reword as applicable. Unless an FPP includes no mention at all of a particular section, the questions should be adapted to ensure they are site specific and outline the exact areas where the FPP is insufficient. ",null," "]
[]
[3,{"$f":"IF(Assessment!E5=\"No\",References!B1,\"\")","v":""}]
[5,{"$f":"IF(Assessment!E6=\"No\",References!B2,\"\")","v":""}]
[5,{"$f":"IF(Assessment!E7=\"No\",References!B3,\"\")","v":""}]
[6.2,{"$f":"IF(Assessment!E8=\"No\",References!B4,(IF(Assessment!E9=\"No\",References!B4,(IF(Assessment!E10=\"No\",References!B4,(IF(Assessment!E11=\"No\",References!B4,(IF(Assessment!E10=\"No\",References!B4,(IF(Assessment!E13=\"No\",References!B4,(IF(Assessment!E14=\"No\",References!B4,(IF(Assessment!E15=\"No\",References!B4,(IF(Assessment!E16=\"No\",References!B4,(IF(Assessment!E17=\"No\",References!B4,(IF(Assessment!E18=\"No\",References!B4,(IF(Assessment!E19=\"No\",References!B4,\"\")))))))))))))))))))))))","v":"Your site plan is currently missing:"}]
[null,{"$f":"IF(Assessment!E8=\"No\",References!B5,\"\")","v":""}]
[null,{"$f":"IF(Assessment!E9=\"No\",References!B6,\"\")","v":""}]
[null,{"$f":"IF(Assessment!E10=\"No\",References!B7,\"\")","v":""}]
[null,{"$f":"IF(Assessment!E11=\"No\",References!B8,\"\")","v":"• main access routes for fire engines and any alternative access and access points around the site perimeter to assist fire fighting"}]
[null,{"$f":"IF(Assessment!E12=\"No\",References!B9,\"\")","v":"• hydrants and water supplies"}]
[null,{"$f":"IF(Assessment!E13=\"No\",References!B10,\"\")","v":""}]
[null,{"$f":"IF(Assessment!E14=\"No\",References!B11,\"\")","v":""}]
[null,{"$f":"IF(Assessment!E15=\"No\",References!B12,\"\")","v":""}]
[null,{"$f":"IF(Assessment!E16=\"No\",References!B13,\"\")","v":""}]
[null,{"$f":"IF(Assessment!E17=\"No\",References!B14,\"\")","v":""}]
[null,{"$f":"IF(Assessment!E18=\"No\",References!B15,\"\")","v":""}]
[null,{"$f":"IF(Assessment!E19=\"No\",References!B16,\"\")","v":"• compass rose showing north and the prevailing wind direction."}]
{"$rows_left_out":37}
{"sheet":"References","index":4,"n_rows":52,"n_cols":2,"rows_kept":52,"cut":false,"hidden":true,"merged":[]}
[1,"Provide details which show you have considered and mitigated for materials on site which are not covered by the guidance but still pose a fire risk (e.g. combustible liquids or hazardous materials). This includes any gas cylinders, fuel tanks, aerosols and chemicals on site. These materials should be shown on the site plan and confirmed to be adequately separated from combustible wastes. "]
[2,"Your FPP needs to ensure the fire prevention measures will be put in place and used on site. Provide details of regular training exercises on site to test how well your plan works and to ensure that staff understand all the requirements of it. This should include training in day-to-day operation (e.g. stockpile management), as well as incident response. "]
[3,"Provide a fire prevention plan that is a standalone document. This will aid assessment and the usability of the plan on site. "]
[4,"Your site plan is currently missing:"]
[5,"• site layout to scale"]
[6,"• layout of buildings"]
[7,"• any areas where hazardous materials are stored on site (location of gas cylinders, process areas, chemicals, piles of combustible wastes, oil and fuel tanks)"]
[8,"• main access routes for fire engines and any alternative access and access points around the site perimeter to assist fire fighting"]
[9,"• hydrants and water supplies"]
[10,"• areas of natural and unmade ground"]
[11,"• the location of fixed plant or where mobile plant is stored when not in use"]
[12,"• drainage runs, pollution control features such as drain closure valves and fire water containment systems"]
[13,"• storage areas with pile dimensions and fire walls (where applicable) - includes wastes stored in a building, bunker, or containers"]
[14,"• the quarantine area"]
[15,"• sensitive receptors within a 1km radius of your site that could be affected by a fire. Examples of sensitive receptors may include:\n  • schools, hospitals, nursing and care homes, residential areas, workplaces\n  • protected habitats, watercourses, groundwater, boreholes, wells and springs supplying water for human consumption\n  • roads, railways, bus stations, pylons (on or immediately adjacent to the site only), utilities, airports"]
[16,"• compass rose showing north and the prevailing wind direction."]
[17,"Provide detail of security measures on site, including *delete as applicable* CCTV, a secure boundary, out of hours security monitoring. "]
[18,"Provide details of a documented maintenance and inspection programme for static and mobile plant and equipment (e.g. what checks are conducted, who the checks are completed by, how often they will be conducted, how records are kept and what actions are taken in the event that problems are discovered)."]
[19,"Confirm that vehicles will be fitted with fire extinguishers."]
[20,"Confirm that unused mobile plant will be kept away from combustible waste and provide details of this arrangement."]
[21,"Confirm electrics on site will be fully certified by a qualified electrician and outline the written procedures in place that set out regular maintenance."]
[22,"Provide details of a no smoking policy on site or of designated smoking areas a safe distance from combustible wastes."]
[23,"Provide details of safe working practices, such as a permit to work system, for hot works (such as welding and cutting). In addition, provide details of a fire watch on site, should be in place for a suitable period after hot works have ended (particularly at the end of a working day)."]
[24,"Provide details of written procedures that set out the use and regular maintenance of industrial heaters or confirm no heaters will be used on site. "]
[25,"Confirm that a fire watch will monitor the site at regular intervals during the working day, to detect signs of a fire from hot exhausts or engines, and outline the regularity of these intervals. In all cases, a watch at the end of the day is required."]
[26,"Confirm all naked flames, space heaters, furnaces, incinerators and other sources of ignition will be kept 6 metres away from combustible and flammable waste."]
[27,"Confirm that you will disconnect or remove batteries from un-depolluted vehicles before they’re stockpiled for de-pollution."]
[28,"Provide details of how you will prevent fuels and combustible liquids leaking or trailing from site vehicles and/or stored ELVs and provide a process to detect and clean up if incidents occur (e.g. site inspections, spill kits etc.)."]
[29,"Provide details of how regularly you’ll inspect and clean the site to prevent the build-up of loose combustible waste, dust and fluff. Inspections should particularly focus on higher risk areas, such as electrical panels and treatment equipment. "]
[30,"Provide details of the written procedures for waste acceptance checks to prevent reactions between incompatible or unstable wastes. You must use a quarantine area where necessary."]
{"$rows_left_out":22}