{"text_format":"1","workbook":"xlsx","n_sheets":10,"sheets":["Control","Infill","Contaminants","Hydrogeology","Attenuation","WaterBalance","Pathways","Simulation","Audit","Principal Aquif"],"not_rendered":{"charts":0,"images":3,"macros":1,"external_links":1,"defined_names":2315,"comments":3,"pivot_tables":0},"unopened":[],"bounds":{"document_bytes":16777216,"sheet_cells":100000,"rows_first":2000,"rows_last":500,"rows_between":2000,"halvings":0,"cell_chars":16384,"cell_head_chars":4096},"cells_cut":0,"cells_raw":0,"read":"whole","date_system":"1900"}

{"sheet":"Control","index":0,"n_rows":34,"n_cols":3,"rows_kept":34,"cut":false,"hidden":false,"merged":[]}
[]
[]
[]
[]
[]
[]
[]
[]
[]
[]
[]
[]
[]
[]
[]
[]
[]
[]
[]
[]
[]
[]
[]
[]
[]
[]
[]
[]
[]
[null,null,"Numerical value"]
[null,null,"Suggested formula"]
[null,null,"Probabilistic parameters"]
[null,null,"Data specified elsewhere"]
[null,null,"Suggested formula edited"]

{"sheet":"Infill","index":1,"n_rows":131,"n_cols":10,"rows_kept":131,"cut":false,"hidden":false,"merged":[]}
["SOURCE CONCENTRATIONS: Infill"]
[]
["Source Data Options","Source Type"]
[]
[]
[]
[]
[]
[]
[]
["Target Standard"]
[]
["Select which Quality Standard (defined on the Contaminants sheet) to apply"]
["Not Specified"]
[]
[]
["Source Geometry"]
[]
["Infill_Source_length",207,"m"]
["Infill_Source_width",246,"m"]
["Infill_Source_area",51128,"m2"]
["Infill_Source_thickness",null,"m"]
["Infill_Source_volume",975000,"m3"]
[]
[]
["General Source Properties"]
[]
["Infill_Source_field_capacity","[-]",0.2]
["Distribution",null,"constant"]
["Infill_Source_field_capacity_param1"]
["Infill_Source_field_capacity_param2"]
["Infill_Source_field_capacity_param3"]
[]
[]
["Infill_Source_porosity_total","[-]"]
["Distribution",null,"constant"]
["Infill_Source_porosity_total_param1"]
["Infill_Source_porosity_total_param2"]
["Infill_Source_porosity_total_param3"]
[]
[]
["Infill_Source_porosity_water_filled","[-]"]
["Distribution",null,"constant"]
["Infill_Source_porosity_water_filled_param1"]
["Infill_Source_porosity_water_filled_param2"]
["Infill_Source_porosity_water_filled_param3"]
[]
[]
["Infill_Source_porosity_air_filled","[-]",{"$f":" Infill_Source_porosity_total - Infill_Source_porosity_water_filled","v":0}]
["Distribution",null,"constant"]
["Infill_Source_porosity_air_filled_param1"]
["Infill_Source_porosity_air_filled_param2"]
["Infill_Source_porosity_air_filled_param3"]
[]
[]
["Infill_Source_dry_bulk_density","kg/m3"]
["Distribution",null,"constant"]
["Infill_Source_dry_bulk_density_param1"]
["Infill_Source_dry_bulk_density_param2"]
["Infill_Source_dry_bulk_density_param3"]
[]
[]
["Infill_Source_fraction_organic_carbon","[-]"]
["Distribution",null,"constant"]
["Infill_Source_fraction_organic_carbon_param1"]
["Infill_Source_fraction_organic_carbon_param2"]
["Infill_Source_fraction_organic_carbon_param3"]
[]
[]
[]
["Source Contaminant Information"]
[]
["Source determinand names",null,{"$f":" IF( ISTEXT( (Contaminants_Source_determinand_names Contaminants_Species1)), (Contaminants_Source_determinand_names Contaminants_Species1), \"Undefined\" )","v":"Hg"},{"$f":" IF( ISTEXT( (Contaminants_Source_determinand_names Contaminants_Species2)), (Contaminants_Source_determinand_names Contaminants_Species2), \"Undefined\" )","v":"Pb"},{"$f":" IF( ISTEXT( (Contaminants_Source_determinand_names Contaminants_Species3)), (Contaminants_Source_determinand_names Contaminants_Species3), \"Undefined\" )","v":"Benzene"},{"$f":" IF( ISTEXT( (Contaminants_Source_determinand_names Contaminants_Species4)), (Contaminants_Source_determinand_names Contaminants_Species4), \"Undefined\" )","v":"BaP"},{"$f":" IF( ISTEXT( (Contaminants_Source_determinand_names Contaminants_Species5)), (Contaminants_Source_determinand_names Contaminants_Species5), \"Undefined\" )","v":"Undefined"},{"$f":" IF( ISTEXT( (Contaminants_Source_determinand_names Contaminants_Species6)), (Contaminants_Source_determinand_names Contaminants_Species6), \"Undefined\" )","v":"Undefined"},{"$f":" IF( ISTEXT( (Contaminants_Source_determinand_names Contaminants_Species7)), (Contaminants_Source_determinand_names Contaminants_Species7), \"Undefined\" )","v":"Undefined"},{"$f":" IF( ISTEXT( (Contaminants_Source_determinand_names Contaminants_Species8)), (Contaminants_Source_determinand_names Contaminants_Species8), \"Undefined\" )","v":"Undefined"}]
[]
["Infill_Pore_water_concentration","mg/L",0.01,0.5,6,100]
["Distribution",null,"constant","constant","constant","constant","constant","constant","constant","constant"]
["Infill_Pore_water_concentration_param1"]
["Infill_Pore_water_concentration_param2"]
["Infill_Pore_water_concentration_param3"]
[]
[]
["Infill_Leaching_test_concentration","mg/L"]
["Distribution",null,"constant","constant","constant","constant","constant","constant","constant","constant"]
["Infill_Leaching_test_concentration_param1"]
["Infill_Leaching_test_concentration_param2"]
["Infill_Leaching_test_concentration_param3"]
[]
[]
["Infill_Soil_contaminant_concentration","mg/kg"]
["Distribution",null,"constant","constant","constant","constant","constant","constant","constant","constant"]
["Infill_Soil_contaminant_concentration_param1"]
["Infill_Soil_contaminant_concentration_param2"]
["Infill_Soil_contaminant_concentration_param3"]
[]
[]
["Infill_Source_solid_water_partitioning_coefficient_Kd","L/kg",{"$f":" (Contaminants_Organic_Carbon_Water_Partition_Coefficient_Koc  Contaminants_Species1) * ( Infill_Source_fraction_organic_carbon)","v":0},{"$f":" (Contaminants_Organic_Carbon_Water_Partition_Coefficient_Koc  Contaminants_Species2) * ( Infill_Source_fraction_organic_carbon)","v":0},{"$f":" (Contaminants_Organic_Carbon_Water_Partition_Coefficient_Koc  Contaminants_Species3) * ( Infill_Source_fraction_organic_carbon)","v":0},{"$f":" (Contaminants_Organic_Carbon_Water_Partition_Coefficient_Koc  Contaminants_Species4) * ( Infill_Source_fraction_organic_carbon)","v":0},{"$f":" (Contaminants_Organic_Carbon_Water_Partition_Coefficient_Koc  Contaminants_Species5) * ( Infill_Source_fraction_organic_carbon)","v":0},{"$f":" (Contaminants_Organic_Carbon_Water_Partition_Coefficient_Koc  Contaminants_Species6) * ( Infill_Source_fraction_organic_carbon)","v":0},{"$f":" (Contaminants_Organic_Carbon_Water_Partition_Coefficient_Koc  Contaminants_Species7) * ( Infill_Source_fraction_organic_carbon)","v":0},{"$f":" (Contaminants_Organic_Carbon_Water_Partition_Coefficient_Koc  Contaminants_Species8) * ( Infill_Source_fraction_organic_carbon)","v":0}]
["Distribution",null,"constant","constant","constant","constant","constant","constant","constant","constant"]
["Infill_Source_solid_water_partitioning_coefficient_Kd_param1"]
["Infill_Source_solid_water_partitioning_coefficient_Kd_param2"]
["Infill_Source_solid_water_partitioning_coefficient_Kd_param3"]
[]
[]
["Infill_Initial_inventory","kg",{"$f":" 0.001 * (Infill_Pore_water_concentration) * (Infill_Source_field_capacity) * (Infill_Source_volume)","v":1.9500000000000004},97.5,1170,19500.000000000004,0,0,0,0]
["Distribution",null,"constant","constant","constant","constant","constant","constant","constant","constant"]
["Infill_Initial_inventory_param1"]
["Infill_Initial_inventory_param2"]
["Infill_Initial_inventory_param3"]
[]
[]
["Infill_Kappa_slope_value_m","kg/L"]
["Distribution",null,"constant","constant","constant","constant","constant","constant","constant","constant"]
["Infill_Kappa_slope_value_m_param1"]
["Infill_Kappa_slope_value_m_param2"]
["Infill_Kappa_slope_value_m_param3"]
[]
[]
["Infill_Kappa_intercept_value_c","kg/L"]
["Distribution",null,"constant","constant","constant","constant","constant","constant","constant","constant"]
["Infill_Kappa_intercept_value_c_param1"]
["Infill_Kappa_intercept_value_c_param2"]
["Infill_Kappa_intercept_value_c_param3"]
[]
[]
["Infill_Kappa_Value","kg/L",{"$f":" IF(AND(ISNUMBER(Infill_Kappa_slope_value_m),ISNUMBER(Infill_Kappa_intercept_value_c),ISNUMBER(Infill_Input_concentration)), IF(Infill_Input_concentration>0,MAX(0,Infill_Kappa_slope_value_m * LN(1000 * Infill_Input_concentration) + Infill_Kappa_intercept_value_c),\"\"),\"Not-used\")","v":"Not-used"},"Not-used","Not-used","Not-used","Not-used","Not-used","Not-used","Not-used"]
["Distribution",null,"constant","constant","constant","constant","constant","constant","constant","constant"]
["Infill_Kappa_Value_param1"]
["Infill_Kappa_Value_param2"]
["Infill_Kappa_Value_param3"]
[]
[]
["Infill_Input_concentration","mg/L",{"$f":" (Infill_Pore_water_concentration)","v":0.01},0.5,6,100,0,0,0,0]

{"sheet":"Contaminants","index":2,"n_rows":42,"n_cols":11,"rows_kept":42,"cut":false,"hidden":false,"merged":[]}
["CONTAMINANT INFORMATION"]
[]
[null,null,null,"Species1","Species2","Species3","Species4","Species5","Species6","Species7","Species8"]
["Source determinand names",null,4,"Hg","Pb","Benzene","BaP"]
[]
[]
["Receptor Target Concentrations"]
[null,"Name",null,"Values in mg/L"]
["Quality Standard 1  ","MRV",null,1.0000000000000001E-5,2.0000000000000001E-4,1E-3,4.9999999999999998E-8]
["Quality Standard 2  "]
["Quality Standard 3  "]
["Quality Standard 4  "]
[null,"Not Specified"]
[]
["Generic Contaminant Properties"]
[]
["Contaminants_Solubility","mg/L"]
["Distribution",null,null,"constant","constant","constant","constant","constant","constant","constant","constant"]
["Contaminants_Solubility_param1"]
["Contaminants_Solubility_param2"]
["Contaminants_Solubility_param3"]
[]
[]
["Contaminants_Henrys_Law_Constant","[-]"]
["Distribution",null,null,"constant","constant","constant","constant","constant","constant","constant","constant"]
["Contaminants_Henrys_Law_Constant_param1"]
["Contaminants_Henrys_Law_Constant_param2"]
["Contaminants_Henrys_Law_Constant_param3"]
[]
[]
["Contaminants_Organic_Carbon_Water_Partition_Coefficient_Koc","L/kg",null,null,null,66,1170000]
["Distribution",null,null,"constant","constant","constant","constant","constant","constant","constant","constant"]
["Contaminants_Organic_Carbon_Water_Partition_Coefficient_Koc_param1"]
["Contaminants_Organic_Carbon_Water_Partition_Coefficient_Koc_param2"]
["Contaminants_Organic_Carbon_Water_Partition_Coefficient_Koc_param3"]
[]
[]
["Contaminants_Free_Water_Diffusion_Coefficient","m2/s",null,2.0000000000000001E-9,1.0000000000000001E-9,6.6399999999999998E-10,6.9E-10]
["Distribution",null,null,"constant","constant","constant","constant","constant","constant","constant","constant"]
["Contaminants_Free_Water_Diffusion_Coefficient_param1"]
["Contaminants_Free_Water_Diffusion_Coefficient_param2"]
["Contaminants_Free_Water_Diffusion_Coefficient_param3"]

{"sheet":"Hydrogeology","index":3,"n_rows":58,"n_cols":18,"rows_kept":58,"cut":false,"hidden":false,"merged":[]}
["HYDROGEOLOGICAL UNITS"]
[]
["Hydrogeological Units",null,"Sst Unsaturated","Sst Saturated","Geo Barrier"]
[]
["Hydrogeology_Unit_Thickness","m",3.5,10,1]
["Distribution",null,"constant","constant","constant","constant","constant","constant","constant","constant","constant","constant","constant","constant","constant","constant","constant","constant"]
["Hydrogeology_Unit_Thickness_param1"]
["Hydrogeology_Unit_Thickness_param2"]
["Hydrogeology_Unit_Thickness_param3"]
[]
[]
["Hydrogeology_Log_Hydraulic_Conductivity","log(m/s)"]
["Distribution",null,"constant","constant","constant","constant","constant","constant","constant","constant","constant","constant","constant","constant","constant","constant","constant","constant"]
["Hydrogeology_Log_Hydraulic_Conductivity_param1"]
["Hydrogeology_Log_Hydraulic_Conductivity_param2"]
["Hydrogeology_Log_Hydraulic_Conductivity_param3"]
[]
[]
["Hydrogeology_Hydraulic_Conductivity","m/s",1.3999999999999999E-4,1.3999999999999999E-4,5.0000000000000001E-9,{"$f":" POWER(10, (Hydrogeology_Log_Hydraulic_Conductivity))","v":1},1,1,1,1,1,1,1,1,1,1,1,1]
["Distribution",null,"constant","constant","constant","constant","constant","constant","constant","constant","constant","constant","constant","constant","constant","constant","constant","constant"]
["Hydrogeology_Hydraulic_Conductivity_param1"]
["Hydrogeology_Hydraulic_Conductivity_param2"]
["Hydrogeology_Hydraulic_Conductivity_param3"]
[]
[]
["Hydrogeology_Head","m"]
["Distribution",null,"constant","constant","constant","constant","constant","constant","constant","constant","constant","constant","constant","constant","constant","constant","constant","constant"]
["Hydrogeology_Head_param1"]
["Hydrogeology_Head_param2"]
["Hydrogeology_Head_param3"]
[]
[]
["Hydrogeology_Hydraulic_Gradient","[-]",1,0.02,1]
["Distribution",null,"constant","constant","constant","constant","constant","constant","constant","constant","constant","constant","constant","constant","constant","constant","constant","constant"]
["Hydrogeology_Hydraulic_Gradient_param1"]
["Hydrogeology_Hydraulic_Gradient_param2"]
["Hydrogeology_Hydraulic_Gradient_param3"]
[]
[]
["Hydrogeology_Porosity","[-]",0.27,0.27,0.4]
["Distribution",null,"constant","constant","constant","constant","constant","constant","constant","constant","constant","constant","constant","constant","constant","constant","constant","constant"]
["Hydrogeology_Porosity_param1"]
["Hydrogeology_Porosity_param2"]
["Hydrogeology_Porosity_param3"]
[]
[]
["Hydrogeology_Velocity","m/s",{"$f":" (Hydrogeology_Hydraulic_Conductivity) * (Hydrogeology_Hydraulic_Gradient) / (Hydrogeology_Porosity)","v":5.1851851851851842E-4},1.037037037037037E-5,1.2499999999999999E-8,{"$error":"#DIV/0!"},{"$error":"#DIV/0!"},{"$error":"#DIV/0!"},{"$error":"#DIV/0!"},{"$error":"#DIV/0!"},{"$error":"#DIV/0!"},{"$error":"#DIV/0!"},{"$error":"#DIV/0!"},{"$error":"#DIV/0!"},{"$error":"#DIV/0!"},{"$error":"#DIV/0!"},{"$error":"#DIV/0!"},{"$error":"#DIV/0!"}]
["Distribution",null,"constant","constant","constant","constant","constant","constant","constant","constant","constant","constant","constant","constant","constant","constant","constant","constant"]
["Hydrogeology_Velocity_param1"]
["Hydrogeology_Velocity_param2"]
["Hydrogeology_Velocity_param3"]
[]
[]
["Hydrogeology_Tortuosity","[-]",5,5,5]
["Distribution",null,"constant","constant","constant","constant","constant","constant","constant","constant","constant","constant","constant","constant","constant","constant","constant","constant"]
["Hydrogeology_Tortuosity_param1"]
["Hydrogeology_Tortuosity_param2"]
["Hydrogeology_Tortuosity_param3"]

{"sheet":"Attenuation","index":4,"n_rows":261,"n_cols":18,"rows_kept":261,"cut":false,"hidden":false,"merged":[]}
["ATTENUATION PARAMETERS"]
[]
["Hydrogeological Units",null,"Sst Unsaturated","Sst Saturated","Geo Barrier"]
[]
["General properties"]
[]
["Attenuation_Dry_bulk_density","kg/m3",2200,2200,1600]
["Distribution",null,"constant","constant","constant","constant","constant","constant","constant","constant","constant","constant","constant","constant","constant","constant","constant","constant"]
["Attenuation_Dry_bulk_density_param1"]
["Attenuation_Dry_bulk_density_param2"]
["Attenuation_Dry_bulk_density_param3"]
[]
[]
["Attenuation_Fraction_organic_carbon","[-]",1E-3,1E-3,0.01]
["Distribution",null,"constant","constant","constant","constant","constant","constant","constant","constant","constant","constant","constant","constant","constant","constant","constant","constant"]
["Attenuation_Fraction_organic_carbon_param1"]
["Attenuation_Fraction_organic_carbon_param2"]
["Attenuation_Fraction_organic_carbon_param3"]
[]
[]
[]
["Contaminant specific parameters"]
[]
[{"$f":" IF((Contaminants_Source_determinand_names   Contaminants_Species1)=0,\"Undefined\",(Contaminants_Source_determinand_names   Contaminants_Species1))","v":"Hg"}]
[]
["Attenuation_Partition_Coefficient_Kd_Species_1","L/kg",450,450,450,{"$f":" (Attenuation_Fraction_organic_carbon) * (Contaminants_Organic_Carbon_Water_Partition_Coefficient_Koc  Contaminants_Species1)","v":0},{"$f":" (Attenuation_Fraction_organic_carbon) * (Contaminants_Organic_Carbon_Water_Partition_Coefficient_Koc  Contaminants_Species1)","v":0},{"$f":" (Attenuation_Fraction_organic_carbon) * (Contaminants_Organic_Carbon_Water_Partition_Coefficient_Koc  Contaminants_Species1)","v":0},{"$f":" (Attenuation_Fraction_organic_carbon) * (Contaminants_Organic_Carbon_Water_Partition_Coefficient_Koc  Contaminants_Species1)","v":0},{"$f":" (Attenuation_Fraction_organic_carbon) * (Contaminants_Organic_Carbon_Water_Partition_Coefficient_Koc  Contaminants_Species1)","v":0},{"$f":" (Attenuation_Fraction_organic_carbon) * (Contaminants_Organic_Carbon_Water_Partition_Coefficient_Koc  Contaminants_Species1)","v":0},{"$f":" (Attenuation_Fraction_organic_carbon) * (Contaminants_Organic_Carbon_Water_Partition_Coefficient_Koc  Contaminants_Species1)","v":0},{"$f":" (Attenuation_Fraction_organic_carbon) * (Contaminants_Organic_Carbon_Water_Partition_Coefficient_Koc  Contaminants_Species1)","v":0},{"$f":" (Attenuation_Fraction_organic_carbon) * (Contaminants_Organic_Carbon_Water_Partition_Coefficient_Koc  Contaminants_Species1)","v":0},{"$f":" (Attenuation_Fraction_organic_carbon) * (Contaminants_Organic_Carbon_Water_Partition_Coefficient_Koc  Contaminants_Species1)","v":0},{"$f":" (Attenuation_Fraction_organic_carbon) * (Contaminants_Organic_Carbon_Water_Partition_Coefficient_Koc  Contaminants_Species1)","v":0},{"$f":" (Attenuation_Fraction_organic_carbon) * (Contaminants_Organic_Carbon_Water_Partition_Coefficient_Koc  Contaminants_Species1)","v":0},{"$f":" (Attenuation_Fraction_organic_carbon) * (Contaminants_Organic_Carbon_Water_Partition_Coefficient_Koc  Contaminants_Species1)","v":0}]
["Distribution",null,"constant","constant","constant","constant","constant","constant","constant","constant","constant","constant","constant","constant","constant","constant","constant","constant"]
["Attenuation_Partition_Coefficient_Kd_Species_1_param1"]
["Attenuation_Partition_Coefficient_Kd_Species_1_param2"]
["Attenuation_Partition_Coefficient_Kd_Species_1_param3"]
[]
[]
["Attenuation_Retardation_Species_1","[-]",{"$f":" 1 + 0.001 * (Attenuation_Partition_Coefficient_Kd_Species_1) * (Attenuation_Dry_bulk_density) / (Hydrogeology_Porosity    Hydrogeology!$C:$C)","v":3667.6666666666665},{"$f":" 1 + 0.001 * (Attenuation_Partition_Coefficient_Kd_Species_1) * (Attenuation_Dry_bulk_density) / (Hydrogeology_Porosity    Hydrogeology!$D:$D)","v":3667.6666666666665},{"$f":" 1 + 0.001 * (Attenuation_Partition_Coefficient_Kd_Species_1) * (Attenuation_Dry_bulk_density) / (Hydrogeology_Porosity    Hydrogeology!$E:$E)","v":1801},{"$f":" 1 + 0.001 * (Attenuation_Partition_Coefficient_Kd_Species_1) * (Attenuation_Dry_bulk_density) / (Hydrogeology_Porosity    Hydrogeology!$F:$F)","v":{"$error":"#DIV/0!"}},{"$f":" 1 + 0.001 * (Attenuation_Partition_Coefficient_Kd_Species_1) * (Attenuation_Dry_bulk_density) / (Hydrogeology_Porosity    Hydrogeology!$G:$G)","v":{"$error":"#DIV/0!"}},{"$f":" 1 + 0.001 * (Attenuation_Partition_Coefficient_Kd_Species_1) * (Attenuation_Dry_bulk_density) / (Hydrogeology_Porosity    Hydrogeology!$H:$H)","v":{"$error":"#DIV/0!"}},{"$f":" 1 + 0.001 * (Attenuation_Partition_Coefficient_Kd_Species_1) * (Attenuation_Dry_bulk_density) / (Hydrogeology_Porosity    Hydrogeology!$I:$I)","v":{"$error":"#DIV/0!"}},{"$f":" 1 + 0.001 * (Attenuation_Partition_Coefficient_Kd_Species_1) * (Attenuation_Dry_bulk_density) / (Hydrogeology_Porosity    Hydrogeology!$J:$J)","v":{"$error":"#DIV/0!"}},{"$f":" 1 + 0.001 * (Attenuation_Partition_Coefficient_Kd_Species_1) * (Attenuation_Dry_bulk_density) / (Hydrogeology_Porosity    Hydrogeology!$K:$K)","v":{"$error":"#DIV/0!"}},{"$f":" 1 + 0.001 * (Attenuation_Partition_Coefficient_Kd_Species_1) * (Attenuation_Dry_bulk_density) / (Hydrogeology_Porosity    Hydrogeology!$L:$L)","v":{"$error":"#DIV/0!"}},{"$f":" 1 + 0.001 * (Attenuation_Partition_Coefficient_Kd_Species_1) * (Attenuation_Dry_bulk_density) / (Hydrogeology_Porosity    Hydrogeology!$M:$M)","v":{"$error":"#DIV/0!"}},{"$f":" 1 + 0.001 * (Attenuation_Partition_Coefficient_Kd_Species_1) * (Attenuation_Dry_bulk_density) / (Hydrogeology_Porosity    Hydrogeology!$N:$N)","v":{"$error":"#DIV/0!"}},{"$f":" 1 + 0.001 * (Attenuation_Partition_Coefficient_Kd_Species_1) * (Attenuation_Dry_bulk_density) / (Hydrogeology_Porosity    Hydrogeology!$O:$O)","v":{"$error":"#DIV/0!"}},{"$f":" 1 + 0.001 * (Attenuation_Partition_Coefficient_Kd_Species_1) * (Attenuation_Dry_bulk_density) / (Hydrogeology_Porosity    Hydrogeology!$P:$P)","v":{"$error":"#DIV/0!"}},{"$f":" 1 + 0.001 * (Attenuation_Partition_Coefficient_Kd_Species_1) * (Attenuation_Dry_bulk_density) / (Hydrogeology_Porosity    Hydrogeology!$Q:$Q)","v":{"$error":"#DIV/0!"}},{"$f":" 1 + 0.001 * (Attenuation_Partition_Coefficient_Kd_Species_1) * (Attenuation_Dry_bulk_density) / (Hydrogeology_Porosity    Hydrogeology!$R:$R)","v":{"$error":"#DIV/0!"}}]
["Distribution",null,"constant","constant","constant","constant","constant","constant","constant","constant","constant","constant","constant","constant","constant","constant","constant","constant"]
["Attenuation_Retardation_Species_1_param1"]
["Attenuation_Retardation_Species_1_param2"]
["Attenuation_Retardation_Species_1_param3"]
[]
[]
["Attenuation_Half_Life_Species_1","days","No Decay","No Decay","No Decay","No Decay","No Decay","No Decay","No Decay","No Decay","No Decay","No Decay","No Decay","No Decay","No Decay","No Decay","No Decay","No Decay"]
["Distribution",null,"constant","constant","constant","constant","constant","constant","constant","constant","constant","constant","constant","constant","constant","constant","constant","constant"]
["Attenuation_Half_Life_Species_1_param1"]
["Attenuation_Half_Life_Species_1_param2"]
["Attenuation_Half_Life_Species_1_param3"]
[]
[]
["Attenuation_Decay_Coefficient_Species_1","1/s",{"$f":" IF((Attenuation_Half_Life_Species_1)<>\"No Decay\", LN(2) / ((Attenuation_Half_Life_Species_1) * s_per_day),0)","v":0},0,0,0,0,0,0,0,0,0,0,0,0,0,0,0]
["Distribution",null,"constant","constant","constant","constant","constant","constant","constant","constant","constant","constant","constant","constant","constant","constant","constant","constant"]
["Attenuation_Decay_Coefficient_Species_1_param1"]
["Attenuation_Decay_Coefficient_Species_1_param2"]
["Attenuation_Decay_Coefficient_Species_1_param3"]
[]
[]
[{"$f":" IF((Contaminants_Source_determinand_names   Contaminants_Species2)=0,\"Undefined\",(Contaminants_Source_determinand_names   Contaminants_Species2))","v":"Pb"}]
[]
["Attenuation_Partition_Coefficient_Kd_Species_2","L/kg",220,220,220,{"$f":" (Attenuation_Fraction_organic_carbon) * (Contaminants_Organic_Carbon_Water_Partition_Coefficient_Koc  Contaminants_Species2)","v":0},{"$f":" (Attenuation_Fraction_organic_carbon) * (Contaminants_Organic_Carbon_Water_Partition_Coefficient_Koc  Contaminants_Species2)","v":0},{"$f":" (Attenuation_Fraction_organic_carbon) * (Contaminants_Organic_Carbon_Water_Partition_Coefficient_Koc  Contaminants_Species2)","v":0},{"$f":" (Attenuation_Fraction_organic_carbon) * (Contaminants_Organic_Carbon_Water_Partition_Coefficient_Koc  Contaminants_Species2)","v":0},{"$f":" (Attenuation_Fraction_organic_carbon) * (Contaminants_Organic_Carbon_Water_Partition_Coefficient_Koc  Contaminants_Species2)","v":0},{"$f":" (Attenuation_Fraction_organic_carbon) * (Contaminants_Organic_Carbon_Water_Partition_Coefficient_Koc  Contaminants_Species2)","v":0},{"$f":" (Attenuation_Fraction_organic_carbon) * (Contaminants_Organic_Carbon_Water_Partition_Coefficient_Koc  Contaminants_Species2)","v":0},{"$f":" (Attenuation_Fraction_organic_carbon) * (Contaminants_Organic_Carbon_Water_Partition_Coefficient_Koc  Contaminants_Species2)","v":0},{"$f":" (Attenuation_Fraction_organic_carbon) * (Contaminants_Organic_Carbon_Water_Partition_Coefficient_Koc  Contaminants_Species2)","v":0},{"$f":" (Attenuation_Fraction_organic_carbon) * (Contaminants_Organic_Carbon_Water_Partition_Coefficient_Koc  Contaminants_Species2)","v":0},{"$f":" (Attenuation_Fraction_organic_carbon) * (Contaminants_Organic_Carbon_Water_Partition_Coefficient_Koc  Contaminants_Species2)","v":0},{"$f":" (Attenuation_Fraction_organic_carbon) * (Contaminants_Organic_Carbon_Water_Partition_Coefficient_Koc  Contaminants_Species2)","v":0},{"$f":" (Attenuation_Fraction_organic_carbon) * (Contaminants_Organic_Carbon_Water_Partition_Coefficient_Koc  Contaminants_Species2)","v":0}]
["Distribution",null,"constant","constant","constant","constant","constant","constant","constant","constant","constant","constant","constant","constant","constant","constant","constant","constant"]
["Attenuation_Partition_Coefficient_Kd_Species_2_param1"]
["Attenuation_Partition_Coefficient_Kd_Species_2_param2"]
["Attenuation_Partition_Coefficient_Kd_Species_2_param3"]
[]
[]
["Attenuation_Retardation_Species_2","[-]",{"$f":" 1 + 0.001 * (Attenuation_Partition_Coefficient_Kd_Species_2) * (Attenuation_Dry_bulk_density) / (Hydrogeology_Porosity    Hydrogeology!$C:$C)","v":1793.5925925925924},{"$f":" 1 + 0.001 * (Attenuation_Partition_Coefficient_Kd_Species_2) * (Attenuation_Dry_bulk_density) / (Hydrogeology_Porosity    Hydrogeology!$D:$D)","v":1793.5925925925924},{"$f":" 1 + 0.001 * (Attenuation_Partition_Coefficient_Kd_Species_2) * (Attenuation_Dry_bulk_density) / (Hydrogeology_Porosity    Hydrogeology!$E:$E)","v":881},{"$f":" 1 + 0.001 * (Attenuation_Partition_Coefficient_Kd_Species_2) * (Attenuation_Dry_bulk_density) / (Hydrogeology_Porosity    Hydrogeology!$F:$F)","v":{"$error":"#DIV/0!"}},{"$f":" 1 + 0.001 * (Attenuation_Partition_Coefficient_Kd_Species_2) * (Attenuation_Dry_bulk_density) / (Hydrogeology_Porosity    Hydrogeology!$G:$G)","v":{"$error":"#DIV/0!"}},{"$f":" 1 + 0.001 * (Attenuation_Partition_Coefficient_Kd_Species_2) * (Attenuation_Dry_bulk_density) / (Hydrogeology_Porosity    Hydrogeology!$H:$H)","v":{"$error":"#DIV/0!"}},{"$f":" 1 + 0.001 * (Attenuation_Partition_Coefficient_Kd_Species_2) * (Attenuation_Dry_bulk_density) / (Hydrogeology_Porosity    Hydrogeology!$I:$I)","v":{"$error":"#DIV/0!"}},{"$f":" 1 + 0.001 * (Attenuation_Partition_Coefficient_Kd_Species_2) * (Attenuation_Dry_bulk_density) / (Hydrogeology_Porosity    Hydrogeology!$J:$J)","v":{"$error":"#DIV/0!"}},{"$f":" 1 + 0.001 * (Attenuation_Partition_Coefficient_Kd_Species_2) * (Attenuation_Dry_bulk_density) / (Hydrogeology_Porosity    Hydrogeology!$K:$K)","v":{"$error":"#DIV/0!"}},{"$f":" 1 + 0.001 * (Attenuation_Partition_Coefficient_Kd_Species_2) * (Attenuation_Dry_bulk_density) / (Hydrogeology_Porosity    Hydrogeology!$L:$L)","v":{"$error":"#DIV/0!"}},{"$f":" 1 + 0.001 * (Attenuation_Partition_Coefficient_Kd_Species_2) * (Attenuation_Dry_bulk_density) / (Hydrogeology_Porosity    Hydrogeology!$M:$M)","v":{"$error":"#DIV/0!"}},{"$f":" 1 + 0.001 * (Attenuation_Partition_Coefficient_Kd_Species_2) * (Attenuation_Dry_bulk_density) / (Hydrogeology_Porosity    Hydrogeology!$N:$N)","v":{"$error":"#DIV/0!"}},{"$f":" 1 + 0.001 * (Attenuation_Partition_Coefficient_Kd_Species_2) * (Attenuation_Dry_bulk_density) / (Hydrogeology_Porosity    Hydrogeology!$O:$O)","v":{"$error":"#DIV/0!"}},{"$f":" 1 + 0.001 * (Attenuation_Partition_Coefficient_Kd_Species_2) * (Attenuation_Dry_bulk_density) / (Hydrogeology_Porosity    Hydrogeology!$P:$P)","v":{"$error":"#DIV/0!"}},{"$f":" 1 + 0.001 * (Attenuation_Partition_Coefficient_Kd_Species_2) * (Attenuation_Dry_bulk_density) / (Hydrogeology_Porosity    Hydrogeology!$Q:$Q)","v":{"$error":"#DIV/0!"}},{"$f":" 1 + 0.001 * (Attenuation_Partition_Coefficient_Kd_Species_2) * (Attenuation_Dry_bulk_density) / (Hydrogeology_Porosity    Hydrogeology!$R:$R)","v":{"$error":"#DIV/0!"}}]
["Distribution",null,"constant","constant","constant","constant","constant","constant","constant","constant","constant","constant","constant","constant","constant","constant","constant","constant"]
["Attenuation_Retardation_Species_2_param1"]
["Attenuation_Retardation_Species_2_param2"]
["Attenuation_Retardation_Species_2_param3"]
[]
[]
["Attenuation_Half_Life_Species_2","days","No Decay","No Decay","No Decay","No Decay","No Decay","No Decay","No Decay","No Decay","No Decay","No Decay","No Decay","No Decay","No Decay","No Decay","No Decay","No Decay"]
["Distribution",null,"constant","constant","constant","constant","constant","constant","constant","constant","constant","constant","constant","constant","constant","constant","constant","constant"]
["Attenuation_Half_Life_Species_2_param1"]
["Attenuation_Half_Life_Species_2_param2"]
["Attenuation_Half_Life_Species_2_param3"]
[]
[]
["Attenuation_Decay_Coefficient_Species_2","1/s",{"$f":" IF((Attenuation_Half_Life_Species_2)<>\"No Decay\", LN(2) / ((Attenuation_Half_Life_Species_2) * s_per_day),0)","v":0},0,0,0,0,0,0,0,0,0,0,0,0,0,0,0]
["Distribution",null,"constant","constant","constant","constant","constant","constant","constant","constant","constant","constant","constant","constant","constant","constant","constant","constant"]
["Attenuation_Decay_Coefficient_Species_2_param1"]
["Attenuation_Decay_Coefficient_Species_2_param2"]
["Attenuation_Decay_Coefficient_Species_2_param3"]
[]
[]
[{"$f":" IF((Contaminants_Source_determinand_names   Contaminants_Species3)=0,\"Undefined\",(Contaminants_Source_determinand_names   Contaminants_Species3))","v":"Benzene"}]
[]
["Attenuation_Partition_Coefficient_Kd_Species_3","L/kg",{"$f":" (Attenuation_Fraction_organic_carbon) * (Contaminants_Organic_Carbon_Water_Partition_Coefficient_Koc  Contaminants_Species3)","v":6.6000000000000003E-2},{"$f":" (Attenuation_Fraction_organic_carbon) * (Contaminants_Organic_Carbon_Water_Partition_Coefficient_Koc  Contaminants_Species3)","v":6.6000000000000003E-2},{"$f":" (Attenuation_Fraction_organic_carbon) * (Contaminants_Organic_Carbon_Water_Partition_Coefficient_Koc  Contaminants_Species3)","v":0.66},{"$f":" (Attenuation_Fraction_organic_carbon) * (Contaminants_Organic_Carbon_Water_Partition_Coefficient_Koc  Contaminants_Species3)","v":0},{"$f":" (Attenuation_Fraction_organic_carbon) * (Contaminants_Organic_Carbon_Water_Partition_Coefficient_Koc  Contaminants_Species3)","v":0},{"$f":" (Attenuation_Fraction_organic_carbon) * (Contaminants_Organic_Carbon_Water_Partition_Coefficient_Koc  Contaminants_Species3)","v":0},{"$f":" (Attenuation_Fraction_organic_carbon) * (Contaminants_Organic_Carbon_Water_Partition_Coefficient_Koc  Contaminants_Species3)","v":0},{"$f":" (Attenuation_Fraction_organic_carbon) * (Contaminants_Organic_Carbon_Water_Partition_Coefficient_Koc  Contaminants_Species3)","v":0},{"$f":" (Attenuation_Fraction_organic_carbon) * (Contaminants_Organic_Carbon_Water_Partition_Coefficient_Koc  Contaminants_Species3)","v":0},{"$f":" (Attenuation_Fraction_organic_carbon) * (Contaminants_Organic_Carbon_Water_Partition_Coefficient_Koc  Contaminants_Species3)","v":0},{"$f":" (Attenuation_Fraction_organic_carbon) * (Contaminants_Organic_Carbon_Water_Partition_Coefficient_Koc  Contaminants_Species3)","v":0},{"$f":" (Attenuation_Fraction_organic_carbon) * (Contaminants_Organic_Carbon_Water_Partition_Coefficient_Koc  Contaminants_Species3)","v":0},{"$f":" (Attenuation_Fraction_organic_carbon) * (Contaminants_Organic_Carbon_Water_Partition_Coefficient_Koc  Contaminants_Species3)","v":0},{"$f":" (Attenuation_Fraction_organic_carbon) * (Contaminants_Organic_Carbon_Water_Partition_Coefficient_Koc  Contaminants_Species3)","v":0},{"$f":" (Attenuation_Fraction_organic_carbon) * (Contaminants_Organic_Carbon_Water_Partition_Coefficient_Koc  Contaminants_Species3)","v":0},{"$f":" (Attenuation_Fraction_organic_carbon) * (Contaminants_Organic_Carbon_Water_Partition_Coefficient_Koc  Contaminants_Species3)","v":0}]
["Distribution",null,"constant","constant","constant","constant","constant","constant","constant","constant","constant","constant","constant","constant","constant","constant","constant","constant"]
["Attenuation_Partition_Coefficient_Kd_Species_3_param1"]
["Attenuation_Partition_Coefficient_Kd_Species_3_param2"]
["Attenuation_Partition_Coefficient_Kd_Species_3_param3"]
[]
[]
["Attenuation_Retardation_Species_3","[-]",{"$f":" 1 + 0.001 * (Attenuation_Partition_Coefficient_Kd_Species_3) * (Attenuation_Dry_bulk_density) / (Hydrogeology_Porosity    Hydrogeology!$C:$C)","v":1.5377777777777779},{"$f":" 1 + 0.001 * (Attenuation_Partition_Coefficient_Kd_Species_3) * (Attenuation_Dry_bulk_density) / (Hydrogeology_Porosity    Hydrogeology!$D:$D)","v":1.5377777777777779},{"$f":" 1 + 0.001 * (Attenuation_Partition_Coefficient_Kd_Species_3) * (Attenuation_Dry_bulk_density) / (Hydrogeology_Porosity    Hydrogeology!$E:$E)","v":3.64},{"$f":" 1 + 0.001 * (Attenuation_Partition_Coefficient_Kd_Species_3) * (Attenuation_Dry_bulk_density) / (Hydrogeology_Porosity    Hydrogeology!$F:$F)","v":{"$error":"#DIV/0!"}},{"$f":" 1 + 0.001 * (Attenuation_Partition_Coefficient_Kd_Species_3) * (Attenuation_Dry_bulk_density) / (Hydrogeology_Porosity    Hydrogeology!$G:$G)","v":{"$error":"#DIV/0!"}},{"$f":" 1 + 0.001 * (Attenuation_Partition_Coefficient_Kd_Species_3) * (Attenuation_Dry_bulk_density) / (Hydrogeology_Porosity    Hydrogeology!$H:$H)","v":{"$error":"#DIV/0!"}},{"$f":" 1 + 0.001 * (Attenuation_Partition_Coefficient_Kd_Species_3) * (Attenuation_Dry_bulk_density) / (Hydrogeology_Porosity    Hydrogeology!$I:$I)","v":{"$error":"#DIV/0!"}},{"$f":" 1 + 0.001 * (Attenuation_Partition_Coefficient_Kd_Species_3) * (Attenuation_Dry_bulk_density) / (Hydrogeology_Porosity    Hydrogeology!$J:$J)","v":{"$error":"#DIV/0!"}},{"$f":" 1 + 0.001 * (Attenuation_Partition_Coefficient_Kd_Species_3) * (Attenuation_Dry_bulk_density) / (Hydrogeology_Porosity    Hydrogeology!$K:$K)","v":{"$error":"#DIV/0!"}},{"$f":" 1 + 0.001 * (Attenuation_Partition_Coefficient_Kd_Species_3) * (Attenuation_Dry_bulk_density) / (Hydrogeology_Porosity    Hydrogeology!$L:$L)","v":{"$error":"#DIV/0!"}},{"$f":" 1 + 0.001 * (Attenuation_Partition_Coefficient_Kd_Species_3) * (Attenuation_Dry_bulk_density) / (Hydrogeology_Porosity    Hydrogeology!$M:$M)","v":{"$error":"#DIV/0!"}},{"$f":" 1 + 0.001 * (Attenuation_Partition_Coefficient_Kd_Species_3) * (Attenuation_Dry_bulk_density) / (Hydrogeology_Porosity    Hydrogeology!$N:$N)","v":{"$error":"#DIV/0!"}},{"$f":" 1 + 0.001 * (Attenuation_Partition_Coefficient_Kd_Species_3) * (Attenuation_Dry_bulk_density) / (Hydrogeology_Porosity    Hydrogeology!$O:$O)","v":{"$error":"#DIV/0!"}},{"$f":" 1 + 0.001 * (Attenuation_Partition_Coefficient_Kd_Species_3) * (Attenuation_Dry_bulk_density) / (Hydrogeology_Porosity    Hydrogeology!$P:$P)","v":{"$error":"#DIV/0!"}},{"$f":" 1 + 0.001 * (Attenuation_Partition_Coefficient_Kd_Species_3) * (Attenuation_Dry_bulk_density) / (Hydrogeology_Porosity    Hydrogeology!$Q:$Q)","v":{"$error":"#DIV/0!"}},{"$f":" 1 + 0.001 * (Attenuation_Partition_Coefficient_Kd_Species_3) * (Attenuation_Dry_bulk_density) / (Hydrogeology_Porosity    Hydrogeology!$R:$R)","v":{"$error":"#DIV/0!"}}]
["Distribution",null,"constant","constant","constant","constant","constant","constant","constant","constant","constant","constant","constant","constant","constant","constant","constant","constant"]
["Attenuation_Retardation_Species_3_param1"]
["Attenuation_Retardation_Species_3_param2"]
["Attenuation_Retardation_Species_3_param3"]
[]
[]
["Attenuation_Half_Life_Species_3","days",198,198,198,"No Decay","No Decay","No Decay","No Decay","No Decay","No Decay","No Decay","No Decay","No Decay","No Decay","No Decay","No Decay","No Decay"]
["Distribution",null,"constant","constant","constant","constant","constant","constant","constant","constant","constant","constant","constant","constant","constant","constant","constant","constant"]
["Attenuation_Half_Life_Species_3_param1"]
["Attenuation_Half_Life_Species_3_param2"]
["Attenuation_Half_Life_Species_3_param3"]
[]
[]
["Attenuation_Decay_Coefficient_Species_3","1/s",{"$f":" IF((Attenuation_Half_Life_Species_3)<>\"No Decay\", LN(2) / ((Attenuation_Half_Life_Species_3) * s_per_day),0)","v":4.0517862687052546E-8},4.0517862687052546E-8,4.0517862687052546E-8,0,0,0,0,0,0,0,0,0,0,0,0,0]
["Distribution",null,"constant","constant","constant","constant","constant","constant","constant","constant","constant","constant","constant","constant","constant","constant","constant","constant"]
["Attenuation_Decay_Coefficient_Species_3_param1"]
["Attenuation_Decay_Coefficient_Species_3_param2"]
["Attenuation_Decay_Coefficient_Species_3_param3"]
[]
[]
[{"$f":" IF((Contaminants_Source_determinand_names   Contaminants_Species4)=0,\"Undefined\",(Contaminants_Source_determinand_names   Contaminants_Species4))","v":"BaP"}]
[]
["Attenuation_Partition_Coefficient_Kd_Species_4","L/kg",{"$f":" (Attenuation_Fraction_organic_carbon) * (Contaminants_Organic_Carbon_Water_Partition_Coefficient_Koc  Contaminants_Species4)","v":1170},{"$f":" (Attenuation_Fraction_organic_carbon) * (Contaminants_Organic_Carbon_Water_Partition_Coefficient_Koc  Contaminants_Species4)","v":1170},{"$f":" (Attenuation_Fraction_organic_carbon) * (Contaminants_Organic_Carbon_Water_Partition_Coefficient_Koc  Contaminants_Species4)","v":11700},{"$f":" (Attenuation_Fraction_organic_carbon) * (Contaminants_Organic_Carbon_Water_Partition_Coefficient_Koc  Contaminants_Species4)","v":0},{"$f":" (Attenuation_Fraction_organic_carbon) * (Contaminants_Organic_Carbon_Water_Partition_Coefficient_Koc  Contaminants_Species4)","v":0},{"$f":" (Attenuation_Fraction_organic_carbon) * (Contaminants_Organic_Carbon_Water_Partition_Coefficient_Koc  Contaminants_Species4)","v":0},{"$f":" (Attenuation_Fraction_organic_carbon) * (Contaminants_Organic_Carbon_Water_Partition_Coefficient_Koc  Contaminants_Species4)","v":0},{"$f":" (Attenuation_Fraction_organic_carbon) * (Contaminants_Organic_Carbon_Water_Partition_Coefficient_Koc  Contaminants_Species4)","v":0},{"$f":" (Attenuation_Fraction_organic_carbon) * (Contaminants_Organic_Carbon_Water_Partition_Coefficient_Koc  Contaminants_Species4)","v":0},{"$f":" (Attenuation_Fraction_organic_carbon) * (Contaminants_Organic_Carbon_Water_Partition_Coefficient_Koc  Contaminants_Species4)","v":0},{"$f":" (Attenuation_Fraction_organic_carbon) * (Contaminants_Organic_Carbon_Water_Partition_Coefficient_Koc  Contaminants_Species4)","v":0},{"$f":" (Attenuation_Fraction_organic_carbon) * (Contaminants_Organic_Carbon_Water_Partition_Coefficient_Koc  Contaminants_Species4)","v":0},{"$f":" (Attenuation_Fraction_organic_carbon) * (Contaminants_Organic_Carbon_Water_Partition_Coefficient_Koc  Contaminants_Species4)","v":0},{"$f":" (Attenuation_Fraction_organic_carbon) * (Contaminants_Organic_Carbon_Water_Partition_Coefficient_Koc  Contaminants_Species4)","v":0},{"$f":" (Attenuation_Fraction_organic_carbon) * (Contaminants_Organic_Carbon_Water_Partition_Coefficient_Koc  Contaminants_Species4)","v":0},{"$f":" (Attenuation_Fraction_organic_carbon) * (Contaminants_Organic_Carbon_Water_Partition_Coefficient_Koc  Contaminants_Species4)","v":0}]
["Distribution",null,"constant","constant","constant","constant","constant","constant","constant","constant","constant","constant","constant","constant","constant","constant","constant","constant"]
["Attenuation_Partition_Coefficient_Kd_Species_4_param1"]
["Attenuation_Partition_Coefficient_Kd_Species_4_param2"]
["Attenuation_Partition_Coefficient_Kd_Species_4_param3"]
[]
[]
["Attenuation_Retardation_Species_4","[-]",{"$f":" 1 + 0.001 * (Attenuation_Partition_Coefficient_Kd_Species_4) * (Attenuation_Dry_bulk_density) / (Hydrogeology_Porosity    Hydrogeology!$C:$C)","v":9534.3333333333321},{"$f":" 1 + 0.001 * (Attenuation_Partition_Coefficient_Kd_Species_4) * (Attenuation_Dry_bulk_density) / (Hydrogeology_Porosity    Hydrogeology!$D:$D)","v":9534.3333333333321},{"$f":" 1 + 0.001 * (Attenuation_Partition_Coefficient_Kd_Species_4) * (Attenuation_Dry_bulk_density) / (Hydrogeology_Porosity    Hydrogeology!$E:$E)","v":46801},{"$f":" 1 + 0.001 * (Attenuation_Partition_Coefficient_Kd_Species_4) * (Attenuation_Dry_bulk_density) / (Hydrogeology_Porosity    Hydrogeology!$F:$F)","v":{"$error":"#DIV/0!"}},{"$f":" 1 + 0.001 * (Attenuation_Partition_Coefficient_Kd_Species_4) * (Attenuation_Dry_bulk_density) / (Hydrogeology_Porosity    Hydrogeology!$G:$G)","v":{"$error":"#DIV/0!"}},{"$f":" 1 + 0.001 * (Attenuation_Partition_Coefficient_Kd_Species_4) * (Attenuation_Dry_bulk_density) / (Hydrogeology_Porosity    Hydrogeology!$H:$H)","v":{"$error":"#DIV/0!"}},{"$f":" 1 + 0.001 * (Attenuation_Partition_Coefficient_Kd_Species_4) * (Attenuation_Dry_bulk_density) / (Hydrogeology_Porosity    Hydrogeology!$I:$I)","v":{"$error":"#DIV/0!"}},{"$f":" 1 + 0.001 * (Attenuation_Partition_Coefficient_Kd_Species_4) * (Attenuation_Dry_bulk_density) / (Hydrogeology_Porosity    Hydrogeology!$J:$J)","v":{"$error":"#DIV/0!"}},{"$f":" 1 + 0.001 * (Attenuation_Partition_Coefficient_Kd_Species_4) * (Attenuation_Dry_bulk_density) / (Hydrogeology_Porosity    Hydrogeology!$K:$K)","v":{"$error":"#DIV/0!"}},{"$f":" 1 + 0.001 * (Attenuation_Partition_Coefficient_Kd_Species_4) * (Attenuation_Dry_bulk_density) / (Hydrogeology_Porosity    Hydrogeology!$L:$L)","v":{"$error":"#DIV/0!"}},{"$f":" 1 + 0.001 * (Attenuation_Partition_Coefficient_Kd_Species_4) * (Attenuation_Dry_bulk_density) / (Hydrogeology_Porosity    Hydrogeology!$M:$M)","v":{"$error":"#DIV/0!"}},{"$f":" 1 + 0.001 * (Attenuation_Partition_Coefficient_Kd_Species_4) * (Attenuation_Dry_bulk_density) / (Hydrogeology_Porosity    Hydrogeology!$N:$N)","v":{"$error":"#DIV/0!"}},{"$f":" 1 + 0.001 * (Attenuation_Partition_Coefficient_Kd_Species_4) * (Attenuation_Dry_bulk_density) / (Hydrogeology_Porosity    Hydrogeology!$O:$O)","v":{"$error":"#DIV/0!"}},{"$f":" 1 + 0.001 * (Attenuation_Partition_Coefficient_Kd_Species_4) * (Attenuation_Dry_bulk_density) / (Hydrogeology_Porosity    Hydrogeology!$P:$P)","v":{"$error":"#DIV/0!"}},{"$f":" 1 + 0.001 * (Attenuation_Partition_Coefficient_Kd_Species_4) * (Attenuation_Dry_bulk_density) / (Hydrogeology_Porosity    Hydrogeology!$Q:$Q)","v":{"$error":"#DIV/0!"}},{"$f":" 1 + 0.001 * (Attenuation_Partition_Coefficient_Kd_Species_4) * (Attenuation_Dry_bulk_density) / (Hydrogeology_Porosity    Hydrogeology!$R:$R)","v":{"$error":"#DIV/0!"}}]
["Distribution",null,"constant","constant","constant","constant","constant","constant","constant","constant","constant","constant","constant","constant","constant","constant","constant","constant"]
["Attenuation_Retardation_Species_4_param1"]
["Attenuation_Retardation_Species_4_param2"]
["Attenuation_Retardation_Species_4_param3"]
[]
[]
["Attenuation_Half_Life_Species_4","days",830,830,830,"No Decay","No Decay","No Decay","No Decay","No Decay","No Decay","No Decay","No Decay","No Decay","No Decay","No Decay","No Decay","No Decay"]
["Distribution",null,"constant","constant","constant","constant","constant","constant","constant","constant","constant","constant","constant","constant","constant","constant","constant","constant"]
["Attenuation_Half_Life_Species_4_param1"]
["Attenuation_Half_Life_Species_4_param2"]
["Attenuation_Half_Life_Species_4_param3"]
[]
[]
["Attenuation_Decay_Coefficient_Species_4","1/s",{"$f":" IF((Attenuation_Half_Life_Species_4)<>\"No Decay\", LN(2) / ((Attenuation_Half_Life_Species_4) * s_per_day),0)","v":9.6657070024534983E-9},9.6657070024534983E-9,9.6657070024534983E-9,0,0,0,0,0,0,0,0,0,0,0,0,0]
["Distribution",null,"constant","constant","constant","constant","constant","constant","constant","constant","constant","constant","constant","constant","constant","constant","constant","constant"]
["Attenuation_Decay_Coefficient_Species_4_param1"]
["Attenuation_Decay_Coefficient_Species_4_param2"]
["Attenuation_Decay_Coefficient_Species_4_param3"]
[]
[]
[{"$f":" IF((Contaminants_Source_determinand_names   Contaminants_Species5)=0,\"Undefined\",(Contaminants_Source_determinand_names   Contaminants_Species5))","v":"Undefined"}]
[]
["Attenuation_Partition_Coefficient_Kd_Species_5","L/kg",{"$f":" (Attenuation_Fraction_organic_carbon) * (Contaminants_Organic_Carbon_Water_Partition_Coefficient_Koc  Contaminants_Species5)","v":0},{"$f":" (Attenuation_Fraction_organic_carbon) * (Contaminants_Organic_Carbon_Water_Partition_Coefficient_Koc  Contaminants_Species5)","v":0},{"$f":" (Attenuation_Fraction_organic_carbon) * (Contaminants_Organic_Carbon_Water_Partition_Coefficient_Koc  Contaminants_Species5)","v":0},{"$f":" (Attenuation_Fraction_organic_carbon) * (Contaminants_Organic_Carbon_Water_Partition_Coefficient_Koc  Contaminants_Species5)","v":0},{"$f":" (Attenuation_Fraction_organic_carbon) * (Contaminants_Organic_Carbon_Water_Partition_Coefficient_Koc  Contaminants_Species5)","v":0},{"$f":" (Attenuation_Fraction_organic_carbon) * (Contaminants_Organic_Carbon_Water_Partition_Coefficient_Koc  Contaminants_Species5)","v":0},{"$f":" (Attenuation_Fraction_organic_carbon) * (Contaminants_Organic_Carbon_Water_Partition_Coefficient_Koc  Contaminants_Species5)","v":0},{"$f":" (Attenuation_Fraction_organic_carbon) * (Contaminants_Organic_Carbon_Water_Partition_Coefficient_Koc  Contaminants_Species5)","v":0},{"$f":" (Attenuation_Fraction_organic_carbon) * (Contaminants_Organic_Carbon_Water_Partition_Coefficient_Koc  Contaminants_Species5)","v":0},{"$f":" (Attenuation_Fraction_organic_carbon) * (Contaminants_Organic_Carbon_Water_Partition_Coefficient_Koc  Contaminants_Species5)","v":0},{"$f":" (Attenuation_Fraction_organic_carbon) * (Contaminants_Organic_Carbon_Water_Partition_Coefficient_Koc  Contaminants_Species5)","v":0},{"$f":" (Attenuation_Fraction_organic_carbon) * (Contaminants_Organic_Carbon_Water_Partition_Coefficient_Koc  Contaminants_Species5)","v":0},{"$f":" (Attenuation_Fraction_organic_carbon) * (Contaminants_Organic_Carbon_Water_Partition_Coefficient_Koc  Contaminants_Species5)","v":0},{"$f":" (Attenuation_Fraction_organic_carbon) * (Contaminants_Organic_Carbon_Water_Partition_Coefficient_Koc  Contaminants_Species5)","v":0},{"$f":" (Attenuation_Fraction_organic_carbon) * (Contaminants_Organic_Carbon_Water_Partition_Coefficient_Koc  Contaminants_Species5)","v":0},{"$f":" (Attenuation_Fraction_organic_carbon) * (Contaminants_Organic_Carbon_Water_Partition_Coefficient_Koc  Contaminants_Species5)","v":0}]
["Distribution",null,"constant","constant","constant","constant","constant","constant","constant","constant","constant","constant","constant","constant","constant","constant","constant","constant"]
["Attenuation_Partition_Coefficient_Kd_Species_5_param1"]
["Attenuation_Partition_Coefficient_Kd_Species_5_param2"]
["Attenuation_Partition_Coefficient_Kd_Species_5_param3"]
[]
[]
["Attenuation_Retardation_Species_5","[-]",{"$f":" 1 + 0.001 * (Attenuation_Partition_Coefficient_Kd_Species_5) * (Attenuation_Dry_bulk_density) / (Hydrogeology_Porosity    Hydrogeology!$C:$C)","v":1},{"$f":" 1 + 0.001 * (Attenuation_Partition_Coefficient_Kd_Species_5) * (Attenuation_Dry_bulk_density) / (Hydrogeology_Porosity    Hydrogeology!$D:$D)","v":1},{"$f":" 1 + 0.001 * (Attenuation_Partition_Coefficient_Kd_Species_5) * (Attenuation_Dry_bulk_density) / (Hydrogeology_Porosity    Hydrogeology!$E:$E)","v":1},{"$f":" 1 + 0.001 * (Attenuation_Partition_Coefficient_Kd_Species_5) * (Attenuation_Dry_bulk_density) / (Hydrogeology_Porosity    Hydrogeology!$F:$F)","v":{"$error":"#DIV/0!"}},{"$f":" 1 + 0.001 * (Attenuation_Partition_Coefficient_Kd_Species_5) * (Attenuation_Dry_bulk_density) / (Hydrogeology_Porosity    Hydrogeology!$G:$G)","v":{"$error":"#DIV/0!"}},{"$f":" 1 + 0.001 * (Attenuation_Partition_Coefficient_Kd_Species_5) * (Attenuation_Dry_bulk_density) / (Hydrogeology_Porosity    Hydrogeology!$H:$H)","v":{"$error":"#DIV/0!"}},{"$f":" 1 + 0.001 * (Attenuation_Partition_Coefficient_Kd_Species_5) * (Attenuation_Dry_bulk_density) / (Hydrogeology_Porosity    Hydrogeology!$I:$I)","v":{"$error":"#DIV/0!"}},{"$f":" 1 + 0.001 * (Attenuation_Partition_Coefficient_Kd_Species_5) * (Attenuation_Dry_bulk_density) / (Hydrogeology_Porosity    Hydrogeology!$J:$J)","v":{"$error":"#DIV/0!"}},{"$f":" 1 + 0.001 * (Attenuation_Partition_Coefficient_Kd_Species_5) * (Attenuation_Dry_bulk_density) / (Hydrogeology_Porosity    Hydrogeology!$K:$K)","v":{"$error":"#DIV/0!"}},{"$f":" 1 + 0.001 * (Attenuation_Partition_Coefficient_Kd_Species_5) * (Attenuation_Dry_bulk_density) / (Hydrogeology_Porosity    Hydrogeology!$L:$L)","v":{"$error":"#DIV/0!"}},{"$f":" 1 + 0.001 * (Attenuation_Partition_Coefficient_Kd_Species_5) * (Attenuation_Dry_bulk_density) / (Hydrogeology_Porosity    Hydrogeology!$M:$M)","v":{"$error":"#DIV/0!"}},{"$f":" 1 + 0.001 * (Attenuation_Partition_Coefficient_Kd_Species_5) * (Attenuation_Dry_bulk_density) / (Hydrogeology_Porosity    Hydrogeology!$N:$N)","v":{"$error":"#DIV/0!"}},{"$f":" 1 + 0.001 * (Attenuation_Partition_Coefficient_Kd_Species_5) * (Attenuation_Dry_bulk_density) / (Hydrogeology_Porosity    Hydrogeology!$O:$O)","v":{"$error":"#DIV/0!"}},{"$f":" 1 + 0.001 * (Attenuation_Partition_Coefficient_Kd_Species_5) * (Attenuation_Dry_bulk_density) / (Hydrogeology_Porosity    Hydrogeology!$P:$P)","v":{"$error":"#DIV/0!"}},{"$f":" 1 + 0.001 * (Attenuation_Partition_Coefficient_Kd_Species_5) * (Attenuation_Dry_bulk_density) / (Hydrogeology_Porosity    Hydrogeology!$Q:$Q)","v":{"$error":"#DIV/0!"}},{"$f":" 1 + 0.001 * (Attenuation_Partition_Coefficient_Kd_Species_5) * (Attenuation_Dry_bulk_density) / (Hydrogeology_Porosity    Hydrogeology!$R:$R)","v":{"$error":"#DIV/0!"}}]
["Distribution",null,"constant","constant","constant","constant","constant","constant","constant","constant","constant","constant","constant","constant","constant","constant","constant","constant"]
["Attenuation_Retardation_Species_5_param1"]
["Attenuation_Retardation_Species_5_param2"]
["Attenuation_Retardation_Species_5_param3"]
[]
[]
["Attenuation_Half_Life_Species_5","days","No Decay","No Decay","No Decay","No Decay","No Decay","No Decay","No Decay","No Decay","No Decay","No Decay","No Decay","No Decay","No Decay","No Decay","No Decay","No Decay"]
["Distribution",null,"constant","constant","constant","constant","constant","constant","constant","constant","constant","constant","constant","constant","constant","constant","constant","constant"]
["Attenuation_Half_Life_Species_5_param1"]
["Attenuation_Half_Life_Species_5_param2"]
["Attenuation_Half_Life_Species_5_param3"]
[]
[]
["Attenuation_Decay_Coefficient_Species_5","1/s",{"$f":" IF((Attenuation_Half_Life_Species_5)<>\"No Decay\", LN(2) / ((Attenuation_Half_Life_Species_5) * s_per_day),0)","v":0},0,0,0,0,0,0,0,0,0,0,0,0,0,0,0]
["Distribution",null,"constant","constant","constant","constant","constant","constant","constant","constant","constant","constant","constant","constant","constant","constant","constant","constant"]
["Attenuation_Decay_Coefficient_Species_5_param1"]
["Attenuation_Decay_Coefficient_Species_5_param2"]
["Attenuation_Decay_Coefficient_Species_5_param3"]
[]
[]
[{"$f":" IF((Contaminants_Source_determinand_names   Contaminants_Species6)=0,\"Undefined\",(Contaminants_Source_determinand_names   Contaminants_Species6))","v":"Undefined"}]
[]
["Attenuation_Partition_Coefficient_Kd_Species_6","L/kg",{"$f":" (Attenuation_Fraction_organic_carbon) * (Contaminants_Organic_Carbon_Water_Partition_Coefficient_Koc  Contaminants_Species6)","v":0},{"$f":" (Attenuation_Fraction_organic_carbon) * (Contaminants_Organic_Carbon_Water_Partition_Coefficient_Koc  Contaminants_Species6)","v":0},{"$f":" (Attenuation_Fraction_organic_carbon) * (Contaminants_Organic_Carbon_Water_Partition_Coefficient_Koc  Contaminants_Species6)","v":0},{"$f":" (Attenuation_Fraction_organic_carbon) * (Contaminants_Organic_Carbon_Water_Partition_Coefficient_Koc  Contaminants_Species6)","v":0},{"$f":" (Attenuation_Fraction_organic_carbon) * (Contaminants_Organic_Carbon_Water_Partition_Coefficient_Koc  Contaminants_Species6)","v":0},{"$f":" (Attenuation_Fraction_organic_carbon) * (Contaminants_Organic_Carbon_Water_Partition_Coefficient_Koc  Contaminants_Species6)","v":0},{"$f":" (Attenuation_Fraction_organic_carbon) * (Contaminants_Organic_Carbon_Water_Partition_Coefficient_Koc  Contaminants_Species6)","v":0},{"$f":" (Attenuation_Fraction_organic_carbon) * (Contaminants_Organic_Carbon_Water_Partition_Coefficient_Koc  Contaminants_Species6)","v":0},{"$f":" (Attenuation_Fraction_organic_carbon) * (Contaminants_Organic_Carbon_Water_Partition_Coefficient_Koc  Contaminants_Species6)","v":0},{"$f":" (Attenuation_Fraction_organic_carbon) * (Contaminants_Organic_Carbon_Water_Partition_Coefficient_Koc  Contaminants_Species6)","v":0},{"$f":" (Attenuation_Fraction_organic_carbon) * (Contaminants_Organic_Carbon_Water_Partition_Coefficient_Koc  Contaminants_Species6)","v":0},{"$f":" (Attenuation_Fraction_organic_carbon) * (Contaminants_Organic_Carbon_Water_Partition_Coefficient_Koc  Contaminants_Species6)","v":0},{"$f":" (Attenuation_Fraction_organic_carbon) * (Contaminants_Organic_Carbon_Water_Partition_Coefficient_Koc  Contaminants_Species6)","v":0},{"$f":" (Attenuation_Fraction_organic_carbon) * (Contaminants_Organic_Carbon_Water_Partition_Coefficient_Koc  Contaminants_Species6)","v":0},{"$f":" (Attenuation_Fraction_organic_carbon) * (Contaminants_Organic_Carbon_Water_Partition_Coefficient_Koc  Contaminants_Species6)","v":0},{"$f":" (Attenuation_Fraction_organic_carbon) * (Contaminants_Organic_Carbon_Water_Partition_Coefficient_Koc  Contaminants_Species6)","v":0}]
["Distribution",null,"constant","constant","constant","constant","constant","constant","constant","constant","constant","constant","constant","constant","constant","constant","constant","constant"]
["Attenuation_Partition_Coefficient_Kd_Species_6_param1"]
["Attenuation_Partition_Coefficient_Kd_Species_6_param2"]
["Attenuation_Partition_Coefficient_Kd_Species_6_param3"]
[]
[]
["Attenuation_Retardation_Species_6","[-]",{"$f":" 1 + 0.001 * (Attenuation_Partition_Coefficient_Kd_Species_6) * (Attenuation_Dry_bulk_density) / (Hydrogeology_Porosity    Hydrogeology!$C:$C)","v":1},{"$f":" 1 + 0.001 * (Attenuation_Partition_Coefficient_Kd_Species_6) * (Attenuation_Dry_bulk_density) / (Hydrogeology_Porosity    Hydrogeology!$D:$D)","v":1},{"$f":" 1 + 0.001 * (Attenuation_Partition_Coefficient_Kd_Species_6) * (Attenuation_Dry_bulk_density) / (Hydrogeology_Porosity    Hydrogeology!$E:$E)","v":1},{"$f":" 1 + 0.001 * (Attenuation_Partition_Coefficient_Kd_Species_6) * (Attenuation_Dry_bulk_density) / (Hydrogeology_Porosity    Hydrogeology!$F:$F)","v":{"$error":"#DIV/0!"}},{"$f":" 1 + 0.001 * (Attenuation_Partition_Coefficient_Kd_Species_6) * (Attenuation_Dry_bulk_density) / (Hydrogeology_Porosity    Hydrogeology!$G:$G)","v":{"$error":"#DIV/0!"}},{"$f":" 1 + 0.001 * (Attenuation_Partition_Coefficient_Kd_Species_6) * (Attenuation_Dry_bulk_density) / (Hydrogeology_Porosity    Hydrogeology!$H:$H)","v":{"$error":"#DIV/0!"}},{"$f":" 1 + 0.001 * (Attenuation_Partition_Coefficient_Kd_Species_6) * (Attenuation_Dry_bulk_density) / (Hydrogeology_Porosity    Hydrogeology!$I:$I)","v":{"$error":"#DIV/0!"}},{"$f":" 1 + 0.001 * (Attenuation_Partition_Coefficient_Kd_Species_6) * (Attenuation_Dry_bulk_density) / (Hydrogeology_Porosity    Hydrogeology!$J:$J)","v":{"$error":"#DIV/0!"}},{"$f":" 1 + 0.001 * (Attenuation_Partition_Coefficient_Kd_Species_6) * (Attenuation_Dry_bulk_density) / (Hydrogeology_Porosity    Hydrogeology!$K:$K)","v":{"$error":"#DIV/0!"}},{"$f":" 1 + 0.001 * (Attenuation_Partition_Coefficient_Kd_Species_6) * (Attenuation_Dry_bulk_density) / (Hydrogeology_Porosity    Hydrogeology!$L:$L)","v":{"$error":"#DIV/0!"}},{"$f":" 1 + 0.001 * (Attenuation_Partition_Coefficient_Kd_Species_6) * (Attenuation_Dry_bulk_density) / (Hydrogeology_Porosity    Hydrogeology!$M:$M)","v":{"$error":"#DIV/0!"}},{"$f":" 1 + 0.001 * (Attenuation_Partition_Coefficient_Kd_Species_6) * (Attenuation_Dry_bulk_density) / (Hydrogeology_Porosity    Hydrogeology!$N:$N)","v":{"$error":"#DIV/0!"}},{"$f":" 1 + 0.001 * (Attenuation_Partition_Coefficient_Kd_Species_6) * (Attenuation_Dry_bulk_density) / (Hydrogeology_Porosity    Hydrogeology!$O:$O)","v":{"$error":"#DIV/0!"}},{"$f":" 1 + 0.001 * (Attenuation_Partition_Coefficient_Kd_Species_6) * (Attenuation_Dry_bulk_density) / (Hydrogeology_Porosity    Hydrogeology!$P:$P)","v":{"$error":"#DIV/0!"}},{"$f":" 1 + 0.001 * (Attenuation_Partition_Coefficient_Kd_Species_6) * (Attenuation_Dry_bulk_density) / (Hydrogeology_Porosity    Hydrogeology!$Q:$Q)","v":{"$error":"#DIV/0!"}},{"$f":" 1 + 0.001 * (Attenuation_Partition_Coefficient_Kd_Species_6) * (Attenuation_Dry_bulk_density) / (Hydrogeology_Porosity    Hydrogeology!$R:$R)","v":{"$error":"#DIV/0!"}}]
["Distribution",null,"constant","constant","constant","constant","constant","constant","constant","constant","constant","constant","constant","constant","constant","constant","constant","constant"]
["Attenuation_Retardation_Species_6_param1"]
["Attenuation_Retardation_Species_6_param2"]
["Attenuation_Retardation_Species_6_param3"]
[]
[]
["Attenuation_Half_Life_Species_6","days","No Decay","No Decay","No Decay","No Decay","No Decay","No Decay","No Decay","No Decay","No Decay","No Decay","No Decay","No Decay","No Decay","No Decay","No Decay","No Decay"]
["Distribution",null,"constant","constant","constant","constant","constant","constant","constant","constant","constant","constant","constant","constant","constant","constant","constant","constant"]
["Attenuation_Half_Life_Species_6_param1"]
["Attenuation_Half_Life_Species_6_param2"]
["Attenuation_Half_Life_Species_6_param3"]
[]
[]
["Attenuation_Decay_Coefficient_Species_6","1/s",{"$f":" IF((Attenuation_Half_Life_Species_6)<>\"No Decay\", LN(2) / ((Attenuation_Half_Life_Species_6) * s_per_day),0)","v":0},0,0,0,0,0,0,0,0,0,0,0,0,0,0,0]
["Distribution",null,"constant","constant","constant","constant","constant","constant","constant","constant","constant","constant","constant","constant","constant","constant","constant","constant"]
["Attenuation_Decay_Coefficient_Species_6_param1"]
["Attenuation_Decay_Coefficient_Species_6_param2"]
["Attenuation_Decay_Coefficient_Species_6_param3"]
[]
[]
[{"$f":" IF((Contaminants_Source_determinand_names   Contaminants_Species7)=0,\"Undefined\",(Contaminants_Source_determinand_names   Contaminants_Species7))","v":"Undefined"}]
[]
["Attenuation_Partition_Coefficient_Kd_Species_7","L/kg",{"$f":" (Attenuation_Fraction_organic_carbon) * (Contaminants_Organic_Carbon_Water_Partition_Coefficient_Koc  Contaminants_Species7)","v":0},{"$f":" (Attenuation_Fraction_organic_carbon) * (Contaminants_Organic_Carbon_Water_Partition_Coefficient_Koc  Contaminants_Species7)","v":0},{"$f":" (Attenuation_Fraction_organic_carbon) * (Contaminants_Organic_Carbon_Water_Partition_Coefficient_Koc  Contaminants_Species7)","v":0},{"$f":" (Attenuation_Fraction_organic_carbon) * (Contaminants_Organic_Carbon_Water_Partition_Coefficient_Koc  Contaminants_Species7)","v":0},{"$f":" (Attenuation_Fraction_organic_carbon) * (Contaminants_Organic_Carbon_Water_Partition_Coefficient_Koc  Contaminants_Species7)","v":0},{"$f":" (Attenuation_Fraction_organic_carbon) * (Contaminants_Organic_Carbon_Water_Partition_Coefficient_Koc  Contaminants_Species7)","v":0},{"$f":" (Attenuation_Fraction_organic_carbon) * (Contaminants_Organic_Carbon_Water_Partition_Coefficient_Koc  Contaminants_Species7)","v":0},{"$f":" (Attenuation_Fraction_organic_carbon) * (Contaminants_Organic_Carbon_Water_Partition_Coefficient_Koc  Contaminants_Species7)","v":0},{"$f":" (Attenuation_Fraction_organic_carbon) * (Contaminants_Organic_Carbon_Water_Partition_Coefficient_Koc  Contaminants_Species7)","v":0},{"$f":" (Attenuation_Fraction_organic_carbon) * (Contaminants_Organic_Carbon_Water_Partition_Coefficient_Koc  Contaminants_Species7)","v":0},{"$f":" (Attenuation_Fraction_organic_carbon) * (Contaminants_Organic_Carbon_Water_Partition_Coefficient_Koc  Contaminants_Species7)","v":0},{"$f":" (Attenuation_Fraction_organic_carbon) * (Contaminants_Organic_Carbon_Water_Partition_Coefficient_Koc  Contaminants_Species7)","v":0},{"$f":" (Attenuation_Fraction_organic_carbon) * (Contaminants_Organic_Carbon_Water_Partition_Coefficient_Koc  Contaminants_Species7)","v":0},{"$f":" (Attenuation_Fraction_organic_carbon) * (Contaminants_Organic_Carbon_Water_Partition_Coefficient_Koc  Contaminants_Species7)","v":0},{"$f":" (Attenuation_Fraction_organic_carbon) * (Contaminants_Organic_Carbon_Water_Partition_Coefficient_Koc  Contaminants_Species7)","v":0},{"$f":" (Attenuation_Fraction_organic_carbon) * (Contaminants_Organic_Carbon_Water_Partition_Coefficient_Koc  Contaminants_Species7)","v":0}]
["Distribution",null,"constant","constant","constant","constant","constant","constant","constant","constant","constant","constant","constant","constant","constant","constant","constant","constant"]
["Attenuation_Partition_Coefficient_Kd_Species_7_param1"]
["Attenuation_Partition_Coefficient_Kd_Species_7_param2"]
["Attenuation_Partition_Coefficient_Kd_Species_7_param3"]
[]
[]
["Attenuation_Retardation_Species_7","[-]",{"$f":" 1 + 0.001 * (Attenuation_Partition_Coefficient_Kd_Species_7) * (Attenuation_Dry_bulk_density) / (Hydrogeology_Porosity    Hydrogeology!$C:$C)","v":1},{"$f":" 1 + 0.001 * (Attenuation_Partition_Coefficient_Kd_Species_7) * (Attenuation_Dry_bulk_density) / (Hydrogeology_Porosity    Hydrogeology!$D:$D)","v":1},{"$f":" 1 + 0.001 * (Attenuation_Partition_Coefficient_Kd_Species_7) * (Attenuation_Dry_bulk_density) / (Hydrogeology_Porosity    Hydrogeology!$E:$E)","v":1},{"$f":" 1 + 0.001 * (Attenuation_Partition_Coefficient_Kd_Species_7) * (Attenuation_Dry_bulk_density) / (Hydrogeology_Porosity    Hydrogeology!$F:$F)","v":{"$error":"#DIV/0!"}},{"$f":" 1 + 0.001 * (Attenuation_Partition_Coefficient_Kd_Species_7) * (Attenuation_Dry_bulk_density) / (Hydrogeology_Porosity    Hydrogeology!$G:$G)","v":{"$error":"#DIV/0!"}},{"$f":" 1 + 0.001 * (Attenuation_Partition_Coefficient_Kd_Species_7) * (Attenuation_Dry_bulk_density) / (Hydrogeology_Porosity    Hydrogeology!$H:$H)","v":{"$error":"#DIV/0!"}},{"$f":" 1 + 0.001 * (Attenuation_Partition_Coefficient_Kd_Species_7) * (Attenuation_Dry_bulk_density) / (Hydrogeology_Porosity    Hydrogeology!$I:$I)","v":{"$error":"#DIV/0!"}},{"$f":" 1 + 0.001 * (Attenuation_Partition_Coefficient_Kd_Species_7) * (Attenuation_Dry_bulk_density) / (Hydrogeology_Porosity    Hydrogeology!$J:$J)","v":{"$error":"#DIV/0!"}},{"$f":" 1 + 0.001 * (Attenuation_Partition_Coefficient_Kd_Species_7) * (Attenuation_Dry_bulk_density) / (Hydrogeology_Porosity    Hydrogeology!$K:$K)","v":{"$error":"#DIV/0!"}},{"$f":" 1 + 0.001 * (Attenuation_Partition_Coefficient_Kd_Species_7) * (Attenuation_Dry_bulk_density) / (Hydrogeology_Porosity    Hydrogeology!$L:$L)","v":{"$error":"#DIV/0!"}},{"$f":" 1 + 0.001 * (Attenuation_Partition_Coefficient_Kd_Species_7) * (Attenuation_Dry_bulk_density) / (Hydrogeology_Porosity    Hydrogeology!$M:$M)","v":{"$error":"#DIV/0!"}},{"$f":" 1 + 0.001 * (Attenuation_Partition_Coefficient_Kd_Species_7) * (Attenuation_Dry_bulk_density) / (Hydrogeology_Porosity    Hydrogeology!$N:$N)","v":{"$error":"#DIV/0!"}},{"$f":" 1 + 0.001 * (Attenuation_Partition_Coefficient_Kd_Species_7) * (Attenuation_Dry_bulk_density) / (Hydrogeology_Porosity    Hydrogeology!$O:$O)","v":{"$error":"#DIV/0!"}},{"$f":" 1 + 0.001 * (Attenuation_Partition_Coefficient_Kd_Species_7) * (Attenuation_Dry_bulk_density) / (Hydrogeology_Porosity    Hydrogeology!$P:$P)","v":{"$error":"#DIV/0!"}},{"$f":" 1 + 0.001 * (Attenuation_Partition_Coefficient_Kd_Species_7) * (Attenuation_Dry_bulk_density) / (Hydrogeology_Porosity    Hydrogeology!$Q:$Q)","v":{"$error":"#DIV/0!"}},{"$f":" 1 + 0.001 * (Attenuation_Partition_Coefficient_Kd_Species_7) * (Attenuation_Dry_bulk_density) / (Hydrogeology_Porosity    Hydrogeology!$R:$R)","v":{"$error":"#DIV/0!"}}]
["Distribution",null,"constant","constant","constant","constant","constant","constant","constant","constant","constant","constant","constant","constant","constant","constant","constant","constant"]
["Attenuation_Retardation_Species_7_param1"]
["Attenuation_Retardation_Species_7_param2"]
["Attenuation_Retardation_Species_7_param3"]
[]
[]
["Attenuation_Half_Life_Species_7","days","No Decay","No Decay","No Decay","No Decay","No Decay","No Decay","No Decay","No Decay","No Decay","No Decay","No Decay","No Decay","No Decay","No Decay","No Decay","No Decay"]
["Distribution",null,"constant","constant","constant","constant","constant","constant","constant","constant","constant","constant","constant","constant","constant","constant","constant","constant"]
["Attenuation_Half_Life_Species_7_param1"]
["Attenuation_Half_Life_Species_7_param2"]
["Attenuation_Half_Life_Species_7_param3"]
[]
[]
["Attenuation_Decay_Coefficient_Species_7","1/s",{"$f":" IF((Attenuation_Half_Life_Species_7)<>\"No Decay\", LN(2) / ((Attenuation_Half_Life_Species_7) * s_per_day),0)","v":0},0,0,0,0,0,0,0,0,0,0,0,0,0,0,0]
["Distribution",null,"constant","constant","constant","constant","constant","constant","constant","constant","constant","constant","constant","constant","constant","constant","constant","constant"]
["Attenuation_Decay_Coefficient_Species_7_param1"]
["Attenuation_Decay_Coefficient_Species_7_param2"]
["Attenuation_Decay_Coefficient_Species_7_param3"]
[]
[]
[{"$f":" IF((Contaminants_Source_determinand_names   Contaminants_Species8)=0,\"Undefined\",(Contaminants_Source_determinand_names   Contaminants_Species8))","v":"Undefined"}]
[]
["Attenuation_Partition_Coefficient_Kd_Species_8","L/kg",{"$f":" (Attenuation_Fraction_organic_carbon) * (Contaminants_Organic_Carbon_Water_Partition_Coefficient_Koc  Contaminants_Species8)","v":0},{"$f":" (Attenuation_Fraction_organic_carbon) * (Contaminants_Organic_Carbon_Water_Partition_Coefficient_Koc  Contaminants_Species8)","v":0},{"$f":" (Attenuation_Fraction_organic_carbon) * (Contaminants_Organic_Carbon_Water_Partition_Coefficient_Koc  Contaminants_Species8)","v":0},{"$f":" (Attenuation_Fraction_organic_carbon) * (Contaminants_Organic_Carbon_Water_Partition_Coefficient_Koc  Contaminants_Species8)","v":0},{"$f":" (Attenuation_Fraction_organic_carbon) * (Contaminants_Organic_Carbon_Water_Partition_Coefficient_Koc  Contaminants_Species8)","v":0},{"$f":" (Attenuation_Fraction_organic_carbon) * (Contaminants_Organic_Carbon_Water_Partition_Coefficient_Koc  Contaminants_Species8)","v":0},{"$f":" (Attenuation_Fraction_organic_carbon) * (Contaminants_Organic_Carbon_Water_Partition_Coefficient_Koc  Contaminants_Species8)","v":0},{"$f":" (Attenuation_Fraction_organic_carbon) * (Contaminants_Organic_Carbon_Water_Partition_Coefficient_Koc  Contaminants_Species8)","v":0},{"$f":" (Attenuation_Fraction_organic_carbon) * (Contaminants_Organic_Carbon_Water_Partition_Coefficient_Koc  Contaminants_Species8)","v":0},{"$f":" (Attenuation_Fraction_organic_carbon) * (Contaminants_Organic_Carbon_Water_Partition_Coefficient_Koc  Contaminants_Species8)","v":0},{"$f":" (Attenuation_Fraction_organic_carbon) * (Contaminants_Organic_Carbon_Water_Partition_Coefficient_Koc  Contaminants_Species8)","v":0},{"$f":" (Attenuation_Fraction_organic_carbon) * (Contaminants_Organic_Carbon_Water_Partition_Coefficient_Koc  Contaminants_Species8)","v":0},{"$f":" (Attenuation_Fraction_organic_carbon) * (Contaminants_Organic_Carbon_Water_Partition_Coefficient_Koc  Contaminants_Species8)","v":0},{"$f":" (Attenuation_Fraction_organic_carbon) * (Contaminants_Organic_Carbon_Water_Partition_Coefficient_Koc  Contaminants_Species8)","v":0},{"$f":" (Attenuation_Fraction_organic_carbon) * (Contaminants_Organic_Carbon_Water_Partition_Coefficient_Koc  Contaminants_Species8)","v":0},{"$f":" (Attenuation_Fraction_organic_carbon) * (Contaminants_Organic_Carbon_Water_Partition_Coefficient_Koc  Contaminants_Species8)","v":0}]
["Distribution",null,"constant","constant","constant","constant","constant","constant","constant","constant","constant","constant","constant","constant","constant","constant","constant","constant"]
["Attenuation_Partition_Coefficient_Kd_Species_8_param1"]
["Attenuation_Partition_Coefficient_Kd_Species_8_param2"]
["Attenuation_Partition_Coefficient_Kd_Species_8_param3"]
[]
[]
["Attenuation_Retardation_Species_8","[-]",{"$f":" 1 + 0.001 * (Attenuation_Partition_Coefficient_Kd_Species_8) * (Attenuation_Dry_bulk_density) / (Hydrogeology_Porosity    Hydrogeology!$C:$C)","v":1},{"$f":" 1 + 0.001 * (Attenuation_Partition_Coefficient_Kd_Species_8) * (Attenuation_Dry_bulk_density) / (Hydrogeology_Porosity    Hydrogeology!$D:$D)","v":1},{"$f":" 1 + 0.001 * (Attenuation_Partition_Coefficient_Kd_Species_8) * (Attenuation_Dry_bulk_density) / (Hydrogeology_Porosity    Hydrogeology!$E:$E)","v":1},{"$f":" 1 + 0.001 * (Attenuation_Partition_Coefficient_Kd_Species_8) * (Attenuation_Dry_bulk_density) / (Hydrogeology_Porosity    Hydrogeology!$F:$F)","v":{"$error":"#DIV/0!"}},{"$f":" 1 + 0.001 * (Attenuation_Partition_Coefficient_Kd_Species_8) * (Attenuation_Dry_bulk_density) / (Hydrogeology_Porosity    Hydrogeology!$G:$G)","v":{"$error":"#DIV/0!"}},{"$f":" 1 + 0.001 * (Attenuation_Partition_Coefficient_Kd_Species_8) * (Attenuation_Dry_bulk_density) / (Hydrogeology_Porosity    Hydrogeology!$H:$H)","v":{"$error":"#DIV/0!"}},{"$f":" 1 + 0.001 * (Attenuation_Partition_Coefficient_Kd_Species_8) * (Attenuation_Dry_bulk_density) / (Hydrogeology_Porosity    Hydrogeology!$I:$I)","v":{"$error":"#DIV/0!"}},{"$f":" 1 + 0.001 * (Attenuation_Partition_Coefficient_Kd_Species_8) * (Attenuation_Dry_bulk_density) / (Hydrogeology_Porosity    Hydrogeology!$J:$J)","v":{"$error":"#DIV/0!"}},{"$f":" 1 + 0.001 * (Attenuation_Partition_Coefficient_Kd_Species_8) * (Attenuation_Dry_bulk_density) / (Hydrogeology_Porosity    Hydrogeology!$K:$K)","v":{"$error":"#DIV/0!"}},{"$f":" 1 + 0.001 * (Attenuation_Partition_Coefficient_Kd_Species_8) * (Attenuation_Dry_bulk_density) / (Hydrogeology_Porosity    Hydrogeology!$L:$L)","v":{"$error":"#DIV/0!"}},{"$f":" 1 + 0.001 * (Attenuation_Partition_Coefficient_Kd_Species_8) * (Attenuation_Dry_bulk_density) / (Hydrogeology_Porosity    Hydrogeology!$M:$M)","v":{"$error":"#DIV/0!"}},{"$f":" 1 + 0.001 * (Attenuation_Partition_Coefficient_Kd_Species_8) * (Attenuation_Dry_bulk_density) / (Hydrogeology_Porosity    Hydrogeology!$N:$N)","v":{"$error":"#DIV/0!"}},{"$f":" 1 + 0.001 * (Attenuation_Partition_Coefficient_Kd_Species_8) * (Attenuation_Dry_bulk_density) / (Hydrogeology_Porosity    Hydrogeology!$O:$O)","v":{"$error":"#DIV/0!"}},{"$f":" 1 + 0.001 * (Attenuation_Partition_Coefficient_Kd_Species_8) * (Attenuation_Dry_bulk_density) / (Hydrogeology_Porosity    Hydrogeology!$P:$P)","v":{"$error":"#DIV/0!"}},{"$f":" 1 + 0.001 * (Attenuation_Partition_Coefficient_Kd_Species_8) * (Attenuation_Dry_bulk_density) / (Hydrogeology_Porosity    Hydrogeology!$Q:$Q)","v":{"$error":"#DIV/0!"}},{"$f":" 1 + 0.001 * (Attenuation_Partition_Coefficient_Kd_Species_8) * (Attenuation_Dry_bulk_density) / (Hydrogeology_Porosity    Hydrogeology!$R:$R)","v":{"$error":"#DIV/0!"}}]
["Distribution",null,"constant","constant","constant","constant","constant","constant","constant","constant","constant","constant","constant","constant","constant","constant","constant","constant"]
["Attenuation_Retardation_Species_8_param1"]
["Attenuation_Retardation_Species_8_param2"]
["Attenuation_Retardation_Species_8_param3"]
[]
[]
["Attenuation_Half_Life_Species_8","days","No Decay","No Decay","No Decay","No Decay","No Decay","No Decay","No Decay","No Decay","No Decay","No Decay","No Decay","No Decay","No Decay","No Decay","No Decay","No Decay"]
["Distribution",null,"constant","constant","constant","constant","constant","constant","constant","constant","constant","constant","constant","constant","constant","constant","constant","constant"]
["Attenuation_Half_Life_Species_8_param1"]
["Attenuation_Half_Life_Species_8_param2"]
["Attenuation_Half_Life_Species_8_param3"]
[]
[]
["Attenuation_Decay_Coefficient_Species_8","1/s",{"$f":" IF((Attenuation_Half_Life_Species_8)<>\"No Decay\", LN(2) / ((Attenuation_Half_Life_Species_8) * s_per_day),0)","v":0},0,0,0,0,0,0,0,0,0,0,0,0,0,0,0]
["Distribution",null,"constant","constant","constant","constant","constant","constant","constant","constant","constant","constant","constant","constant","constant","constant","constant","constant"]
["Attenuation_Decay_Coefficient_Species_8_param1"]
["Attenuation_Decay_Coefficient_Species_8_param2"]
["Attenuation_Decay_Coefficient_Species_8_param3"]

{"sheet":"WaterBalance","index":5,"n_rows":25,"n_cols":18,"rows_kept":25,"cut":false,"hidden":false,"merged":[]}
["WATER BALANCE"]
[]
["User defined"]
[]
["Enter your own calculations for the water balance"]
["Carry fluxes and velocities over onto the Pathway sheet"]
[]
[]
[]
[null,null,null,null,"Infiltration through the soil zone source"]
[null,null,null,null,"Source Name: Infill"]
[]
[null,null,null,null,"Effective_Rainfall",{"$f":"R25","v":359.1},"mm/year"]
[null,null,null,null,"Infiltration_Factor",1,"[-]"]
[null,null,null,null,"Infiltration_Rate",{"$f":"F14*F13","v":359.1},"mm/year"]
[null,null,null,null,"Infiltration_Area",{"$f":"Infill_Source_area","v":51128},"m2"]
[]
[null,null,null,null,"Q_Infiltration",{"$f":"F15*F16/1000/s_per_year","v":5.8179534565366191E-4},"m3/s"]
[]
[]
[null,null,null,null,null,null,"Jan","feb","Mar","Apr","May","Jun","Jul","Aug","Sep","Oct","Nov","Dec"]
[null,null,null,null,null,"Rainfall (mm)",65.2,53.2,46.5,57.8,69.7,64.900000000000006,76.2,70.400000000000006,54.8,91.2,79.3,71.099999999999994]
[null,null,null,null,null,"Potential transpiration (mm)",1,8,30,55,80,93,93,72,43,19,4,0]
[null,null,null,null,null,"Effective rainfall (mm)",{"$f":"G22-G23","v":64.2},{"$f":"H22-H23","v":45.2},16.5,2.7999999999999972,null,null,null,null,11.799999999999997,72.2,75.3,71.099999999999994]
[null,null,null,null,null,null,null,null,null,null,null,null,null,null,null,null,"Total ER",{"$f":"SUM(G24:R24)","v":359.1}]

{"sheet":"Pathways","index":6,"n_rows":26,"n_cols":11,"rows_kept":26,"cut":false,"hidden":false,"merged":[]}
["PATHWAY SUMMARY"]
[]
["Path 1",null,"Section 1",null,"Section 2",null,"Section 3",null,"Section 4",null,"Section 5"]
["Path 1  Type",null,"Source",null,"Unit",null,"Unit",null,"Unit",null,"Receptor"]
["Path 1  Name",null,"Infill",null,"Geo Barrier: Node 1",null,"Sst Unsaturated: Node 1",null,"Sst Saturated: Node 1",null,"Principal Aquifer"]
["Path 1  Process",null,"Declining source",null,"ADRD (1D) + Dilution",null,"ADRD (1D) + Dilution",null,"ADRD (1D) + Dilution",null,"Monitoring Borehole"]
["Path 1  Standards",null,null,null,null,null,null,null,null,"Target Standard","MRV"]
["Path 1  Parameter1","Q_managed [m3/s]",0,"Velocity [m/s]",{"$f":" (Geo_Barrier   Hydrogeology_Velocity)","v":1.2499999999999999E-8},"Velocity [m/s]",{"$f":" (Sst_Unsaturated   Hydrogeology_Velocity)","v":5.1851851851851842E-4},"Velocity [m/s]",{"$f":" (Sst_Saturated   Hydrogeology_Velocity)","v":1.037037037037037E-5}]
["Path 1  Parameter2","Managed time [years]",0,"Dispersivity [m]",{"$f":"E10/10","v":0.1},"Dispersivity [m]",{"$f":"G10/10","v":0.35},"Dispersivity [m]",{"$f":"I10/10","v":0}]
["Path 1  Parameter3","Q_path [m3/s]",{"$f":"WaterBalance!F18","v":5.8179534565366191E-4},"Travel Distance [m]",{"$f":"Hydrogeology!E5","v":1},"Travel Distance [m]",{"$f":"Hydrogeology!C5","v":3.5},"Travel Distance [m]",0]
["Path 1  Parameter4","Q_decline [m3/s]",{"$f":"WaterBalance!F18","v":5.8179534565366191E-4},"Mixing Depth [m]",null,"Mixing Depth [m]",null,"Mixing Depth [m]",{"$f":"Hydrogeology!D5","v":10}]
["Path 1  Parameter5",null,null,"Mixing Width [m]",null,"Mixing Width [m]",null,"Mixing Width [m]",{"$f":"Infill_Source_width","v":246}]
["Path 1  Parameter6",null,null,"Q_Dilute [m3/s]",{"$f":" Path1_Param5*Path1_Param4*(Geo_Barrier   Hydrogeology_Hydraulic_Conductivity)*(Geo_Barrier   Hydrogeology_Hydraulic_Gradient)","v":0},"Q_Dilute [m3/s]",{"$f":" Path1_Param5*Path1_Param4*(Sst_Unsaturated   Hydrogeology_Hydraulic_Conductivity)*(Sst_Unsaturated   Hydrogeology_Hydraulic_Gradient)","v":0},"Q_Dilute [m3/s]",{"$f":" Path1_Param5*Path1_Param4*(Sst_Saturated   Hydrogeology_Hydraulic_Conductivity)*(Sst_Saturated   Hydrogeology_Hydraulic_Gradient)","v":6.888E-3},"Q_dilute [m3/s]",0]
[]
[]
["Path 2",null,"Section 1",null,"Section 2",null,"Section 3",null,"Section 4",null,"Section 5"]
["Path 2  Type",null,"Source",null,"Unit",null,"Unit",null,"Unit",null,"Receptor"]
["Path 2  Name",null,"Infill",null,"Geo Barrier: Node 2",null,"Sst Unsaturated: Node 2",null,"Sst Saturated: Node 2",null,"Principal Aquifer at Site Boundary"]
["Path 2  Process",null,"Declining source",null,"ADRD (1D) + Dilution",null,"ADRD (1D) + Dilution",null,"ADRD (1D) + Dilution",null,"Monitoring Borehole"]
["Path 2  Standards",null,null,null,null,null,null,null,null,"Target Standard","MRV"]
["Path 2  Parameter1","Q_managed [m3/s]",0,"Velocity [m/s]",{"$f":" (Geo_Barrier   Hydrogeology_Velocity)","v":1.2499999999999999E-8},"Velocity [m/s]",{"$f":" (Sst_Unsaturated   Hydrogeology_Velocity)","v":5.1851851851851842E-4},"Velocity [m/s]",{"$f":" (Sst_Saturated   Hydrogeology_Velocity)","v":1.037037037037037E-5}]
["Path 2  Parameter2","Managed time [years]",0,"Dispersivity [m]",{"$f":"E23/10","v":0.1},"Dispersivity [m]",{"$f":"G23/10","v":0.35},"Dispersivity [m]",{"$f":"I23/10","v":10.35}]
["Path 2  Parameter3","Q_path [m3/s]",{"$f":"WaterBalance!F18","v":5.8179534565366191E-4},"Travel Distance [m]",{"$f":"Hydrogeology!E5","v":1},"Travel Distance [m]",{"$f":"Hydrogeology!C5","v":3.5},"Travel Distance [m]",{"$f":"Infill_Source_length/2","v":103.5}]
["Path 2  Parameter4","Q_decline [m3/s]",{"$f":"WaterBalance!F18","v":5.8179534565366191E-4},"Mixing Depth [m]",null,"Mixing Depth [m]",null,"Mixing Depth [m]",{"$f":"Hydrogeology!D5","v":10}]
["Path 2  Parameter5",null,null,"Mixing Width [m]",null,"Mixing Width [m]",null,"Mixing Width [m]",{"$f":"Infill_Source_width","v":246}]
["Path 2  Parameter6",null,null,"Q_Dilute [m3/s]",{"$f":" Path2_Param5*Path2_Param4*(Geo_Barrier   Hydrogeology_Hydraulic_Conductivity)*(Geo_Barrier   Hydrogeology_Hydraulic_Gradient)","v":0},"Q_Dilute [m3/s]",{"$f":" Path2_Param5*Path2_Param4*(Sst_Unsaturated   Hydrogeology_Hydraulic_Conductivity)*(Sst_Unsaturated   Hydrogeology_Hydraulic_Gradient)","v":0},"Q_Dilute [m3/s]",{"$f":" Path2_Param5*Path2_Param4*(Sst_Saturated   Hydrogeology_Hydraulic_Conductivity)*(Sst_Saturated   Hydrogeology_Hydraulic_Gradient)","v":6.888E-3},"Q_dilute [m3/s]",0]

{"sheet":"Simulation","index":7,"n_rows":68,"n_cols":12,"rows_kept":68,"cut":false,"hidden":false,"merged":[]}
["SIMULATION PARAMETERS"]
[]
[null,"Monte Carlo Analysis with Crystal Ball",null,null,null,null,null,null,null,"Named Constants"]
[]
[null,null,"Reported Percentile",null,null,95,null,null,null,null,"s_per_year",{"$f":"365.25*60*60*24","v":31557600}]
[null,null,"Number of simulations",null,null,10000,null,null,null,null,"s_per_day",{"$f":"60*60*24","v":86400}]
[]
[]
[null,null,null,null,null,null,null,null,null,"Laplace Transform Solution Parameters"]
[]
[null,null,"Minimise while running:",null,null,null,null,null,null,null,"sigma",0]
[null,null,null,null,null,null,null,null,null,null,"nu",1]
[null,null,null,null,null,null,null,null,null,null,"nsum",16]
[null,null,null,null,null,null,null,null,null,null,"omega",11]
[]
[]
[null,"Reporting Options"]
[]
[]
[]
[]
[null,null,"Number of timeslices for breakthrough curves",null,null,null,20]
[]
[null," The timeslices specified on the results sheets are saved below."]
[null,null,"Path1 timeslices in years"]
[null,null,"TS_Path1_Spec1",null,"TS_Path1_Spec2",null,"TS_Path1_Spec3",null,"TS_Path1_Spec4"]
[null,null,1,null,1,null,1,null,1]
[null,null,2,null,2,null,2,null,2]
[null,null,5,null,5,null,5,null,5]
[null,null,10,null,10,null,10,null,10]
[null,null,15,null,15,null,15,null,15]
[null,null,20,null,20,null,20,null,20]
[null,null,30,null,30,null,30,null,30]
[null,null,40,null,40,null,40,null,40]
[null,null,50,null,50,null,50,null,50]
[null,null,60,null,60,null,60,null,60]
[null,null,70,null,70,null,70,null,70]
[null,null,80,null,80,null,80,null,80]
[null,null,90,null,90,null,90,null,90]
[null,null,100,null,100,null,100,null,100]
[null,null,120,null,120,null,120,null,120]
[null,null,140,null,140,null,140,null,140]
[null,null,160,null,160,null,160,null,160]
[null,null,180,null,180,null,180,null,180]
[null,null,200,null,200,null,200,null,200]
[null,null,250,null,250,null,250,null,250]
[null,null,"Path2 timeslices in years"]
[null,null,"TS_Path2_Spec1",null,"TS_Path2_Spec2",null,"TS_Path2_Spec3",null,"TS_Path2_Spec4"]
[null,null,1,null,1,null,1,null,1]
[null,null,2,null,2,null,2,null,2]
[null,null,5,null,5,null,5,null,5]
[null,null,10,null,10,null,10,null,10]
[null,null,15,null,15,null,15,null,15]
[null,null,20,null,20,null,20,null,20]
[null,null,30,null,30,null,30,null,30]
[null,null,40,null,40,null,40,null,40]
[null,null,50,null,50,null,50,null,50]
[null,null,60,null,60,null,60,null,60]
[null,null,70,null,70,null,70,null,70]
[null,null,80,null,80,null,80,null,80]
[null,null,90,null,90,null,90,null,90]
[null,null,100,null,100,null,100,null,100]
[null,null,120,null,120,null,120,null,120]
[null,null,140,null,140,null,140,null,140]
[null,null,160,null,160,null,160,null,160]
[null,null,180,null,180,null,180,null,180]
[null,null,200,null,200,null,200,null,200]
[null,null,250,null,250,null,250,null,250]

{"sheet":"Audit","index":8,"n_rows":3703,"n_cols":18,"rows_kept":3703,"cut":false,"hidden":false,"merged":[]}
["AUDIT TRAIL SHEET"]
[]
["Author","Date","Time",null,"Cell Address",null,"New Value","Old Value","Cell Name"]
[]
["Heather MacLeod","2022-07-14","11:43:13",null,"Pathways:$E$6",null,"No Processes",null,"Path1_Process Section2"]
[]
["Heather MacLeod","2022-07-14","11:43:13",null,"Pathways:$G$6",null,"No Processes",null,"Path1_Process Section3"]
[]
["Heather MacLeod","2022-07-14","11:43:13",null,"Pathways:$E$19",null,"No Processes",null,"Path2_Process Section2"]
[]
["Heather MacLeod","2022-07-14","11:43:13",null,"Pathways:$G$19",null,"No Processes",null,"Path2_Process Section3"]
[]
["Heather MacLeod","2022-07-14","11:45:03",null,"Infill:$B$20",null,246,null,"Infill_Source_width"]
[]
["Heather MacLeod","2022-07-14","11:45:05",null,"Infill:$B$19",null,207,null,"Infill_Source_length"]
[]
["Heather MacLeod","2022-07-14","11:45:14",null,"Infill:$B$21",null,51128,50922,"Formula0"]
[]
["Heather MacLeod","2022-07-14","11:45:53",null,"Infill:$B$23",null,975000,0,"Formula1"]
[]
["Heather MacLeod","2022-07-14","11:47:44",null,"Infill:$C$28",null,0.25,null,"Infill_Source_field_capacity"]
[]
["Heather MacLeod","2022-07-14","11:48:56",null,"Infill:$C$28",null,0.2,0.25,"Infill_Source_field_capacity"]
[]
["Heather MacLeod","2022-07-14","11:49:24",null,"Contaminants:$D$4",null,"Hg",null,"Contaminants_Source_determinand_names Contaminants_Species1"]
[]
["Heather MacLeod","2022-07-14","11:49:26",null,"Contaminants:$E$4",null,"Pb",null,"Contaminants_Source_determinand_names Contaminants_Species2"]
[]
["Heather MacLeod","2022-07-14","11:49:30",null,"Contaminants:$F$4",null,"Benzene",null,"Contaminants_Source_determinand_names Contaminants_Species3"]
[]
["Heather MacLeod","2022-07-14","11:49:34",null,"Contaminants:$G$4",null,"BaP",null,"Contaminants_Source_determinand_names Contaminants_Species4"]
[]
["Heather MacLeod","2022-07-14","11:49:49",null,"Contaminants:$B$9",null,"MRV"]
[]
["Heather MacLeod","2022-07-14","11:50:55",null,"Contaminants:$D$9",null,0.01,null,"Quality_Standard_1 Contaminants_Species1"]
[]
["Heather MacLeod","2022-07-14","11:50:57",null,"Contaminants:$E$9",null,0.2,null,"Quality_Standard_1 Contaminants_Species2"]
[]
["Heather MacLeod","2022-07-14","11:50:59",null,"Contaminants:$F$9",null,1,null,"Quality_Standard_1 Contaminants_Species3"]
[]
["Heather MacLeod","2022-07-14","11:51:01",null,"Contaminants:$G$9",null,5.0000000000000002E-5,null,"Quality_Standard_1 Contaminants_Species4"]
[]
["Heather MacLeod","2022-07-14","11:51:22",null,"Contaminants:$D$9",null,1.0000000000000001E-5,0.01,"Quality_Standard_1 Contaminants_Species1"]
[]
["Heather MacLeod","2022-07-14","11:51:27",null,"Contaminants:$E$9",null,2.0000000000000001E-4,0.2,"Quality_Standard_1 Contaminants_Species2"]
[]
["Heather MacLeod","2022-07-14","11:51:33",null,"Contaminants:$F$9",null,1E-3,1,"Quality_Standard_1 Contaminants_Species3"]
[]
["Heather MacLeod","2022-07-14","11:51:36",null,"Contaminants:$G$9",null,5.0000000000000002E-5,5.0000000000000002E-5,"Quality_Standard_1 Contaminants_Species4"]
[]
["Heather MacLeod","2022-07-14","11:51:41",null,"Contaminants:$G$9",null,4.9999999999999998E-8,5.0000000000000002E-5,"Quality_Standard_1 Contaminants_Species4"]
[]
["Heather MacLeod","2022-07-14","12:01:57",null,"Contaminants:$F$31",null,66,null,"Contaminants_Organic_Carbon_Water_Partition_Coefficient_Koc Contaminants_Species3"]
[]
["Heather MacLeod","2022-07-14","12:02:06",null,"Contaminants:$G$31",null,1170000,null,"Contaminants_Organic_Carbon_Water_Partition_Coefficient_Koc Contaminants_Species4"]
[]
["Heather MacLeod","2022-07-14","12:02:16",null,"Contaminants:$D$38",null,2.0000000000000001E-9,null,"Contaminants_Free_Water_Diffusion_Coefficient Contaminants_Species1"]
[]
["Heather MacLeod","2022-07-14","12:02:20",null,"Contaminants:$E$38",null,1.0000000000000001E-9,null,"Contaminants_Free_Water_Diffusion_Coefficient Contaminants_Species2"]
[]
["Heather MacLeod","2022-07-14","12:02:25",null,"Contaminants:$F$38",null,6.6399999999999998E-10,null,"Contaminants_Free_Water_Diffusion_Coefficient Contaminants_Species3"]
[]
["Heather MacLeod","2022-07-14","12:02:29",null,"Contaminants:$G$38",null,6.9E-10,null,"Contaminants_Free_Water_Diffusion_Coefficient Contaminants_Species4"]
[]
["Heather MacLeod","2022-07-14","12:05:36",null,"Hydrogeology:$C$5",null,3.5,null,"Hydrogeology_Unit_Thickness Sst_Unsaturated"]
[]
["Heather MacLeod","2022-07-14","12:07:03",null,"Hydrogeology:$D$5",null,10,null,"Hydrogeology_Unit_Thickness Sst_Saturated"]
[]
["Heather MacLeod","2022-07-14","12:10:12",null,"Hydrogeology:$C$19",null,1.3999999999999999E-4,1,"Formula59"]
[]
["Heather MacLeod","2022-07-14","12:10:16",null,"Hydrogeology:$D$19",null,1.3999999999999999E-4,1,"Formula60"]
[]
["Heather MacLeod","2022-07-14","12:10:56",null,"Hydrogeology:$C$33",null,0.02,null,"Hydrogeology_Hydraulic_Gradient Sst_Unsaturated"]
[]
["Heather MacLeod","2022-07-14","12:11:00",null,"Hydrogeology:$D$33",null,0.02,null,"Hydrogeology_Hydraulic_Gradient Sst_Saturated"]
[]
["Heather MacLeod","2022-07-14","12:11:09",null,"Hydrogeology:$C$40",null,26.9,null,"Hydrogeology_Porosity Sst_Unsaturated"]
[]
["Heather MacLeod","2022-07-14","12:11:13",null,"Hydrogeology:$D$40",null,26.9,null,"Hydrogeology_Porosity Sst_Saturated"]
[]
["Heather MacLeod","2022-07-14","12:11:52",null,"Hydrogeology:$C$54",null,5,null,"Hydrogeology_Tortuosity Sst_Unsaturated"]
[]
["Heather MacLeod","2022-07-14","12:11:54",null,"Hydrogeology:$D$54",null,5,null,"Hydrogeology_Tortuosity Sst_Saturated"]
[]
["Heather MacLeod","2022-07-14","12:14:03",null,"Attenuation:$C$7",null,2200,null,"Attenuation_Dry_bulk_density Attenuation_Sst_Unsaturated"]
[]
["Heather MacLeod","2022-07-14","12:14:06",null,"Attenuation:$D$7",null,2200,null,"Attenuation_Dry_bulk_density Attenuation_Sst_Saturated"]
[]
["Heather MacLeod","2022-07-14","12:15:03",null,"Attenuation:$C$14",null,1E-3,null,"Attenuation_Fraction_organic_carbon Attenuation_Sst_Unsaturated"]
[]
["Heather MacLeod","2022-07-14","12:15:07",null,"Attenuation:$D$14",null,1E-3,null,"Attenuation_Fraction_organic_carbon Attenuation_Sst_Saturated"]
[]
["Heather MacLeod","2022-07-14","12:18:06",null,"Attenuation:$C$26",null,450,0,"Formula91"]
[]
["Heather MacLeod","2022-07-14","12:18:54",null,"Attenuation:$D$26",null,450,0,"Formula92"]
[]
["Heather MacLeod","2022-07-14","12:27:36",null,"Attenuation:$C$56",null,220,0,"Formula140"]
[]
["Heather MacLeod","2022-07-14","12:27:39",null,"Attenuation:$D$56",null,220,0,"Formula141"]
[]
["Heather MacLeod","2022-07-14","12:28:13",null,"Attenuation:$C$100",null,365,"No Decay","Attenuation_Half_Life_Species_3 Attenuation_Sst_Unsaturated"]
[]
["Heather MacLeod","2022-07-14","12:28:14",null,"Attenuation:$D$100",null,365,"No Decay","Attenuation_Half_Life_Species_3 Attenuation_Sst_Saturated"]
[]
["Heather MacLeod","2022-07-14","12:28:37",null,"Attenuation:$C$130",null,830,"No Decay","Attenuation_Half_Life_Species_4 Attenuation_Sst_Unsaturated"]
[]
["Heather MacLeod","2022-07-14","12:28:39",null,"Attenuation:$D$130",null,830,"No Decay","Attenuation_Half_Life_Species_4 Attenuation_Sst_Saturated"]
[]
["Heather MacLeod","2022-07-14","12:34:17",null,"Pathways:$I$7",null,"MRV","Not Specified","Path1_Standards Section4"]
[]
["Heather MacLeod","2022-07-14","12:34:19",null,"Pathways:$I$20",null,"MRV","Not Specified","Path2_Standards Section4"]
[]
["Heather MacLeod","2022-07-14","12:35:09",null,"Pathways:$C$10",null,5.8179534565366191E-4,null,"Path1_Param3 Section1"]
[]
["Heather MacLeod","2022-07-14","12:35:16",null,"Pathways:$C$11",null,0,null,"Path1_Param4 Section1"]
[]
["Heather MacLeod","2022-07-14","12:35:23",null,"Pathways:$C$10",null,5.8179534565366191E-4,5.8179534565366202E-4,"Path1_Param3 Section1"]
[]
["Heather MacLeod","2022-07-14","12:35:25",null,"Pathways:$C$11",null,5.8179534565366191E-4,0,"Path1_Param4 Section1"]
[]
["Heather MacLeod","2022-07-14","12:35:33",null,"Pathways:$C$23",null,5.8179534565366191E-4,null,"Path2_Param3 Section1"]
[]
["Heather MacLeod","2022-07-14","12:35:36",null,"Pathways:$C$24",null,5.8179534565366191E-4,null,"Path2_Param4 Section1"]
[]
["Heather MacLeod","2022-07-14","12:36:06",null,"Pathways:$E$6",null,"ADRD (1D) + Dilution","No Processes","Path1_Process Section2"]
[]
["Heather MacLeod","2022-07-14","12:36:36",null,"Hydrogeology:$C$33",null,1,null,"Hydrogeology_Hydraulic_Gradient Sst_Unsaturated"]
[]
["Heather MacLeod","2022-07-14","12:45:48",null,"Pathways:$E$10",null,3.5,null,"Path1_Param3 Section2"]
[]
["Heather MacLeod","2022-07-14","12:46:38",null,"Pathways:$E$9",null,0.35,null,"Path1_Param2 Section2"]
[]
["Heather MacLeod","2022-07-14","12:46:46",null,"Pathways:$G$6",null,"ADRD (1D) + Dilution","No Processes","Path1_Process Section3"]
[]
["Heather MacLeod","2022-07-14","12:47:32",null,"Pathways:$G$10",null,103.5,null,"Path1_Param3 Section3"]
[]
["Heather MacLeod","2022-07-14","12:47:45",null,"Pathways:$G$11",null,10,null,"Path1_Param4 Section3"]
[]
["Heather MacLeod","2022-07-14","12:47:56",null,"Pathways:$G$12",null,246,null,"Path1_Param5 Section3"]
[]
["Heather MacLeod","2022-07-14","12:48:04",null,"Pathways:$G$9",null,10.35,null,"Path1_Param2 Section3"]
[]
["Heather MacLeod","2022-07-14","12:48:48",null,"Pathways:$E$19",null,"ADRD (1D) + Dilution","No Processes","Path2_Process Section2"]
[]
["Heather MacLeod","2022-07-14","12:48:50",null,"Pathways:$G$19",null,"ADRD (1D) + Dilution","No Processes","Path2_Process Section3"]
[]
["Heather MacLeod","2022-07-14","12:48:55",null,"Pathways:$E$21",null,5.2044609665427507E-6,5.2044609665427499E-6,"Formula498"]
[]
["Heather MacLeod","2022-07-14","12:48:55",null,"Pathways:$E$22",null,0.35,5.2044609665427499E-6,"Path2_Param2 Section2"]
[]
["Heather MacLeod","2022-07-14","12:48:55",null,"Pathways:$E$23",null,0,5.2044609665427499E-6,"Path2_Param3 Section2"]
[]
["Heather MacLeod","2022-07-14","12:49:01",null,"Pathways:$G$22",null,10.35,null,"Path2_Param2 Section3"]
[]
["Heather MacLeod","2022-07-14","12:49:01",null,"Pathways:$G$23",null,103.5,null,"Path2_Param3 Section3"]
[]
["Heather MacLeod","2022-07-14","12:49:01",null,"Pathways:$G$24",null,0,null,"Path2_Param4 Section3"]
[]
["Heather MacLeod","2022-07-14","12:49:01",null,"Pathways:$G$25",null,246,null,"Path2_Param5 Section3"]
[]
["Heather MacLeod","2022-07-14","12:49:14",null,"Pathways:$E$10",null,3.5,3.5,"Path1_Param3 Section2"]
[]
["Heather MacLeod","2022-07-14","12:49:51",null,"Pathways:$E$23",null,3.5,null,"Path2_Param3 Section2"]
[]
["Heather MacLeod","2022-07-14","12:50:05",null,"Pathways:$G$23",null,103.5,null,"Path2_Param3 Section3"]
[]
["Heather MacLeod","2022-07-14","12:50:11",null,"Pathways:$G$24",null,10,null,"Path2_Param4 Section3"]
[]
["Heather MacLeod","2022-07-14","12:50:17",null,"Pathways:$G$25",null,246,null,"Path2_Param5 Section3"]
[]
["Heather MacLeod","2022-07-14","12:50:23",null,"Pathways:$G$22",null,10.35,null,"Path2_Param2 Section3"]
[]
["Heather MacLeod","2022-07-14","12:50:28",null,"Pathways:$E$22",null,0.35,null,"Path2_Param2 Section2"]
[]
["Heather MacLeod","2022-07-14","12:50:55",null,"Pathways:$G$10",null,0,103.5,"Path1_Param3 Section3"]
[]
[]
["Saved  19/07/2022: 15:04:34  Level Number: 5"]
[]
["BREAKTHROUGH RESULTS"]
[]
["Advanced"]
["Pollutant Linkage: Infill, Sst Unsaturated, Sst Saturated, Principal Aquifer",null,null,null,null,null,null,null,null,null,"Pollutant Linkage: Infill, Sst Unsaturated, Sst Saturated, Principal Aquifer at Site Boundary"]
["Concentrations in mg/L in Principal Aquifer",null,null,null,null,null,null,null,null,null,"Concentrations in mg/L in Principal Aquifer at Site Boundary"]
[]
["Compared with MRV target concentration in mg/L",null,null,null,null,null,null,null,null,null,"Compared with MRV target concentration in mg/L"]
[null,1.0000000000000001E-5,null,2.0000000000000001E-4,null,1E-3,null,4.9999999999999998E-8,null,null,null,1.0000000000000001E-5,null,2.0000000000000001E-4,null,1E-3,null,4.9999999999999998E-8]
[]
[null,"Species1",null,"Species2",null,"Species3",null,"Species4",null,null,null,"Species1",null,"Species2",null,"Species3",null,"Species4"]
["Time(years)","Hg","Time(years)","Pb","Time(years)","Benzene","Time(years)","BaP",null,null,"Time(years)","Hg","Time(years)","Pb","Time(years)","Benzene","Time(years)","BaP"]
[1,"",1,"",1,"",1,"",null,null,1,"",1,"",1,"",1,""]
[2,"",2,"",2,"",2,"",null,null,2,"",2,"",2,"",2,""]
[5,"",5,"",5,"",5,"",null,null,5,"",5,"",5,"",5,""]
[10,"",10,"",10,"",10,"",null,null,10,"",10,"",10,"",10,""]
[20,"",20,"",20,"",20,"",null,null,20,"",20,"",20,"",20,""]
[30,"",30,"",30,"",30,"",null,null,30,"",30,"",30,"",30,""]
[40,"",40,"",40,"",40,"",null,null,40,"",40,"",40,"",40,""]
[50,"",50,"",50,"",50,"",null,null,50,"",50,"",50,"",50,""]
[60,"",60,"",60,"",60,"",null,null,60,"",60,"",60,"",60,""]
[70,"",70,"",70,"",70,"",null,null,70,"",70,"",70,"",70,""]
[80,"",80,"",80,"",80,"",null,null,80,"",80,"",80,"",80,""]
[90,"",90,"",90,"",90,"",null,null,90,"",90,"",90,"",90,""]
[100,"",100,"",100,"",100,"",null,null,100,"",100,"",100,"",100,""]
[110,"",110,"",110,"",110,"",null,null,110,"",110,"",110,"",110,""]
[120,"",120,"",120,"",120,"",null,null,120,"",120,"",120,"",120,""]
[130,"",130,"",130,"",130,"",null,null,130,"",130,"",130,"",130,""]
[140,"",140,"",140,"",140,"",null,null,140,"",140,"",140,"",140,""]
[150,"",150,"",150,"",150,"",null,null,150,"",150,"",150,"",150,""]
[160,"",160,"",160,"",160,"",null,null,160,"",160,"",160,"",160,""]
[170,"",170,"",170,"",170,"",null,null,170,"",170,"",170,"",170,""]
[]
[]
["Pollutant Linkage: Infill, Sst Unsaturated, Sst Saturated, Principal Aquifer",null,null,null,null,null,null,null,null,null,"Pollutant Linkage: Infill, Sst Unsaturated, Sst Saturated, Principal Aquifer at Site Boundary"]
["Remedial Target Concentrations in mg/L in Infill",null,null,null,null,null,null,null,null,null,"Remedial Target Concentrations in mg/L in Infill"]
[]
[null,"Species1",null,"Species2",null,"Species3",null,"Species4",null,null,null,"Species1",null,"Species2",null,"Species3",null,"Species4"]
["Time(years)","Hg","Time(years)","Pb","Time(years)","Benzene","Time(years)","BaP",null,null,"Time(years)","Hg","Time(years)","Pb","Time(years)","Benzene","Time(years)","BaP"]
[1,0,1,0,1,0,1,0,null,null,1,0,1,0,1,0,1,0]
[2,0,2,0,2,0,2,0,null,null,2,0,2,0,2,0,2,0]
[5,0,5,0,5,0,5,0,null,null,5,0,5,0,5,0,5,0]
[10,0,10,0,10,0,10,0,null,null,10,0,10,0,10,0,10,0]
[20,0,20,0,20,0,20,0,null,null,20,0,20,0,20,0,20,0]
[30,0,30,0,30,0,30,0,null,null,30,0,30,0,30,0,30,0]
[40,0,40,0,40,0,40,0,null,null,40,0,40,0,40,0,40,0]
[50,0,50,0,50,0,50,0,null,null,50,0,50,0,50,0,50,0]
[60,0,60,0,60,0,60,0,null,null,60,0,60,0,60,0,60,0]
[70,0,70,0,70,0,70,0,null,null,70,0,70,0,70,0,70,0]
[80,0,80,0,80,0,80,0,null,null,80,0,80,0,80,0,80,0]
[90,0,90,0,90,0,90,0,null,null,90,0,90,0,90,0,90,0]
[100,0,100,0,100,0,100,0,null,null,100,0,100,0,100,0,100,0]
[110,0,110,0,110,0,110,0,null,null,110,0,110,0,110,0,110,0]
[120,0,120,0,120,0,120,0,null,null,120,0,120,0,120,0,120,0]
[130,0,130,0,130,0,130,0,null,null,130,0,130,0,130,0,130,0]
[140,0,140,0,140,0,140,0,null,null,140,0,140,0,140,0,140,0]
[150,0,150,0,150,0,150,0,null,null,150,0,150,0,150,0,150,0]
[160,0,160,0,160,0,160,0,null,null,160,0,160,0,160,0,160,0]
[170,0,170,0,170,0,170,0,null,null,170,0,170,0,170,0,170,0]
[]
["Compared with source concentrations in mg/L",null,null,null,null,null,null,null,null,null,"Compared with source concentrations in mg/L"]
[null,0,null,0,null,0,null,0,null,null,null,0,null,0,null,0,null,0]
[]
[]
["Pollutant Linkage: Infill, Sst Unsaturated, Sst Saturated, Principal Aquifer",null,null,null,null,null,null,null,null,null,"Pollutant Linkage: Infill, Sst Unsaturated, Sst Saturated, Principal Aquifer at Site Boundary"]
["Dilution Factor",null,null,null,null,null,null,null,null,null,"Dilution Factor"]
[]
[null,12.83921468512464,"for all species and timeslices",null,null,null,null,null,null,null,null,12.83921468512464,"for all species and timeslices"]
[]
[]
["Pollutant Linkage: Infill, Sst Unsaturated, Sst Saturated, Principal Aquifer",null,null,null,null,null,null,null,null,null,"Pollutant Linkage: Infill, Sst Unsaturated, Sst Saturated, Principal Aquifer at Site Boundary"]
["Attenuation Factor",null,null,null,null,null,null,null,null,null,"Attenuation Factor"]
[]
[null,"Species1",null,"Species2",null,"Species3",null,"Species4",null,null,null,"Species1",null,"Species2",null,"Species3",null,"Species4"]
["Time(years)","Hg","Time(years)","Pb","Time(years)","Benzene","Time(years)","BaP",null,null,"Time(years)","Hg","Time(years)","Pb","Time(years)","Benzene","Time(years)","BaP"]
[1,{"$error":"#VALUE!"},1,0,1,{"$error":"#VALUE!"},1,0,null,null,1,{"$error":"#VALUE!"},1,0,1,{"$error":"#VALUE!"},1,0]
[2,{"$error":"#VALUE!"},2,0,2,{"$error":"#VALUE!"},2,0,null,null,2,{"$error":"#VALUE!"},2,0,2,{"$error":"#VALUE!"},2,0]
[5,{"$error":"#VALUE!"},5,0,5,{"$error":"#VALUE!"},5,0,null,null,5,{"$error":"#VALUE!"},5,0,5,{"$error":"#VALUE!"},5,0]
[10,{"$error":"#VALUE!"},10,0,10,{"$error":"#VALUE!"},10,0,null,null,10,{"$error":"#VALUE!"},10,0,10,{"$error":"#VALUE!"},10,0]
[20,{"$error":"#VALUE!"},20,0,20,{"$error":"#VALUE!"},20,0,null,null,20,{"$error":"#VALUE!"},20,0,20,{"$error":"#VALUE!"},20,0]
[30,{"$error":"#VALUE!"},30,0,30,{"$error":"#VALUE!"},30,0,null,null,30,{"$error":"#VALUE!"},30,0,30,{"$error":"#VALUE!"},30,0]
[40,{"$error":"#VALUE!"},40,0,40,{"$error":"#VALUE!"},40,0,null,null,40,{"$error":"#VALUE!"},40,0,40,{"$error":"#VALUE!"},40,0]
[50,{"$error":"#VALUE!"},50,0,50,{"$error":"#VALUE!"},50,0,null,null,50,{"$error":"#VALUE!"},50,0,50,{"$error":"#VALUE!"},50,0]
[60,{"$error":"#VALUE!"},60,0,60,{"$error":"#VALUE!"},60,0,null,null,60,{"$error":"#VALUE!"},60,0,60,{"$error":"#VALUE!"},60,0]
[70,{"$error":"#VALUE!"},70,0,70,{"$error":"#VALUE!"},70,0,null,null,70,{"$error":"#VALUE!"},70,0,70,{"$error":"#VALUE!"},70,0]
[80,{"$error":"#VALUE!"},80,0,80,{"$error":"#VALUE!"},80,0,null,null,80,{"$error":"#VALUE!"},80,0,80,{"$error":"#VALUE!"},80,0]
[90,{"$error":"#VALUE!"},90,0,90,{"$error":"#VALUE!"},90,0,null,null,90,{"$error":"#VALUE!"},90,0,90,{"$error":"#VALUE!"},90,0]
[100,{"$error":"#VALUE!"},100,0,100,{"$error":"#VALUE!"},100,0,null,null,100,{"$error":"#VALUE!"},100,0,100,{"$error":"#VALUE!"},100,0]
[110,{"$error":"#VALUE!"},110,0,110,{"$error":"#VALUE!"},110,0,null,null,110,{"$error":"#VALUE!"},110,0,110,{"$error":"#VALUE!"},110,0]
[120,{"$error":"#VALUE!"},120,0,120,{"$error":"#VALUE!"},120,0,null,null,120,{"$error":"#VALUE!"},120,0,120,{"$error":"#VALUE!"},120,0]
[130,{"$error":"#VALUE!"},130,0,130,{"$error":"#VALUE!"},130,0,null,null,130,{"$error":"#VALUE!"},130,0,130,{"$error":"#VALUE!"},130,0]
[140,{"$error":"#VALUE!"},140,0,140,{"$error":"#VALUE!"},140,0,null,null,140,{"$error":"#VALUE!"},140,0,140,{"$error":"#VALUE!"},140,0]
[150,{"$error":"#VALUE!"},150,0,150,{"$error":"#VALUE!"},150,0,null,null,150,{"$error":"#VALUE!"},150,0,150,{"$error":"#VALUE!"},150,0]
[160,{"$error":"#VALUE!"},160,0,160,{"$error":"#VALUE!"},160,0,null,null,160,{"$error":"#VALUE!"},160,0,160,{"$error":"#VALUE!"},160,0]
[170,{"$error":"#VALUE!"},170,0,170,{"$error":"#VALUE!"},170,0,null,null,170,{"$error":"#VALUE!"},170,0,170,{"$error":"#VALUE!"},170,0]
[]
[]
["Saved  19/07/2022: 15:24:36  Level Number: 5"]
[]
["BREAKTHROUGH RESULTS"]
[]
["Advanced"]
["Pollutant Linkage: Infill, Sst Unsaturated, Sst Saturated, Principal Aquifer",null,null,null,null,null,null,null,null,null,"Pollutant Linkage: Infill, Sst Unsaturated, Sst Saturated, Principal Aquifer at Site Boundary"]
["Concentrations in mg/L in Principal Aquifer",null,null,null,null,null,null,null,null,null,"Concentrations in mg/L in Principal Aquifer at Site Boundary"]
[]
["Compared with MRV target concentration in mg/L",null,null,null,null,null,null,null,null,null,"Compared with MRV target concentration in mg/L"]
[null,1.0000000000000001E-5,null,2.0000000000000001E-4,null,1E-3,null,4.9999999999999998E-8,null,null,null,1.0000000000000001E-5,null,2.0000000000000001E-4,null,1E-3,null,4.9999999999999998E-8]
[]
[null,"Species1",null,"Species2",null,"Species3",null,"Species4",null,null,null,"Species1",null,"Species2",null,"Species3",null,"Species4"]
["Time(years)","Hg","Time(years)","Pb","Time(years)","Benzene","Time(years)","BaP",null,null,"Time(years)","Hg","Time(years)","Pb","Time(years)","Benzene","Time(years)","BaP"]
[1,5.8711542397017009E-4,1,3.6493445962414196E-2,1,0.42524235613600792,1,0.43448384646530669,null,null,1,0,1,0,1,0.31412968548118764,1,0]
[2,6.8888784511699766E-4,2,3.3449662915063093E-2,2,0.38703110994938983,2,2.7185209083035184,null,null,2,0,2,0,2,0.29147689099806351,2,0]
[5,5.2399500364828152E-4,5,2.5218700032013649E-2,5,0.29179238537863789,5,3.2038662534129423,null,null,5,0,5,0,5,0.2197603829258517,5,0]
[10,3.2724582306102883E-4,10,1.5749598758968305E-2,10,0.18223036792457534,10,2.0100046428035325,null,null,10,0,10,1.7292314542898374E-30,10,0.13724489583153912,10,0]
[20,1.2763439031884602E-4,20,6.1427534691634459E-3,20,7.1074586884773638E-2,20,0.78395574195986195,null,null,20,1.6557124819443321E-32,20,0,20,5.3529081859695987E-2,20,0]
[30,4.9780733950676793E-5,30,2.3958336929078027E-3,30,2.7720938311252941E-2,30,0.30576315077810207,null,null,30,0,30,1.0811314116847293E-19,30,2.0877734826333139E-2,30,0]
[40,1.9415780825357418E-5,40,9.3443742885567914E-4,40,1.081188665309468E-2,40,0.11925558788895542,null,null,40,0,40,1.2068282616297225E-16,40,8.1428593926429239E-3,40,0]
[50,7.5726584548081802E-6,50,3.6445483884773E-4,50,4.2169162904856557E-3,50,4.651278065136194E-2,null,null,50,1.177465927324095E-23,50,1.6350617559964833E-13,50,3.1759264180260842E-3,50,0]
[60,2.9535323426934879E-6,60,1.4214678997795949E-4,60,1.6447061650884526E-3,60,1.8141190543723588E-2,null,null,60,1.4737026973201699E-21,60,1.9546337606030213E-11,60,1.2386932481847895E-3,60,4.3169240595273265E-40]
[70,1.1519528776079081E-6,70,5.5440864231410466E-5,70,6.4147726570619348E-4,70,7.0755307311951175E-3,null,null,70,0,70,5.7855723591909207E-10,70,4.8312188375756337E-4,70,1.1164044706770837E-39]
[80,4.4928997156670127E-7,80,2.1623296884773509E-5,80,2.5019189105254195E-4,80,2.7596345617693333E-3,null,null,80,9.9680245223726738E-19,80,7.1548854106365741E-9,80,1.8842938876264325E-4,80,0]
[90,1.7523315167288642E-7,90,8.4335667303785909E-6,90,9.7580426195992937E-5,90,1.0763221506279524E-3,null,null,90,5.7928122859603172E-17,90,4.9431763092167987E-8,90,7.3491654511697151E-5,90,0]
[100,6.8343869977977287E-8,100,3.2892300946378627E-6,100,3.8057999645721348E-5,100,4.1978612008401642E-4,null,null,100,1.5092386716087866E-15,100,2.2714446313167908E-7,100,2.8662957900070202E-5,100,0]
[110,2.6654283897898473E-8,110,1.2828063851475476E-6,110,1.4842721263209613E-5,110,1.6371970313444688E-4,null,null,110,2.1445132110637255E-14,110,7.7580211133685365E-7,110,1.1178611617999443E-5,110,2.1938131437240511E-40]
[120,1.0394281096137815E-8,120,5.0025034457533397E-7,120,5.7881749825770395E-6,120,6.3846953474520324E-5,null,null,120,1.9338556508529932E-13,120,2.1211865198018582E-6,120,4.3592740287907537E-6,120,0]
[130,4.0524797637532404E-9,130,1.9503468365137224E-7,130,2.2566824083512079E-6,130,2.4893868268529307E-5,null,null,130,1.2295375851954961E-12,130,4.8880789294709935E-6,130,1.6995664705734253E-6,130,1.0882332607043656E-40]
[140,1.5790375281082058E-9,140,7.5994163662247649E-8,140,8.7932684845946146E-7,140,9.7011074171829882E-6,null,null,140,5.9409068069684734E-12,140,9.8497584578175135E-6,140,6.6222522902924596E-7,140,0]
[150,6.1435618682575036E-10,150,2.9566705441336963E-8,150,3.421384770633623E-7,150,3.775498779786111E-6,null,null,150,2.3048508076676268E-11,150,1.7831705661335882E-5,150,2.5764790672309568E-7,150,1.8215425389395132E-40]
[160,2.381330383399308E-10,160,1.1460242172574168E-8,160,1.3263706805719472E-7,160,1.4643732366399052E-6,null,null,160,7.4822359683984602E-11,160,2.9598362455195682E-5,160,9.9865120230259951E-8,160,2.7938552003724894E-40]
[170,9.1421810240286007E-11,170,4.3997534535398298E-9,170,5.0942152461387769E-8,170,5.6301905165628718E-7,null,null,170,2.0976171403719185E-10,170,4.5751827614258419E-5,170,3.8337062933644403E-8,170,2.815691100717241E-40]
[]
[]
["Pollutant Linkage: Infill, Sst Unsaturated, Sst Saturated, Principal Aquifer",null,null,null,null,null,null,null,null,null,"Pollutant Linkage: Infill, Sst Unsaturated, Sst Saturated, Principal Aquifer at Site Boundary"]
["Remedial Target Concentrations in mg/L in Infill",null,null,null,null,null,null,null,null,null,"Remedial Target Concentrations in mg/L in Infill"]
[]
[null,"Species1",null,"Species2",null,"Species3",null,"Species4",null,null,null,"Species1",null,"Species2",null,"Species3",null,"Species4"]
["Time(years)","Hg","Time(years)","Pb","Time(years)","Benzene","Time(years)","BaP",null,null,"Time(years)","Hg","Time(years)","Pb","Time(years)","Benzene","Time(years)","BaP"]
[1,1.7032425979168411E-4,1,2.7402180682798028E-3,1,1.4109601062602012E-2,1,1.1507907694789862E-5,null,null,1,1E+40,1,1E+40,1,1.9100391581295884E-2,1,1E+40]
[2,1.4516151026444145E-4,2,2.989566748517752E-3,2,1.5502629751868243E-2,2,1.8392354403925584E-6,null,null,2,1E+40,2,1E+40,2,2.0584822280267367E-2,2,1E+40]
[5,1.9084151433459564E-4,5,3.9653114503545349E-3,5,2.0562565374056055E-2,5,1.5606144590691676E-6,null,null,5,1E+40,5,1E+40,5,2.7302464257283495E-2,5,1E+40]
[10,3.0558067652203702E-4,10,6.3493681033021197E-3,10,3.2925357438137778E-2,10,2.4875564431662478E-6,null,null,10,1E+40,10,5.7829158584828139E+25,10,4.3717472796690991E-2,10,1E+40]
[20,7.8348789656289351E-4,20,1.6279344515777637E-2,20,8.4418359120781397E-2,20,6.3779110635763368E-6,null,null,20,6.039695967174703E+24,20,1E+40,20,0.11208860289676705,20,1E+40]
[30,2.008809273464729E-3,30,4.1739124170438922E-2,30,0.21644288994230693,30,1.635252641554767E-5,null,null,30,1E+40,30,924956937882045.25,30,0.28738749916644141,30,1E+40]
[40,5.1504495698364034E-3,40,0.10701626124122719,40,0.55494477444254586,40,4.1926756544571637E-5,null,null,40,1E+40,40,828618314464.71277,40,0.73684190168149066,40,1E+40]
[50,1.3205402118262188E-2,50,0.27438241817878622,50,1.4228406699790073,50,1.0749733578556961E-4,null,null,50,8492814754076126,50,611597694.29660058,50,1.8892125352605451,50,1E+40]
[60,3.3857763652862027E-2,60,0.70349812342231199,60,3.648068042401555,60,2.756158691982803E-4,null,null,60,67856291626420.539,60,5116047.9275232181,60,4.8438142444003329,60,1.1582320955971288E+34]
[70,8.6809106469402958E-2,70,1.8037236862434083,70,9.3534101998060404,70,7.0666077075400631E-4,null,null,70,1E+40,70,172843.74611811861,70,12.419226289924957,70,4.4786635411515052E+33]
[80,0.22257340766208061,80,4.6246416785044966,80,23.981592587826761,80,1.8118340990751548E-3,null,null,80,100320780487.20245,80,13976.464228391178,80,31.842166656698936,80,1E+40]
[90,0.57066827278592436,90,11.857379350517204,90,61.487741280703538,90,4.6454493174584192E-3,null,null,90,1726277239.1635036,90,2022.9907602839296,90,81.641923016510972,90,1E+40]
[100,1.4631890180088338,100,30.40225132410805,100,157.65410835707303,100,1.1910827349411396E-2,null,null,100,66258572.538036086,100,440.24845959827996,100,209.32940769470636,100,1E+40]
[110,3.7517421358254683,110,77.954086569734429,110,404.23854181457227,110,3.0540001626401629E-2,null,null,110,4663062.9032309772,110,128.89885002720746,110,536.73928436148469,110,2.2791366777538664E+34]
[120,9.6206749726209377,120,199.8999122827006,120,1036.5961668506177,120,7.8312272205679642E-2,null,null,120,517101.67693173781,120,47.143426128005515,120,1376.3759654412866,120,1E+40]
[130,24.67624906962746,130,512.72931628279855,130,2658.7702273904638,130,0.20085267368113185,null,null,130,81331.389299579678,130,20.457934792559168,130,3530.3120553888248,130,4.5946031798033068E+34]
[140,63.329717134593245,140,1315.8905260730958,140,6823.4013444622015,140,0.51540507541889502,null,null,140,16832.447175017718,140,10.152533224876438,140,9060.3615461696954,140,1E+40]
[150,162.77202402189363,150,3382.1827121864867,150,17536.758950642172,150,1.324328331602125,null,null,150,4338.675616978182,150,5.6079884840645349,150,23287.594594930808,150,2.7449262880849095E+34]
[160,419.93333095280855,160,8725.8190965032882,160,45236.223085184058,160,3.4144300611999765,null,null,160,1336.4988811146059,160,3.3785652889200986,160,60081.037164585025,160,1.7896417821987973E+34]
[170,1093.8308893377603,170,22728.546282416079,170,117780.65335083306,170,8.880694152872838,null,null,170,476.73142097928076,170,2.1857050355040966,170,156506.51199819567,170,1.7757629729789427E+34]
[]
["Compared with source concentrations in mg/L",null,null,null,null,null,null,null,null,null,"Compared with source concentrations in mg/L"]
[null,0.01,null,0.5,null,6,null,100,null,null,null,0.01,null,0.5,null,6,null,100]
[]
[]
["Pollutant Linkage: Infill, Sst Unsaturated, Sst Saturated, Principal Aquifer",null,null,null,null,null,null,null,null,null,"Pollutant Linkage: Infill, Sst Unsaturated, Sst Saturated, Principal Aquifer at Site Boundary"]
["Dilution Factor",null,null,null,null,null,null,null,null,null,"Dilution Factor"]
[]
[null,12.83921468512464,"for all species and timeslices",null,null,null,null,null,null,null,null,12.83921468512464,"for all species and timeslices"]
[]
[]
["Pollutant Linkage: Infill, Sst Unsaturated, Sst Saturated, Principal Aquifer",null,null,null,null,null,null,null,null,null,"Pollutant Linkage: Infill, Sst Unsaturated, Sst Saturated, Principal Aquifer at Site Boundary"]
["Attenuation Factor",null,null,null,null,null,null,null,null,null,"Attenuation Factor"]
[]
[null,"Species1",null,"Species2",null,"Species3",null,"Species4",null,null,null,"Species1",null,"Species2",null,"Species3",null,"Species4"]
["Time(years)","Hg","Time(years)","Pb","Time(years)","Benzene","Time(years)","BaP",null,null,"Time(years)","Hg","Time(years)","Pb","Time(years)","Benzene","Time(years)","BaP"]
[1,1.3265940633348841,1,3.8943191796558557E-2,1,12.805540535689865,1,7.7886383593117108,null,null,1,1E+40,1,3.8943191796558557E-2,1,1E+40,1,7.7886383593117108]
[2,1.1306105071412491,2,1.9471595898279279E-2,2,13.97079255313689,2,3.8943191796558554,null,null,2,1E+40,2,1.9471595898279279E-2,2,1E+40,2,3.8943191796558554]
[5,1.4863955390955672,5,7.7886383593117111E-3,5,18.53062612130957,5,1.5577276718623423,null,null,5,1E+40,5,7.7886383593117111E-3,5,1E+40,5,1.5577276718623423]
[10,2.380057379023961,10,3.8943191796558555E-3,10,29.671759180061475,10,0.77886383593117114,null,null,10,1E+40,10,3.8943191796558555E-3,10,2.7024624170430756E+29,10,0.77886383593117114]
[20,6.1023038852261982,20,1.9471595898279278E-3,20,76.076356296021871,20,0.38943191796558557,null,null,20,4.7041007688517139E+28,20,1.9471595898279278E-3,20,1E+40,20,0.38943191796558557]
[30,15.645888963848474,30,1.2981063932186185E-3,30,195.05456615877307,30,0.2596212786437237,null,null,30,1E+40,30,1.2981063932186185E-3,30,4.3224930522597581E+18,30,0.2596212786437237]
[40,40.114989087328311,40,9.7357979491396389E-4,40,500.10657442412707,40,0.19471595898279279,null,null,40,1E+40,40,9.7357979491396389E-4,40,3872285033560845.5,40,0.19471595898279279]
[50,102.85210148843299,50,7.7886383593117115E-4,50,1282.2392564088009,50,0.15577276718623423,null,null,50,6.614746277212577E+19,50,7.7886383593117115E-4,50,2858107957359.0601,50,0.15577276718623423]
[60,263.70587674719098,60,6.4905319660930926E-4,60,3287.5754818744936,60,0.12981063932186185,null,null,60,5.2850811588218099E+17,60,6.4905319660930926E-4,60,23908228281.830704,60,0.12981063932186185]
[70,676.12473658516626,70,5.563313113794079E-4,70,8429.1308953647185,70,0.11126626227588159,null,null,70,1E+40,70,5.563313113794079E-4,70,807730458.70962799,70,0.11126626227588159]
[80,1733.543780679604,80,4.8678989745698194E-4,80,21611.796945163089,80,9.7357979491396393E-2,null,null,80,781362279138714.75,80,4.8678989745698194E-4,80,65314575.250077285,80,9.7357979491396393E-2]
[90,4444.7287998626098,90,4.327021310728728E-4,90,55411.703790209322,90,8.6540426214574556E-2,null,null,90,13445349123755.58,90,4.327021310728728E-4,90,9453806.0616483446,90,8.6540426214574556E-2]
[100,11396.250112587237,100,3.8943191796558558E-4,100,142075.2845234299,100,7.7886383593117114E-2,null,null,100,516064059702.98529,100,3.8943191796558558E-4,100,2057361.6240330329,100,7.7886383593117114E-2]
[110,29220.962713336288,110,3.5402901633235052E-4,110,364293.71335328359,110,7.0805803266470096E-2,null,null,110,36318910599.98822,110,3.5402901633235052E-4,110,602367.91667584516,110,7.0805803266470096E-2]
[120,74931.95813422557,120,3.2452659830465463E-4,120,934168.87489685277,120,6.4905319660930924E-2,null,null,120,4027517956.6149445,120,3.2452659830465463E-4,120,220309.85827797701,120,6.4905319660930924E-2]
[130,192194.38006763035,130,2.9956301381968122E-4,130,2396077.9324463229,130,5.9912602763936243E-2,null,null,130,633460778.51482034,130,2.9956301381968122E-4,130,95603.673406574395,130,5.9912602763936243E-2]
[140,493252.26415885304,140,2.7816565568970395E-4,140,6149397.2568166694,140,5.5633131137940793E-2,null,null,140,131101843.74843103,140,2.7816565568970395E-4,140,47444.645831675552,140,5.5633131137940793E-2]
[150,1267772.430119728,150,2.5962127864372368E-4,150,15805558.806201953,150,5.1924255728744734E-2,null,null,150,33792375.33900667,150,2.5962127864372368E-4,150,26207.156535338021,150,5.1924255728744734E-2]
[160,3270708.8498125845,160,2.4339494872849097E-4,160,40777349.598864093,160,4.8678989745698197E-2,null,null,160,10409506.4526264,160,2.4339494872849097E-4,160,15788.65392523328,160,4.8678989745698197E-2]
[170,8519453.2232961226,170,2.2907759880328563E-4,170,106214656.45597047,170,4.5815519760657127E-2,null,null,170,3713088.6325284056,170,2.2907759880328563E-4,170,10214.199649000782,170,4.5815519760657127E-2]
[]
[]
["Saved  19/07/2022: 15:48:02  Level Number: 5"]
[]
["BREAKTHROUGH RESULTS"]
[]
["Advanced"]
["Pollutant Linkage: Infill, Geo Barrier, Sst Unsaturated, Sst Saturated, Principal Aquifer",null,null,null,null,null,null,null,null,null,"Pollutant Linkage: Infill, Geo Barrier, Sst Unsaturated, Sst Saturated, Principal Aquifer at Site Boundary"]
["Concentrations in mg/L in Principal Aquifer",null,null,null,null,null,null,null,null,null,"Concentrations in mg/L in Principal Aquifer at Site Boundary"]
[]
["Compared with MRV target concentration in mg/L",null,null,null,null,null,null,null,null,null,"Compared with MRV target concentration in mg/L"]
[null,1.0000000000000001E-5,null,2.0000000000000001E-4,null,1E-3,null,4.9999999999999998E-8,null,null,null,1.0000000000000001E-5,null,2.0000000000000001E-4,null,1E-3,null,4.9999999999999998E-8]
[]
[null,"Species1",null,"Species2",null,"Species3",null,"Species4",null,null,null,"Species1",null,"Species2",null,"Species3",null,"Species4"]
["Time(years)","Hg","Time(years)","Pb","Time(years)","Benzene","Time(years)","BaP",null,null,"Time(years)","Hg","Time(years)","Pb","Time(years)","Benzene","Time(years)","BaP"]
[10,1.270420743759581E-22,10,1.5623641557804619E-13,10,0.19035747659215899,10,0,null,null,10,0,10,0,10,0.14336574162036245,10,0]
[20,1.9101823001759615E-15,20,3.5709699412991065E-7,20,7.424437089362397E-2,20,0,null,null,20,0,20,4.1503080157599102E-29,20,5.5916371796070036E-2,20,0]
[30,4.0136072925730753E-11,30,3.7057141792533404E-5,30,2.8957236594473353E-2,30,0,null,null,30,0,30,0,30,2.1808840342350609E-2,30,0]
[40,5.1000476086822958E-9,40,3.2176595713185154E-4,40,1.1294075148369257E-2,40,0,null,null,40,3.6215455150794416E-31,40,0,40,8.5060149420233561E-3,40,0]
[50,8.5413476127952511E-8,50,1.0325585829203798E-3,50,4.4049823202178158E-3,50,0,null,null,50,0,50,0,50,3.3175666355833933E-3,50,0]
[60,5.2112588619615903E-7,60,2.0097026382421834E-3,60,1.7180567626483691E-3,60,6.6904034875228454E-39,null,null,60,0,60,6.1462495532366566E-18,60,1.2939366816957902E-3,60,0]
[70,1.7870321856713356E-6,70,2.9375368282116504E-3,70,6.7008585198482195E-4,70,5.49978001210561E-36,null,null,70,5.7410823315825862E-24,70,0,70,5.0466829796832894E-4,70,0]
[80,4.277053354777678E-6,80,3.5916485601926334E-3,80,2.61349924097121E-4,80,1.5301854313778539E-33,null,null,80,0,80,2.586490910410325E-15,80,1.968330709984355E-4,80,0]
[90,8.0592727804916018E-6,90,3.9024204002592877E-3,90,1.0193228598083446E-4,90,5.0971852287265131E-31,null,null,90,7.6318608456652944E-22,90,1.4013919222152468E-13,90,7.6769316044326177E-5,90,0]
[100,1.2854504696747654E-5,100,3.9084445769111929E-3,100,3.9755274418039265E-5,100,3.3982310995713764E-29,null,null,100,0,100,3.5015732307386344E-12,100,2.9941329141883287E-5,100,0]
[110,1.8176324152647144E-5,110,3.6938852947188783E-3,110,1.550463798343037E-5,110,0,null,null,110,0,110,4.7465422626417938E-11,110,1.1677200684152405E-5,110,0]
[120,2.3500030737917005E-5,120,3.3463773202112215E-3,120,6.0462756746814106E-6,120,0,null,null,120,8.2491400283878751E-20,120,4.0730076182217979E-10,120,4.5537225757048224E-6,120,0]
[130,2.8382182844844978E-5,130,2.937499998128749E-3,130,2.3572855710460495E-6,130,1.6517716744021886E-25,null,null,130,0,130,2.4588980372121327E-9,130,1.7753890701382891E-6,130,0]
[140,3.2514895972245432E-5,140,2.5178257109880232E-3,140,9.1850222592565528E-7,140,1.2732565634573823E-24,null,null,140,0,140,1.1260638456868917E-8,140,6.9177710690072028E-7,140,0]
[150,3.573069357644126E-5,150,2.119014100208982E-3,150,3.5735597045663478E-7,150,0,null,null,150,1.8842864744076198E-18,150,4.1342742948310366E-8,150,2.6915064193270027E-7,150,0]
[160,3.7980176973298909E-5,160,1.7582648387241995E-3,160,1.385116438523589E-7,160,0,null,null,160,2.1540650873158318E-17,160,1.2684693596655163E-7,160,1.0432653316547033E-7,160,0]
[170,3.9299999055183943E-5,170,1.4428175227984433E-3,170,5.3174266692708093E-8,170,1.6047655347595908E-22,null,null,170,1.7343519272299566E-16,170,3.3574315084712353E-7,170,4.0051326679554089E-8,170,0]
[180,3.9781574008728398E-5,180,1.1736205598372941E-3,180,1.9908738878461829E-8,180,7.5373605740599328E-22,null,null,180,1.1858665234827275E-15,180,7.858279572211632E-7,180,1.4995545231682382E-8,180,0]
[190,3.9545310875468097E-5,190,9.4800459224037232E-4,190,6.9519101805668931E-9,190,0,null,null,190,6.6276495893755531E-15,190,1.6585734825769447E-6,190,5.2347105911486726E-9,190,0]
[200,3.8721641824022183E-5,200,7.6148706206248268E-4,200,1.9158934336303897E-9,200,0,null,null,200,3.087701829559206E-14,200,3.206502234634766E-6,200,1.4402182108639954E-9,200,0]
[]
[]
["Pollutant Linkage: Infill, Geo Barrier, Sst Unsaturated, Sst Saturated, Principal Aquifer",null,null,null,null,null,null,null,null,null,"Pollutant Linkage: Infill, Geo Barrier, Sst Unsaturated, Sst Saturated, Principal Aquifer at Site Boundary"]
["Remedial Target Concentrations in mg/L in Infill",null,null,null,null,null,null,null,null,null,"Remedial Target Concentrations in mg/L in Infill"]
[]
[null,"Species1",null,"Species2",null,"Species3",null,"Species4",null,null,null,"Species1",null,"Species2",null,"Species3",null,"Species4"]
["Time(years)","Hg","Time(years)","Pb","Time(years)","Benzene","Time(years)","BaP",null,null,"Time(years)","Hg","Time(years)","Pb","Time(years)","Benzene","Time(years)","BaP"]
[10,787140799543842.88,10,640055646.63025761,10,3.1519644551997315E-2,10,1E+40,null,null,10,1E+40,10,1E+40,10,4.1851002423495369E-2,10,1E+40]
[20,52351024.292701408,20,280.03596122016182,20,8.0814207565940516E-2,20,1E+40,null,null,20,1E+40,20,2.409459722513879E+24,20,0.10730309938352792,20,1E+40]
[30,2491.5242750590883,30,2.69853515848189,30,0.20720209196844194,30,1E+40,null,null,30,1E+40,30,1E+40,30,0.27511779195102798,30,1E+40]
[40,19.607660099047017,40,0.31078489748069443,40,0.53125199905070009,40,1E+40,null,null,40,2.7612520561627245E+23,40,1E+40,40,0.70538319540886663,40,1E+40]
[50,1.1707754388803513,50,9.6846805260356814E-2,50,1.3620940026164088,50,1E+40,null,null,50,1E+40,50,1E+40,50,1.8085544795530237,50,1E+40]
[60,0.19189221385628619,60,4.975860512750608E-2,60,3.4923176756692569,60,7.4733908191406768E+32,null,null,60,1E+40,60,16270084566829.756,60,4.6370120616231398,60,1E+40]
[70,5.5958701136898069E-2,70,3.4042126396379248E-2,70,8.9540765294890985,70,9.0912727218078894E+29,null,null,70,1.7418318397888926E+16,70,1E+40,70,11.888997236708809,70,1E+40]
[80,2.3380582776292728E-2,80,2.7842367738406076E-2,80,22.957726200717481,80,3.2675778356468564E+27,null,null,80,1E+40,80,38662420810.184036,80,30.482682455570131,80,1E+40]
[90,1.2408067417951347E-2,90,2.5625122294193555E-2,90,58.862606114103372,90,9.8093354972097141E+24,null,null,90,131029642733590.33,90,713576255.25574064,90,78.156225809483999,90,1E+40]
[100,7.7793740295027652E-3,100,2.5585625696406589E-2,100,150.92337024033856,100,1.471353728894617E+23,null,null,100,1E+40,100,28558591.641650643,100,200.3919055018479,100,1E+40]
[110,5.5016624461682656E-3,110,2.7071766452241845E-2,110,386.98097991143885,110,1E+40,null,null,110,1E+40,110,2106796.789466334,110,513.82177649330288,110,1E+40]
[120,4.2553135830010322E-3,120,2.988306172051395E-2,120,992.34641667511323,120,1E+40,null,null,120,1212247575575.9834,120,245518.81403958242,120,1317.6033234899744,120,1E+40]
[130,3.5233371776463942E-3,130,3.4042553213175203E-2,130,2545.3004394955378,130,3.0270527564347572E+19,null,null,130,1E+40,130,40668.624109919874,130,3379.5409135489645,130,1E+40]
[140,3.0755134534448318E-3,140,3.9716807864655125E-2,140,6532.3739351347504,140,3.926938327671426E+18,null,null,140,1E+40,140,8880.4911358290392,140,8673.3139043600713,140,1E+40]
[150,2.7987142143228419E-3,150,4.7191757709463933E-2,150,16789.981128153842,150,1E+40,null,null,150,53070486551.912399,150,2418.8041931573603,150,22292.348838240072,150,1E+40]
[160,2.6329524496503192E-3,160,5.6874253410288407E-2,160,43317.657874275661,160,1E+40,null,null,160,4642385255.1553783,160,788.35171884931526,160,57511.735681693885,160,1E+40]
[170,2.5445293232598518E-3,170,6.9308833875293643E-2,170,112836.53491027444,170,3.11571995515784E+16,null,null,170,576584247.00295019,170,297.84673119224334,170,149807.77161279295,170,1E+40]
[180,2.5137265805033056E-3,180,8.5206414596097041E-2,180,301375.19190083258,180,6633621877143120,null,null,180,84326522.437207952,180,127.25431703094273,180,400118.82911221409,180,1E+40]
[190,2.5287448192001681E-3,190,0.10548472108523753,190,863072.14048480848,190,1E+40,null,null,190,15088305.235736197,190,60.292776322836694,190,1146195.1707789442,190,1E+40]
[200,2.582535122205533E-3,200,0.13132199479417372,200,3131698.1908699982,200,1E+40,null,null,200,3238654.6862355489,200,31.186630378690637,200,4166035.3651552321,200,1E+40]
[]
["Compared with source concentrations in mg/L",null,null,null,null,null,null,null,null,null,"Compared with source concentrations in mg/L"]
[null,0.01,null,0.5,null,6,null,100,null,null,null,0.01,null,0.5,null,6,null,100]
[]
[]
["Pollutant Linkage: Infill, Geo Barrier, Sst Unsaturated, Sst Saturated, Principal Aquifer",null,null,null,null,null,null,null,null,null,"Pollutant Linkage: Infill, Geo Barrier, Sst Unsaturated, Sst Saturated, Principal Aquifer at Site Boundary"]
["Dilution Factor",null,null,null,null,null,null,null,null,null,"Dilution Factor"]
[]
[null,12.83921468512464,"for all species and timeslices",null,null,null,null,null,null,null,null,12.83921468512464,"for all species and timeslices"]
[]
[]
["Pollutant Linkage: Infill, Geo Barrier, Sst Unsaturated, Sst Saturated, Principal Aquifer",null,null,null,null,null,null,null,null,null,"Pollutant Linkage: Infill, Geo Barrier, Sst Unsaturated, Sst Saturated, Principal Aquifer at Site Boundary"]
["Attenuation Factor",null,null,null,null,null,null,null,null,null,"Attenuation Factor"]
[]
[null,"Species1",null,"Species2",null,"Species3",null,"Species4",null,null,null,"Species1",null,"Species2",null,"Species3",null,"Species4"]
["Time(years)","Hg","Time(years)","Pb","Time(years)","Benzene","Time(years)","BaP",null,null,"Time(years)","Hg","Time(years)","Pb","Time(years)","Benzene","Time(years)","BaP"]
[10,6.1307550255064648E+18,10,3.8943191796558555E-3,10,2991097176863.0913,10,0.77886383593117114,null,null,10,1E+40,10,3.8943191796558555E-3,10,1E+40,10,0.77886383593117114]
[20,407743195955.39331,20,1.9471595898279278E-3,20,1308659.2977276472,20,0.38943191796558557,null,null,20,1E+40,20,1.9471595898279278E-3,20,1.1259846251992889E+28,20,0.38943191796558557]
[30,19405581.541881513,30,1.2981063932186185E-3,30,12610.748669582013,30,0.2596212786437237,null,null,30,1E+40,30,1.2981063932186185E-3,30,1E+40,30,0.2596212786437237]
[40,152716.97358378326,40,9.7357979491396389E-4,40,1452.3547044077366,40,0.19471595898279279,null,null,40,2.1506393684357328E+27,40,9.7357979491396389E-4,40,1E+40,40,0.19471595898279279]
[50,9118.746493403507,50,7.7886383593117115E-4,50,452.58284545656369,50,0.15577276718623423,null,null,50,1E+40,50,7.7886383593117115E-4,50,1E+40,50,0.15577276718623423]
[60,1494.5790576943166,60,6.4905319660930926E-4,60,232.53106836116294,60,0.12981063932186185,null,null,60,1E+40,60,6.4905319660930926E-4,60,7.6033082859873408E+16,60,0.12981063932186185]
[70,435.84208621210411,70,5.563313113794079E-4,70,159.0850868900263,70,0.11126626227588159,null,null,70,1.3566498282850258E+20,70,5.563313113794079E-4,70,1E+40,70,0.11126626227588159]
[80,182.10290387449621,80,4.8678989745698194E-4,80,130.11248002884741,80,9.7357979491396393E-2,null,null,80,1E+40,80,4.8678989745698194E-4,80,180676568271630.44,80,9.7357979491396393E-2]
[90,96.641949856381672,90,4.327021310728728E-4,90,119.75088627756577,90,8.6540426214574556E-2,null,null,90,1.0205425016017505E+18,90,4.327021310728728E-4,90,3334672436387.3198,90,8.6540426214574556E-2]
[100,60.590730977618549,100,3.8943191796558558E-4,100,119.56631144761427,100,7.7886383593117114E-2,null,null,100,1E+40,100,3.8943191796558558E-4,100,133459525408.84741,100,7.7886383593117114E-2]
[110,42.850459168210847,110,3.5402901633235052E-4,110,126.51131918655523,110,7.0805803266470096E-2,null,null,110,1E+40,110,3.5402901633235052E-4,110,9845446973.8273487,110,7.0805803266470096E-2]
[120,33.143098603462001,120,3.2452659830465463E-4,120,139.64901648604462,120,6.4905319660930924E-2,null,null,120,9441757968113726,120,3.2452659830465463E-4,120,1147354351.7768459,120,6.4905319660930924E-2]
[130,27.441999094605762,130,2.9956301381968122E-4,130,159.08708148302793,130,5.9912602763936243E-2,null,null,130,1E+40,130,2.9956301381968122E-4,130,190051923.45777062,130,5.9912602763936243E-2]
[140,23.95406205807965,140,2.7816565568970395E-4,140,185.60391194643958,140,5.5633131137940793E-2,null,null,140,1E+40,140,2.7816565568970395E-4,140,41500160.346027404,140,5.5633131137940793E-2]
[150,21.798172886425821,150,2.5962127864372368E-4,150,220.53572060356495,150,5.1924255728744734E-2,null,null,150,413346827305561.19,150,2.5962127864372368E-4,150,11303514.673493657,150,5.1924255728744734E-2]
[160,20.507114447590212,160,2.4339494872849097E-4,160,265.78379506115232,160,4.8678989745698197E-2,null,null,160,36157859877006.266,160,2.4339494872849097E-4,160,3684111.8628354589,160,4.8678989745698197E-2]
[170,19.818418693535151,170,2.2907759880328563E-4,170,323.89286529616498,170,4.5815519760657127E-2,null,null,170,4490806183582.0361,170,2.2907759880328563E-4,170,1391892.2854557061,170,4.5815519760657127E-2]
[180,19.578507269729503,180,2.163510655364364E-4,180,398.18516950954717,180,4.3270213107287278E-2,null,null,180,656788787361.79749,180,2.163510655364364E-4,180,594682.71300912846,180,4.3270213107287278E-2]
[190,19.695478899733185,190,2.049641673503082E-4,190,492.94940697946669,190,4.0992833470061635E-2,null,null,190,117517352936.05865,190,2.049641673503082E-4,190,281759.17827446805,190,4.0992833470061635E-2]
[200,20.114432117079772,200,1.9471595898279279E-4,200,613.69171564514056,200,3.8943191796558557E-2,null,null,200,25224710121.778828,200,1.9471595898279279E-4,200,145740.83139908747,200,3.8943191796558557E-2]
[]
[]
["Saved  19/07/2022: 15:50:12  Level Number: 5"]
[]
["BREAKTHROUGH RESULTS"]
[]
["Advanced"]
["Pollutant Linkage: Infill, Geo Barrier, Sst Unsaturated, Sst Saturated, Principal Aquifer",null,null,null,null,null,null,null,null,null,"Pollutant Linkage: Infill, Geo Barrier, Sst Unsaturated, Sst Saturated, Principal Aquifer at Site Boundary"]
["Concentrations in mg/L in Principal Aquifer",null,null,null,null,null,null,null,null,null,"Concentrations in mg/L in Principal Aquifer at Site Boundary"]
[]
["Compared with MRV target concentration in mg/L",null,null,null,null,null,null,null,null,null,"Compared with MRV target concentration in mg/L"]
[null,1.0000000000000001E-5,null,2.0000000000000001E-4,null,1E-3,null,4.9999999999999998E-8,null,null,null,1.0000000000000001E-5,null,2.0000000000000001E-4,null,1E-3,null,4.9999999999999998E-8]
[]
[null,"Species1",null,"Species2",null,"Species3",null,"Species4",null,null,null,"Species1",null,"Species2",null,"Species3",null,"Species4"]
["Time(years)","Hg","Time(years)","Pb","Time(years)","Benzene","Time(years)","BaP",null,null,"Time(years)","Hg","Time(years)","Pb","Time(years)","Benzene","Time(years)","BaP"]
[1,0,1,0,1,0.43385444091177278,1,0,null,null,1,0,1,0,1,0.21954271252300364,1,0]
[2,0,2,1.6092657620787457E-30,2,0.40426239412730125,2,0,null,null,2,0,2,0,2,0.30342491353810946,2,0]
[5,0,5,3.3284870222449424E-21,5,0.30480573937080069,5,0,null,null,5,0,5,0,5,0.22956125261927754,5,0]
[10,1.270420743759581E-22,10,1.5623641557804619E-13,10,0.19035747659215899,10,0,null,null,10,0,10,0,10,0.14336574162036245,10,0]
[15,4.9699590723092962E-20,15,2.9127414689215349E-9,15,0.11888217337343239,15,0,null,null,15,0,15,0,15,8.953486549559965E-2,15,0]
[20,1.9101823001759615E-15,20,3.5709699412991065E-7,20,7.424437089362397E-2,20,0,null,null,20,0,20,4.1503080157599102E-29,20,5.5916371796070036E-2,20,0]
[30,4.0136072925730753E-11,30,3.7057141792533404E-5,30,2.8957236594473353E-2,30,0,null,null,30,0,30,0,30,2.1808840342350609E-2,30,0]
[40,5.1000476086822958E-9,40,3.2176595713185154E-4,40,1.1294075148369257E-2,40,0,null,null,40,3.6215455150794416E-31,40,0,40,8.5060149420233561E-3,40,0]
[50,8.5413476127952511E-8,50,1.0325585829203798E-3,50,4.4049823202178158E-3,50,0,null,null,50,0,50,0,50,3.3175666355833933E-3,50,0]
[60,5.2112588619615903E-7,60,2.0097026382421834E-3,60,1.7180567626483691E-3,60,6.6904034875228454E-39,null,null,60,0,60,6.1462495532366566E-18,60,1.2939366816957902E-3,60,0]
[70,1.7870321856713356E-6,70,2.9375368282116504E-3,70,6.7008585198482195E-4,70,5.49978001210561E-36,null,null,70,5.7410823315825862E-24,70,0,70,5.0466829796832894E-4,70,0]
[80,4.277053354777678E-6,80,3.5916485601926334E-3,80,2.61349924097121E-4,80,1.5301854313778539E-33,null,null,80,0,80,2.586490910410325E-15,80,1.968330709984355E-4,80,0]
[90,8.0592727804916018E-6,90,3.9024204002592877E-3,90,1.0193228598083446E-4,90,5.0971852287265131E-31,null,null,90,7.6318608456652944E-22,90,1.4013919222152468E-13,90,7.6769316044326177E-5,90,0]
[100,1.2854504696747654E-5,100,3.9084445769111929E-3,100,3.9755274418039265E-5,100,3.3982310995713764E-29,null,null,100,0,100,3.5015732307386344E-12,100,2.9941329141883287E-5,100,0]
[120,2.3500030737917005E-5,120,3.3463773202112215E-3,120,6.0462756746814106E-6,120,0,null,null,120,8.2491400283878751E-20,120,4.0730076182217979E-10,120,4.5537225757048224E-6,120,0]
[140,3.2514895972245432E-5,140,2.5178257109880232E-3,140,9.1850222592565528E-7,140,1.2732565634573823E-24,null,null,140,0,140,1.1260638456868917E-8,140,6.9177710690072028E-7,140,0]
[160,3.7980176973298909E-5,160,1.7582648387241995E-3,160,1.385116438523589E-7,160,0,null,null,160,2.1540650873158318E-17,160,1.2684693596655163E-7,160,1.0432653316547033E-7,160,0]
[180,3.9781574008728398E-5,180,1.1736205598372941E-3,180,1.9908738878461829E-8,180,7.5373605740599328E-22,null,null,180,1.1858665234827275E-15,180,7.858279572211632E-7,180,1.4995545231682382E-8,180,0]
[200,3.8721641824022183E-5,200,7.6148706206248268E-4,200,1.9158934336303897E-9,200,0,null,null,200,3.087701829559206E-14,200,3.206502234634766E-6,200,1.4402182108639954E-9,200,0]
[250,2.9834993157150635E-5,250,2.4152765449591689E-4,250,0,250,0,null,null,250,9.6742016213983573E-12,250,3.3732951449498379E-5,250,0,250,0]
[]
[]
["Pollutant Linkage: Infill, Geo Barrier, Sst Unsaturated, Sst Saturated, Principal Aquifer",null,null,null,null,null,null,null,null,null,"Pollutant Linkage: Infill, Geo Barrier, Sst Unsaturated, Sst Saturated, Principal Aquifer at Site Boundary"]
["Remedial Target Concentrations in mg/L in Infill",null,null,null,null,null,null,null,null,null,"Remedial Target Concentrations in mg/L in Infill"]
[]
[null,"Species1",null,"Species2",null,"Species3",null,"Species4",null,null,null,"Species1",null,"Species2",null,"Species3",null,"Species4"]
["Time(years)","Hg","Time(years)","Pb","Time(years)","Benzene","Time(years)","BaP",null,null,"Time(years)","Hg","Time(years)","Pb","Time(years)","Benzene","Time(years)","BaP"]
[1,1E+40,1,1E+40,1,1.3829523070895891E-2,1,1E+40,null,null,1,1E+40,1,1E+40,1,2.7329533879979374E-2,1,1E+40]
[2,1E+40,2,6.2140140153622887E+25,2,1.4841845512126995E-2,2,1E+40,null,null,2,1E+40,2,1E+40,2,1.9774249681862113E-2,2,1E+40]
[5,1E+40,5,3.0043680306301352E+16,5,1.9684668708619398E-2,5,1E+40,null,null,5,1E+40,5,1E+40,5,2.6136815039735268E-2,5,1E+40]
[10,787140799543842.88,10,640055646.63025761,10,3.1519644551997315E-2,10,1E+40,null,null,10,1E+40,10,1E+40,10,4.1851002423495369E-2,10,1E+40]
[15,2012089004055.6191,15,34331.917565284566,15,5.0470140558019704E-2,15,1E+40,null,null,15,1E+40,15,1E+40,15,6.7013000653861274E-2,15,1E+40]
[20,52351024.292701408,20,280.03596122016182,20,8.0814207565940516E-2,20,1E+40,null,null,20,1E+40,20,2.409459722513879E+24,20,0.10730309938352792,20,1E+40]
[30,2491.5242750590883,30,2.69853515848189,30,0.20720209196844194,30,1E+40,null,null,30,1E+40,30,1E+40,30,0.27511779195102798,30,1E+40]
[40,19.607660099047017,40,0.31078489748069443,40,0.53125199905070009,40,1E+40,null,null,40,2.7612520561627245E+23,40,1E+40,40,0.70538319540886663,40,1E+40]
[50,1.1707754388803513,50,9.6846805260356814E-2,50,1.3620940026164088,50,1E+40,null,null,50,1E+40,50,1E+40,50,1.8085544795530237,50,1E+40]
[60,0.19189221385628619,60,4.975860512750608E-2,60,3.4923176756692569,60,7.4733908191406768E+32,null,null,60,1E+40,60,16270084566829.756,60,4.6370120616231398,60,1E+40]
[70,5.5958701136898069E-2,70,3.4042126396379248E-2,70,8.9540765294890985,70,9.0912727218078894E+29,null,null,70,1.7418318397888926E+16,70,1E+40,70,11.888997236708809,70,1E+40]
[80,2.3380582776292728E-2,80,2.7842367738406076E-2,80,22.957726200717481,80,3.2675778356468564E+27,null,null,80,1E+40,80,38662420810.184036,80,30.482682455570131,80,1E+40]
[90,1.2408067417951347E-2,90,2.5625122294193555E-2,90,58.862606114103372,90,9.8093354972097141E+24,null,null,90,131029642733590.33,90,713576255.25574064,90,78.156225809483999,90,1E+40]
[100,7.7793740295027652E-3,100,2.5585625696406589E-2,100,150.92337024033856,100,1.471353728894617E+23,null,null,100,1E+40,100,28558591.641650643,100,200.3919055018479,100,1E+40]
[120,4.2553135830010322E-3,120,2.988306172051395E-2,120,992.34641667511323,120,1E+40,null,null,120,1212247575575.9834,120,245518.81403958242,120,1317.6033234899744,120,1E+40]
[140,3.0755134534448318E-3,140,3.9716807864655125E-2,140,6532.3739351347504,140,3.926938327671426E+18,null,null,140,1E+40,140,8880.4911358290392,140,8673.3139043600713,140,1E+40]
[160,2.6329524496503192E-3,160,5.6874253410288407E-2,160,43317.657874275661,160,1E+40,null,null,160,4642385255.1553783,160,788.35171884931526,160,57511.735681693885,160,1E+40]
[180,2.5137265805033056E-3,180,8.5206414596097041E-2,180,301375.19190083258,180,6633621877143120,null,null,180,84326522.437207952,180,127.25431703094273,180,400118.82911221409,180,1E+40]
[200,2.582535122205533E-3,200,0.13132199479417372,200,3131698.1908699982,200,1E+40,null,null,200,3238654.6862355489,200,31.186630378690637,200,4166035.3651552321,200,1E+40]
[250,3.3517688264001742E-3,250,0.41403126366090942,250,1E+40,250,1E+40,null,null,250,10336.770300384282,250,2.9644604371399303,250,1E+40,250,1E+40]
[]
["Compared with source concentrations in mg/L",null,null,null,null,null,null,null,null,null,"Compared with source concentrations in mg/L"]
[null,0.01,null,0.5,null,6,null,100,null,null,null,0.01,null,0.5,null,6,null,100]
[]
[]
["Pollutant Linkage: Infill, Geo Barrier, Sst Unsaturated, Sst Saturated, Principal Aquifer",null,null,null,null,null,null,null,null,null,"Pollutant Linkage: Infill, Geo Barrier, Sst Unsaturated, Sst Saturated, Principal Aquifer at Site Boundary"]
["Dilution Factor",null,null,null,null,null,null,null,null,null,"Dilution Factor"]
[]
[null,12.83921468512464,"for all species and timeslices",null,null,null,null,null,null,null,null,12.83921468512464,"for all species and timeslices"]
[]
[]
["Pollutant Linkage: Infill, Geo Barrier, Sst Unsaturated, Sst Saturated, Principal Aquifer",null,null,null,null,null,null,null,null,null,"Pollutant Linkage: Infill, Geo Barrier, Sst Unsaturated, Sst Saturated, Principal Aquifer at Site Boundary"]
["Attenuation Factor",null,null,null,null,null,null,null,null,null,"Attenuation Factor"]
[]
[null,"Species1",null,"Species2",null,"Species3",null,"Species4",null,null,null,"Species1",null,"Species2",null,"Species3",null,"Species4"]
["Time(years)","Hg","Time(years)","Pb","Time(years)","Benzene","Time(years)","BaP",null,null,"Time(years)","Hg","Time(years)","Pb","Time(years)","Benzene","Time(years)","BaP"]
[1,1E+40,1,3.8943191796558557E-2,1,1E+40,1,7.7886383593117108,null,null,1,1E+40,1,3.8943191796558557E-2,1,1E+40,1,7.7886383593117108]
[2,1E+40,2,1.9471595898279279E-2,2,2.9039224755210789E+29,2,3.8943191796558554,null,null,2,1E+40,2,1.9471595898279279E-2,2,1E+40,2,3.8943191796558554]
[5,1E+40,5,7.7886383593117111E-3,5,1.403996165331339E+20,5,1.5577276718623423,null,null,5,1E+40,5,7.7886383593117111E-3,5,1E+40,5,1.5577276718623423]
[10,6.1307550255064648E+18,10,3.8943191796558555E-3,10,2991097176863.0913,10,0.77886383593117114,null,null,10,1E+40,10,3.8943191796558555E-3,10,1E+40,10,0.77886383593117114]
[15,1.5671433599336892E+16,15,2.596212786437237E-3,15,160439334.0586217,15,0.51924255728744739,null,null,15,1E+40,15,2.596212786437237E-3,15,1E+40,15,0.51924255728744739]
[20,407743195955.39331,20,1.9471595898279278E-3,20,1308659.2977276472,20,0.38943191796558557,null,null,20,1E+40,20,1.9471595898279278E-3,20,1.1259846251992889E+28,20,0.38943191796558557]
[30,19405581.541881513,30,1.2981063932186185E-3,30,12610.748669582013,30,0.2596212786437237,null,null,30,1E+40,30,1.2981063932186185E-3,30,1E+40,30,0.2596212786437237]
[40,152716.97358378326,40,9.7357979491396389E-4,40,1452.3547044077366,40,0.19471595898279279,null,null,40,2.1506393684357328E+27,40,9.7357979491396389E-4,40,1E+40,40,0.19471595898279279]
[50,9118.746493403507,50,7.7886383593117115E-4,50,452.58284545656369,50,0.15577276718623423,null,null,50,1E+40,50,7.7886383593117115E-4,50,1E+40,50,0.15577276718623423]
[60,1494.5790576943166,60,6.4905319660930926E-4,60,232.53106836116294,60,0.12981063932186185,null,null,60,1E+40,60,6.4905319660930926E-4,60,7.6033082859873408E+16,60,0.12981063932186185]
[70,435.84208621210411,70,5.563313113794079E-4,70,159.0850868900263,70,0.11126626227588159,null,null,70,1.3566498282850258E+20,70,5.563313113794079E-4,70,1E+40,70,0.11126626227588159]
[80,182.10290387449621,80,4.8678989745698194E-4,80,130.11248002884741,80,9.7357979491396393E-2,null,null,80,1E+40,80,4.8678989745698194E-4,80,180676568271630.44,80,9.7357979491396393E-2]
[90,96.641949856381672,90,4.327021310728728E-4,90,119.75088627756577,90,8.6540426214574556E-2,null,null,90,1.0205425016017505E+18,90,4.327021310728728E-4,90,3334672436387.3198,90,8.6540426214574556E-2]
[100,60.590730977618549,100,3.8943191796558558E-4,100,119.56631144761427,100,7.7886383593117114E-2,null,null,100,1E+40,100,3.8943191796558558E-4,100,133459525408.84741,100,7.7886383593117114E-2]
[120,33.143098603462001,120,3.2452659830465463E-4,120,139.64901648604462,120,6.4905319660930924E-2,null,null,120,9441757968113726,120,3.2452659830465463E-4,120,1147354351.7768459,120,6.4905319660930924E-2]
[140,23.95406205807965,140,2.7816565568970395E-4,140,185.60391194643958,140,5.5633131137940793E-2,null,null,140,1E+40,140,2.7816565568970395E-4,140,41500160.346027404,140,5.5633131137940793E-2]
[160,20.507114447590212,160,2.4339494872849097E-4,160,265.78379506115232,160,4.8678989745698197E-2,null,null,160,36157859877006.266,160,2.4339494872849097E-4,160,3684111.8628354589,160,4.8678989745698197E-2]
[180,19.578507269729503,180,2.163510655364364E-4,180,398.18516950954717,180,4.3270213107287278E-2,null,null,180,656788787361.79749,180,2.163510655364364E-4,180,594682.71300912846,180,4.3270213107287278E-2]
[200,20.114432117079772,200,1.9471595898279279E-4,200,613.69171564514056,200,3.8943191796558557E-2,null,null,200,25224710121.778828,200,1.9471595898279279E-4,200,145740.83139908747,200,3.8943191796558557E-2]
[250,26.105715252845588,250,1.5577276718623423E-4,250,1934.843869262196,250,3.1154553437246844E-2,null,null,250,80509365.672967061,250,1.5577276718623423E-4,250,13853.466165222013,250,3.1154553437246844E-2]
[]
[]
["Saved  19/07/2022: 15:51:33  Level Number: 5"]
[]
["BREAKTHROUGH RESULTS"]
[]
["Advanced"]
["Pollutant Linkage: Infill, Geo Barrier, Sst Unsaturated, Sst Saturated, Principal Aquifer",null,null,null,null,null,null,null,null,null,"Pollutant Linkage: Infill, Geo Barrier, Sst Unsaturated, Sst Saturated, Principal Aquifer at Site Boundary"]
["Concentrations in mg/L in Principal Aquifer",null,null,null,null,null,null,null,null,null,"Concentrations in mg/L in Principal Aquifer at Site Boundary"]
[]
["Compared with MRV target concentration in mg/L",null,null,null,null,null,null,null,null,null,"Compared with MRV target concentration in mg/L"]
[null,1.0000000000000001E-5,null,2.0000000000000001E-4,null,1E-3,null,4.9999999999999998E-8,null,null,null,1.0000000000000001E-5,null,2.0000000000000001E-4,null,1E-3,null,4.9999999999999998E-8]
[]
[null,"Species1",null,"Species2",null,"Species3",null,"Species4",null,null,null,"Species1",null,"Species2",null,"Species3",null,"Species4"]
["Time(years)","Hg","Time(years)","Pb","Time(years)","Benzene","Time(years)","BaP",null,null,"Time(years)","Hg","Time(years)","Pb","Time(years)","Benzene","Time(years)","BaP"]
[1,0,1,0,1,0.38472840311973772,1,0,null,null,1,0,1,0,1,0.12892548493257724,1,0]
[2,0,2,0,2,0.41179605032013866,2,0,null,null,2,0,2,0,2,0.301851695011919,2,0]
[5,4.3680141596758242E-36,5,0,5,0.311573526055681,5,0,null,null,5,0,5,0,5,0.23465826400996123,5,0]
[10,0,10,0,10,0.19458410765024542,10,0,null,null,10,0,10,0,10,0.14654898424870558,10,0]
[15,5.3977342755822583E-23,15,1.9975790949171065E-13,15,0.12152179209983593,15,0,null,null,15,0,15,0,15,9.1522866288106741E-2,15,0]
[20,1.1800893539286726E-21,20,2.8761515285952744E-10,20,7.5892867494815358E-2,20,0,null,null,20,0,20,1.2698316835121998E-31,20,5.7157919497091515E-2,20,0]
[30,2.2807461181742009E-15,30,3.6038506742761173E-7,30,2.960019336417407E-2,30,0,null,null,30,0,30,3.0961197343948853E-25,30,2.2293076478027245E-2,30,0]
[40,3.6299839932023248E-12,40,1.1308736428772712E-5,40,1.1544845124387091E-2,40,0,null,null,40,6.2757882106854516E-34,40,5.9173496664902488E-22,40,8.6948797715418573E-3,40,0]
[50,2.8086994179260727E-10,50,8.1225454287439951E-5,50,4.5027891980038721E-3,50,0,null,null,50,0,50,1.5628833858307043E-20,50,3.3912289234702105E-3,50,0]
[60,4.8233630331369797E-9,60,2.7856843931105084E-4,60,1.7562040287285793E-3,60,0,null,null,60,2.1800882235660786E-27,60,0,60,1.3226669553479953E-3,60,0]
[70,3.5108070381820683E-8,70,6.2558280155782127E-4,70,6.8496429959940533E-4,70,0,null,null,70,0,70,8.0365132343709973E-18,70,5.1587389817647322E-4,70,0]
[80,1.4953356557361392E-7,80,1.078136918293508E-3,80,2.6715291503363333E-4,80,0,null,null,80,5.8137922424909835E-24,80,0,80,2.0120357910631618E-4,80,0]
[90,4.4574715968958169E-7,90,1.5582426984386624E-3,90,1.0419560513842497E-4,90,6.6455780104572115E-39,null,null,90,0,90,1.5371308881225428E-15,90,7.8473951072493715E-5,90,0]
[100,1.0354494024182917E-6,100,1.9926892568442236E-3,100,4.0638023523933438E-5,100,0,null,null,100,9.0853137079459074E-23,100,5.7653440708617972E-14,100,3.0606197181289862E-5,100,0]
[120,3.3991578615012524E-6,120,2.5598390199418294E-3,120,6.1805450115266625E-6,120,1.3607430507866162E-33,null,null,120,0,120,1.4231792874089629E-11,120,4.654872574849485E-6,120,0]
[140,7.3108977666160025E-6,140,2.6879327895737515E-3,140,9.3890551289061714E-7,140,2.2640423074345987E-30,null,null,140,1.0221813438987251E-19,140,6.7944341173540298E-10,140,7.0716426052476479E-7,140,0]
[160,1.2115832319373847E-5,160,2.5015364688987063E-3,160,1.4159078062247044E-7,160,0,null,null,160,0,160,1.1626979628642196E-8,160,1.0666223546049369E-7,160,0]
[180,1.6928778645564212E-5,180,2.1569777990678419E-3,180,2.0350417868514432E-8,180,0,null,null,180,1.2578623152851906E-17,180,1.0040239708170918E-7,180,1.5341695418170612E-8,180,0]
[200,2.1044918874135252E-5,200,1.7685658952987465E-3,200,1.9543401188869092E-9,200,3.7670664649776548E-25,null,null,200,4.6866630225681633E-16,200,5.3738250044721452E-7,200,1.4804254073076883E-9,200,0]
[250,2.6440088924919082E-5,250,9.465938816424701E-4,250,0,250,4.6397616572621592E-23,null,null,250,3.7247868778086436E-13,250,9.3688407210551382E-6,250,0,250,0]
[]
[]
["Pollutant Linkage: Infill, Geo Barrier, Sst Unsaturated, Sst Saturated, Principal Aquifer",null,null,null,null,null,null,null,null,null,"Pollutant Linkage: Infill, Geo Barrier, Sst Unsaturated, Sst Saturated, Principal Aquifer at Site Boundary"]
["Remedial Target Concentrations in mg/L in Infill",null,null,null,null,null,null,null,null,null,"Remedial Target Concentrations in mg/L in Infill"]
[]
[null,"Species1",null,"Species2",null,"Species3",null,"Species4",null,null,null,"Species1",null,"Species2",null,"Species3",null,"Species4"]
["Time(years)","Hg","Time(years)","Pb","Time(years)","Benzene","Time(years)","BaP",null,null,"Time(years)","Hg","Time(years)","Pb","Time(years)","Benzene","Time(years)","BaP"]
[1,1E+40,1,1E+40,1,1.5595417316076454E-2,1,1E+40,null,null,1,1E+40,1,1E+40,1,4.6538510234324537E-2,1,1E+40]
[2,1E+40,2,1E+40,2,1.4570319446569431E-2,2,1E+40,null,null,2,1E+40,2,1E+40,2,1.9877310941596942E-2,2,1E+40]
[5,2.2893698679635599E+28,5,1E+40,5,1.9257091820207298E-2,5,1E+40,null,null,5,1E+40,5,1E+40,5,2.5569097365116877E-2,5,1E+40]
[10,1E+40,10,1E+40,10,3.0834995069508354E-2,10,1E+40,null,null,10,1E+40,10,1E+40,10,4.0941941909454049E-2,10,1E+40]
[15,1852629175399949,15,500605959.75625038,15,4.937386041073781E-2,15,1E+40,null,null,15,1E+40,15,1E+40,15,6.5557387386803154E-2,15,1E+40]
[20,84739345937735.016,20,347686.82736559596,20,7.905881274561001E-2,20,1E+40,null,null,20,1E+40,20,7.8750594506676809E+26,20,0.10497233021760546,20,1E+40]
[30,43845300.975477584,30,277.4809753183971,30,0.20270137854105932,30,1E+40,null,null,30,1E+40,30,3.2298492493393284E+20,30,0.26914185693095288,30,1E+40]
[40,27548.330843128955,40,8.8427209025378772,40,0.51971247213405447,40,1E+40,null,null,40,1.5934253458352104E+26,40,1.6899457634943667E+17,40,0.69006129557281093,40,1E+40]
[50,356.03667434744381,50,1.2311411598403728,50,1.3325074162165653,50,1E+40,null,null,50,1E+40,50,6398430036854476,50,1.7692701187097273,50,1E+40]
[60,20.732422443218589,60,0.35897821105405098,60,3.4164595353671734,60,1E+40,null,null,60,4.5869703307889549E+19,60,1E+40,60,4.5362893325035047,60,1E+40]
[70,2.8483479414402972,70,0.15985094179536394,70,8.7595806139225676,70,1E+40,null,null,70,1E+40,70,12443207282023.074,70,11.630749338567009,70,1E+40]
[80,0.66874617492332167,80,9.2752597840988105E-2,80,22.459047468168663,80,1E+40,null,null,80,1.7200477043045126E+16,80,1E+40,80,29.820543087007383,80,1E+40]
[90,0.22434242782307351,90,6.4174855496001118E-2,90,57.584002626876021,90,7.5238000248168076E+32,null,null,90,1E+40,90,65056268644.851944,90,76.458492506095936,90,1E+40]
[100,9.6576423499255534E-2,100,5.018343911702907E-2,100,147.64497580612769,100,1E+40,null,null,100,1100677458308800,100,1734501857.4936867,100,196.03872916521337,100,1E+40]
[120,2.941905144582917E-2,120,3.9064956515223535E-2,120,970.78817301873096,120,3.6744630054216388E+27,null,null,120,1E+40,120,7026521.5974341352,120,1288.9719113726781,120,1E+40]
[140,1.3678210692075789E-2,140,3.7203311179465119E-2,140,6390.4193953742424,140,2.2084392962009322E+24,null,null,140,978299991453.45129,140,147179.29156835095,140,8484.5916782440127,140,1E+40]
[160,8.2536632535013549E-3,160,3.9975431597055508E-2,160,42375.640374482129,160,1E+40,null,null,160,1E+40,160,8600.6859213597891,160,56252.336865959667,160,1E+40]
[180,5.9071006889326099E-3,180,4.6361163310635806E-2,180,294834.24069060636,180,1E+40,null,null,180,7949995701.8210983,180,995.99215662767801,180,391091.06500013266,180,1E+40]
[200,4.7517408167775162E-3,200,5.6542987889692392E-2,200,3070089.9715538202,200,1.3272927479472169E+19,null,null,200,213371431.90892941,200,186.08719099855151,200,4052889.1022693543,200,1E+40]
[250,3.7821355398601803E-3,250,0.10564192515853399,250,1E+40,250,1.0776415620776544E+17,null,null,250,268471.73618382087,250,10.673679164516503,250,1E+40,250,1E+40]
[]
["Compared with source concentrations in mg/L",null,null,null,null,null,null,null,null,null,"Compared with source concentrations in mg/L"]
[null,0.01,null,0.5,null,6,null,100,null,null,null,0.01,null,0.5,null,6,null,100]
[]
[]
["Pollutant Linkage: Infill, Geo Barrier, Sst Unsaturated, Sst Saturated, Principal Aquifer",null,null,null,null,null,null,null,null,null,"Pollutant Linkage: Infill, Geo Barrier, Sst Unsaturated, Sst Saturated, Principal Aquifer at Site Boundary"]
["Dilution Factor",null,null,null,null,null,null,null,null,null,"Dilution Factor"]
[]
[null,12.83921468512464,"for all species and timeslices",null,null,null,null,null,null,null,null,12.83921468512464,"for all species and timeslices"]
[]
[]
["Pollutant Linkage: Infill, Geo Barrier, Sst Unsaturated, Sst Saturated, Principal Aquifer",null,null,null,null,null,null,null,null,null,"Pollutant Linkage: Infill, Geo Barrier, Sst Unsaturated, Sst Saturated, Principal Aquifer at Site Boundary"]
["Attenuation Factor",null,null,null,null,null,null,null,null,null,"Attenuation Factor"]
[]
[null,"Species1",null,"Species2",null,"Species3",null,"Species4",null,null,null,"Species1",null,"Species2",null,"Species3",null,"Species4"]
["Time(years)","Hg","Time(years)","Pb","Time(years)","Benzene","Time(years)","BaP",null,null,"Time(years)","Hg","Time(years)","Pb","Time(years)","Benzene","Time(years)","BaP"]
[1,1E+40,1,3.8943191796558557E-2,1,1E+40,1,7.7886383593117108,null,null,1,1E+40,1,3.8943191796558557E-2,1,1E+40,1,7.7886383593117108]
[2,1E+40,2,1.9471595898279279E-2,2,1E+40,2,3.8943191796558554,null,null,2,1E+40,2,1.9471595898279279E-2,2,1E+40,2,3.8943191796558554]
[5,1.7831073972273365E+32,5,7.7886383593117111E-3,5,1E+40,5,1.5577276718623423,null,null,5,1E+40,5,7.7886383593117111E-3,5,1E+40,5,1.5577276718623423]
[10,1E+40,10,3.8943191796558555E-3,10,1E+40,10,0.77886383593117114,null,null,10,1E+40,10,3.8943191796558555E-3,10,1E+40,10,0.77886383593117114]
[15,1.4429458661100067E+19,15,2.596212786437237E-3,15,2339423268634.5513,15,0.51924255728744739,null,null,15,1E+40,15,2.596212786437237E-3,15,1E+40,15,0.51924255728744739]
[20,6.600041203136279E+17,20,1.9471595898279278E-3,20,1624804176.3882415,20,0.38943191796558557,null,null,20,1E+40,20,1.9471595898279278E-3,20,3.6801594071598299E+30,20,0.38943191796558557]
[30,341495193053.17188,30,1.2981063932186185E-3,30,1296719.3810064562,30,0.2596212786437237,null,null,30,1E+40,30,1.2981063932186185E-3,30,1.5093676654919055E+24,30,0.2596212786437237]
[40,214563986.33980408,40,9.7357979491396389E-4,40,41323.653133316388,40,0.19471595898279279,null,null,40,1.2410613771271647E+30,40,9.7357979491396389E-4,40,7.8974258392251249E+20,40,0.19471595898279279]
[50,2773040.8991442723,50,7.7886383593117115E-4,50,5753.3479579561426,50,0.15577276718623423,null,null,50,1E+40,50,7.7886383593117115E-4,50,2.9901034574650208E+19,50,0.15577276718623423]
[60,161477.34072270733,60,6.4905319660930926E-4,60,1677.5708788636059,60,0.12981063932186185,null,null,60,3.5726253071407575E+23,60,6.4905319660930926E-4,60,1E+40,60,0.12981063932186185]
[70,22184.752037368442,70,5.563313113794079E-4,70,747.01270622368509,70,0.11126626227588159,null,null,70,1E+40,70,5.563313113794079E-4,70,5.814938492977904E+16,70,0.11126626227588159]
[80,5208.6221106507619,80,4.8678989745698194E-4,80,433.44986488207951,80,9.7357979491396393E-2,null,null,80,1.3396829529592173E+20,80,4.8678989745698194E-4,80,1E+40,80,9.7357979491396393E-2]
[90,1747.3220389639091,90,4.327021310728728E-4,90,299.90084473166411,90,8.6540426214574556E-2,null,null,90,1E+40,90,4.327021310728728E-4,90,304019849688588.94,90,8.6540426214574556E-2]
[100,752.19883667143461,100,3.8943191796558558E-4,100,234.51639534544586,100,7.7886383593117114E-2,null,null,100,8.5727786730136351E+18,100,3.8943191796558558E-4,100,8105644620943.6455,100,7.7886383593117114E-2]
[120,229.13435258554972,120,3.2452659830465463E-4,120,182.55769129158838,120,6.4905319660930924E-2,null,null,120,1E+40,120,3.2452659830465463E-4,120,32836221387.784622,120,6.4905319660930924E-2]
[140,106.53463648304907,140,2.7816565568970395E-4,140,173.85788192747535,140,5.5633131137940793E-2,null,null,140,7619624840348669,140,2.7816565568970395E-4,140,687795765.60334861,140,5.5633131137940793E-2]
[160,64.284798221062147,160,2.4339494872849097E-4,160,186.81250798012076,160,4.8678989745698197E-2,null,null,160,1E+40,160,2.4339494872849097E-4,160,40192579.370097019,160,4.8678989745698197E-2]
[180,46.008271018137158,180,2.163510655364364E-4,180,216.65420096611965,180,4.3270213107287278E-2,null,null,180,61919641479567.039,180,2.163510655364364E-4,180,4654453.6300103581,180,4.3270213107287278E-2]
[200,37.009590799060518,200,1.9471595898279279E-4,200,264.2357306566534,200,3.8943191796558557E-2,null,null,200,1661872919347.1543,200,1.9471595898279279E-4,200,869619.50039273,200,3.8943191796558557E-2]
[250,29.457685945871106,250,1.5577276718623423E-4,250,493.68405038477681,250,3.1154553437246844E-2,null,null,250,2091029262.8323212,250,1.5577276718623423E-4,250,49880.056185443646,250,3.1154553437246844E-2]
[]
[]
["Saved  19/07/2022: 15:54:47  Level Number: 5"]
[]
["BREAKTHROUGH RESULTS"]
[]
["Advanced"]
["Pollutant Linkage: Infill, Geo Barrier, Sst Unsaturated, Sst Saturated, Principal Aquifer",null,null,null,null,null,null,null,null,null,"Pollutant Linkage: Infill, Geo Barrier, Sst Unsaturated, Sst Saturated, Principal Aquifer at Site Boundary"]
["Concentrations in mg/L in Principal Aquifer",null,null,null,null,null,null,null,null,null,"Concentrations in mg/L in Principal Aquifer at Site Boundary"]
[]
["Compared with MRV target concentration in mg/L",null,null,null,null,null,null,null,null,null,"Compared with MRV target concentration in mg/L"]
[null,1.0000000000000001E-5,null,2.0000000000000001E-4,null,1E-3,null,4.9999999999999998E-8,null,null,null,1.0000000000000001E-5,null,2.0000000000000001E-4,null,1E-3,null,4.9999999999999998E-8]
[]
[null,"Species1",null,"Species2",null,"Species3",null,"Species4",null,null,null,"Species1",null,"Species2",null,"Species3",null,"Species4"]
["Time(years)","Hg","Time(years)","Pb","Time(years)","Benzene","Time(years)","BaP",null,null,"Time(years)","Hg","Time(years)","Pb","Time(years)","Benzene","Time(years)","BaP"]
[1,0,1,0,1,3.0859336025606626E-7,1,0,null,null,1,0,1,0,1,4.3980536490132649E-10,1,0]
[2,0,2,0,2,1.3283898367818323E-3,2,0,null,null,2,0,2,0,2,1.3480764500575673E-4,2,0]
[5,0,5,0,5,0.12774556978739277,5,0,null,null,5,0,5,0,5,7.1501154506838707E-2,5,0]
[10,0,10,0,10,0.27616599082252952,10,0,null,null,10,0,10,0,10,0.1989363371277599,10,0]
[15,0,15,0,15,0.21556167978560326,15,0,null,null,15,0,15,0,15,0.16082452386558832,15,0]
[20,0,20,0,20,0.14140295060303981,20,0,null,null,20,0,20,0,20,0.10626716297078298,20,0]
[30,0,30,0,30,5.592952071480585E-2,30,0,null,null,30,0,30,0,30,4.2117706796612843E-2,30,0]
[40,0,40,0,40,2.1831221864231757E-2,40,0,null,null,40,0,40,0,40,1.644184182371617E-2,40,0]
[50,9.8106934518258038E-34,50,1.5161846028887559E-23,50,8.5151432059128018E-3,50,0,null,null,50,0,50,0,50,6.4130882567865529E-3,50,0]
[60,0,60,1.2935064694182259E-22,60,3.3211371898326943E-3,60,0,null,null,60,0,60,9.6117449976819188E-32,60,2.5012796296671001E-3,60,0]
[70,7.0932375507512127E-29,70,0,70,1.2953303166194584E-3,70,0,null,null,70,0,70,3.7279116723156092E-29,70,9.7556445669537992E-4,70,0]
[80,0,80,2.5014088643407461E-20,80,5.0521266590901565E-4,80,0,null,null,80,0,80,0,80,3.8049563242281839E-4,80,0]
[90,2.8250754818579891E-26,90,8.9903319061390125E-21,90,1.9704619361440859E-4,90,0,null,null,90,0,90,2.2540327293302733E-25,90,1.4840329461783642E-4,90,0]
[100,4.3092819460194996E-27,100,8.6011736429606958E-19,100,7.6853220084529015E-5,100,0,null,null,100,0,100,0,100,5.7881229637923481E-5,100,0]
[120,1.2681306885629785E-23,120,1.0238345261148432E-15,120,1.1690942600458185E-5,120,0,null,null,120,2.1412093241987813E-33,120,3.7145340201885147E-22,120,8.8049677919120725E-6,120,0]
[140,0,140,1.1543183277579133E-13,140,1.7783023681946625E-6,140,0,null,null,140,3.6712675582274872E-31,140,0,140,1.3393821674054629E-6,140,0]
[160,8.6892581326833576E-22,160,3.8909072287199395E-12,160,2.702503768793821E-7,160,0,null,null,160,0,160,6.2090080965834005E-20,160,2.0361759717301205E-7,160,0]
[180,0,180,5.8611212215265101E-11,180,4.0716673765953622E-8,180,0,null,null,180,3.6036132197777955E-27,180,0,180,3.0749428354435547E-8,180,0]
[200,5.5990772105301151E-20,200,5.0248411820019256E-10,200,5.6883346487424408E-9,200,0,null,null,200,0,200,2.3531585014800777E-18,200,4.3674714181208365E-9,200,0]
[250,1.1675451214880728E-16,250,2.2362488090216611E-8,250,0,250,0,null,null,250,0,250,5.4894913131389397E-17,250,0,250,0]
[]
[]
["Pollutant Linkage: Infill, Geo Barrier, Sst Unsaturated, Sst Saturated, Principal Aquifer",null,null,null,null,null,null,null,null,null,"Pollutant Linkage: Infill, Geo Barrier, Sst Unsaturated, Sst Saturated, Principal Aquifer at Site Boundary"]
["Remedial Target Concentrations in mg/L in Infill",null,null,null,null,null,null,null,null,null,"Remedial Target Concentrations in mg/L in Infill"]
[]
[null,"Species1",null,"Species2",null,"Species3",null,"Species4",null,null,null,"Species1",null,"Species2",null,"Species3",null,"Species4"]
["Time(years)","Hg","Time(years)","Pb","Time(years)","Benzene","Time(years)","BaP",null,null,"Time(years)","Hg","Time(years)","Pb","Time(years)","Benzene","Time(years)","BaP"]
[1,1E+40,1,1E+40,1,19443.062530643198,1,1E+40,null,null,1,1E+40,1,1E+40,1,13642398.385354266,1,1E+40]
[2,1E+40,2,1E+40,2,4.516746390152794,2,1E+40,null,null,2,1E+40,2,1E+40,2,44.507861551500142,2,1E+40]
[5,1E+40,5,1E+40,5,4.6968360703121159E-2,5,1E+40,null,null,5,1E+40,5,1E+40,5,8.3914728949252587E-2,5,1E+40]
[10,1E+40,10,1E+40,10,2.1726064031742907E-2,10,1E+40,null,null,10,1E+40,10,1E+40,10,3.0160402501764723E-2,10,1E+40]
[15,1E+40,15,1E+40,15,2.7834260736730086E-2,15,1E+40,null,null,15,1E+40,15,1E+40,15,3.7307742972176289E-2,15,1E+40]
[20,1E+40,20,1E+40,20,4.2431929280201418E-2,20,1E+40,null,null,20,1E+40,20,1E+40,20,5.6461467797438387E-2,20,1E+40]
[30,1E+40,30,1E+40,30,0.10727787263894181,30,1E+40,null,null,30,1E+40,30,1E+40,30,0.14245789850273918,30,1E+40]
[40,1E+40,40,1E+40,40,0.27483573925976135,40,1E+40,null,null,40,1E+40,40,1E+40,40,0.3649226202471692,40,1E+40]
[50,1.0192959395891599E+26,50,6.5955029360852255E+18,50,0.7046270221073534,50,1E+40,null,null,50,1E+40,50,1E+40,50,0.93558668768523368,50,1E+40]
[60,1E+40,60,7.7309238387479053E+17,60,1.8066101028191059,60,1E+40,null,null,60,1E+40,60,1.0403938101158237E+27,60,2.3987721839795064,60,1E+40]
[70,1.4097934727902839E+21,70,1E+40,70,4.6320231395948079,70,1E+40,null,null,70,1E+40,70,2.6824669892965718E+24,70,6.1502855693660239,70,1E+40]
[80,1E+40,80,3997747086674505.5,80,11.876186811754533,80,1E+40,null,null,80,1E+40,80,1E+40,80,15.768906365087041,80,1E+40]
[90,3.5397284299898506E+18,90,1.1123059865199794E+16,90,30.449712780248614,90,1E+40,null,null,90,1E+40,90,4.4364928112517861E+20,90,40.430369254611328,90,1E+40]
[100,2.3205722264789471E+19,100,116263203315097.83,100,78.070899220627894,100,1E+40,null,null,100,1E+40,100,1E+40,100,103.66054829057798,100,1E+40]
[120,7885622586211371,120,97672033369.95401,120,513.21781357175178,120,1E+40,null,null,120,4.6702580112021034E+25,120,2.6921277192912867E+17,120,681.43349774787191,120,1E+40]
[140,1E+40,140,866312156.66682434,140,3374.0043916666527,140,1E+40,null,null,140,2.7238548652193764E+23,140,1E+40,140,4479.6773811187059,140,1E+40]
[160,115084623420110.88,160,25700946.879912831,160,22201.634163411047,160,1E+40,null,null,160,1E+40,160,1610563208236537.8,160,29467.00129705319,160,1E+40]
[180,1E+40,180,1706158.1943182421,180,147359.77782686823,180,1E+40,null,null,180,2.7749925949646217E+19,180,1E+40,180,195125.57862346445,180,1E+40]
[200,1786008591057.313,200,199011.26498919399,200,1054790.262968523,200,1E+40,null,null,200,1E+40,200,42496074929547.891,200,1373792.6194790259,200,1E+40]
[250,856497947.35596061,250,4471.7743212012756,250,1E+40,250,1E+40,null,null,250,1E+40,250,1821662414523.7808,250,1E+40,250,1E+40]
[]
["Compared with source concentrations in mg/L",null,null,null,null,null,null,null,null,null,"Compared with source concentrations in mg/L"]
[null,0.01,null,0.5,null,6,null,100,null,null,null,0.01,null,0.5,null,6,null,100]
[]
[]
["Pollutant Linkage: Infill, Geo Barrier, Sst Unsaturated, Sst Saturated, Principal Aquifer",null,null,null,null,null,null,null,null,null,"Pollutant Linkage: Infill, Geo Barrier, Sst Unsaturated, Sst Saturated, Principal Aquifer at Site Boundary"]
["Dilution Factor",null,null,null,null,null,null,null,null,null,"Dilution Factor"]
[]
[null,12.83921468512464,"for all species and timeslices",null,null,null,null,null,null,null,null,12.83921468512464,"for all species and timeslices"]
[]
[]
["Pollutant Linkage: Infill, Geo Barrier, Sst Unsaturated, Sst Saturated, Principal Aquifer",null,null,null,null,null,null,null,null,null,"Pollutant Linkage: Infill, Geo Barrier, Sst Unsaturated, Sst Saturated, Principal Aquifer at Site Boundary"]
["Attenuation Factor",null,null,null,null,null,null,null,null,null,"Attenuation Factor"]
[]
[null,"Species1",null,"Species2",null,"Species3",null,"Species4",null,null,null,"Species1",null,"Species2",null,"Species3",null,"Species4"]
["Time(years)","Hg","Time(years)","Pb","Time(years)","Benzene","Time(years)","BaP",null,null,"Time(years)","Hg","Time(years)","Pb","Time(years)","Benzene","Time(years)","BaP"]
[1,1E+40,1,3.8943191796558557E-2,1,1E+40,1,7.7886383593117108,null,null,1,1E+40,1,3.8943191796558557E-2,1,1E+40,1,7.7886383593117108]
[2,1E+40,2,1.9471595898279279E-2,2,1E+40,2,3.8943191796558554,null,null,2,1E+40,2,1.9471595898279279E-2,2,1E+40,2,3.8943191796558554]
[5,1E+40,5,7.7886383593117111E-3,5,1E+40,5,1.5577276718623423,null,null,5,1E+40,5,7.7886383593117111E-3,5,1E+40,5,1.5577276718623423]
[10,1E+40,10,3.8943191796558555E-3,10,1E+40,10,0.77886383593117114,null,null,10,1E+40,10,3.8943191796558555E-3,10,1E+40,10,0.77886383593117114]
[15,1E+40,15,2.596212786437237E-3,15,1E+40,15,0.51924255728744739,null,null,15,1E+40,15,2.596212786437237E-3,15,1E+40,15,0.51924255728744739]
[20,1E+40,20,1.9471595898279278E-3,20,1E+40,20,0.38943191796558557,null,null,20,1E+40,20,1.9471595898279278E-3,20,1E+40,20,0.38943191796558557]
[30,1E+40,30,1.2981063932186185E-3,30,1E+40,30,0.2596212786437237,null,null,30,1E+40,30,1.2981063932186185E-3,30,1E+40,30,0.2596212786437237]
[40,1E+40,40,9.7357979491396389E-4,40,1E+40,40,0.19471595898279279,null,null,40,1E+40,40,9.7357979491396389E-4,40,1E+40,40,0.19471595898279279]
[50,7.938927454574803E+29,50,7.7886383593117115E-4,50,3.0821992300167838E+22,50,0.15577276718623423,null,null,50,1E+40,50,7.7886383593117115E-4,50,1E+40,50,0.15577276718623423]
[60,1E+40,60,6.4905319660930926E-4,60,3.6128021978033564E+21,60,0.12981063932186185,null,null,60,1E+40,60,6.4905319660930926E-4,60,4.8619506829551407E+30,60,0.12981063932186185]
[70,1.0980371520881676E+25,70,5.563313113794079E-4,70,1E+40,70,0.11126626227588159,null,null,70,1E+40,70,5.563313113794079E-4,70,1.2535659174253605E+28,70,0.11126626227588159]
[80,1E+40,80,4.8678989745698194E-4,80,1.8682203786059813E+19,80,9.7357979491396393E-2,null,null,80,1E+40,80,4.8678989745698194E-4,80,1E+40,80,9.7357979491396393E-2]
[90,2.7569664631365167E+22,90,4.327021310728728E-4,90,5.1980094443409392E+19,90,8.6540426214574556E-2,null,null,90,1E+40,90,4.327021310728728E-4,90,2.0732542854315784E+24,90,8.6540426214574556E-2]
[100,1.8074097858707311E+23,100,3.8943191796558558E-4,100,5.4331922706985645E+17,100,7.7886383593117114E-2,null,null,100,1E+40,100,3.8943191796558558E-4,100,1E+40,100,7.7886383593117114E-2]
[120,6.1418262562020696E+19,120,3.2452659830465463E-4,120,456439287442318.31,120,6.4905319660930924E-2,null,null,120,3.6374950693931524E+29,120,3.2452659830465463E-4,120,1.2580805533583079E+21,120,6.4905319660930924E-2]
[140,1E+40,140,2.7816565568970395E-4,140,4048435256731.9707,140,5.5633131137940793E-2,null,null,140,2.1215120488445462E+27,140,2.7816565568970395E-4,140,1E+40,140,5.5633131137940793E-2]
[160,8.9635251253681843E+17,160,2.4339494872849097E-4,160,120105228443.71301,160,4.8678989745698197E-2,null,null,160,1E+40,160,2.4339494872849097E-4,160,7.5264566302603397E+18,160,4.8678989745698197E-2]
[180,1E+40,180,2.163510655364364E-4,180,7973189495.592638,180,4.3270213107287278E-2,null,null,180,2.1613413771947397E+23,180,2.163510655364364E-4,180,1E+40,180,4.3270213107287278E-2]
[200,1.3910575022369248E+16,200,1.9471595898279279E-4,200,930016063.45799041,200,3.8943191796558557E-2,null,null,200,1E+40,200,1.9471595898279279E-4,200,1.9859193558987683E+17,200,3.8943191796558557E-2]
[250,6670952767448.377,250,1.5577276718623423E-4,250,20897419.807376005,250,3.1154553437246844E-2,null,null,250,1E+40,250,1.5577276718623423E-4,250,8512961855685785,250,3.1154553437246844E-2]
[]
[]
["Saved  19/07/2022: 15:56:42  Level Number: 5"]
[]
["BREAKTHROUGH RESULTS"]
[]
["Advanced"]
["Pollutant Linkage: Infill, Geo Barrier, Sst Unsaturated, Sst Saturated, Principal Aquifer",null,null,null,null,null,null,null,null,null,"Pollutant Linkage: Infill, Geo Barrier, Sst Unsaturated, Sst Saturated, Principal Aquifer at Site Boundary"]
["Concentrations in mg/L in Principal Aquifer",null,null,null,null,null,null,null,null,null,"Concentrations in mg/L in Principal Aquifer at Site Boundary"]
[]
["Compared with MRV target concentration in mg/L",null,null,null,null,null,null,null,null,null,"Compared with MRV target concentration in mg/L"]
[null,1.0000000000000001E-5,null,2.0000000000000001E-4,null,1E-3,null,4.9999999999999998E-8,null,null,null,1.0000000000000001E-5,null,2.0000000000000001E-4,null,1E-3,null,4.9999999999999998E-8]
[]
[null,"Species1",null,"Species2",null,"Species3",null,"Species4",null,null,null,"Species1",null,"Species2",null,"Species3",null,"Species4"]
["Time(years)","Hg","Time(years)","Pb","Time(years)","Benzene","Time(years)","BaP",null,null,"Time(years)","Hg","Time(years)","Pb","Time(years)","Benzene","Time(years)","BaP"]
[1,0,1,0,1,9.4809106237444857E-10,1,0,null,null,1,0,1,0,1,3.6200580851914877E-13,1,0]
[2,0,2,0,2,7.8450282194893954E-5,2,0,null,null,2,0,2,0,2,4.5894516144228963E-6,2,0]
[5,0,5,0,5,5.0517672068777421E-2,5,0,null,null,5,0,5,0,5,2.4816719609300989E-2,5,0]
[10,0,10,0,10,0.23054038903445989,10,0,null,null,10,0,10,0,10,0.15981438346706681,10,0]
[15,0,15,0,15,0.23369887002372441,15,0,null,null,15,0,15,0,15,0.17166088886746339,15,0]
[20,0,20,0,20,0.17072011864718664,20,0,null,null,20,0,20,0,20,0.12747256934541118,20,0]
[30,0,30,4.9610699822486082E-35,30,7.1827865372829133E-2,30,0,null,null,30,0,30,0,30,5.4033897895981862E-2,30,0]
[40,0,40,0,40,2.8308263342562621E-2,40,0,null,null,40,0,40,0,40,2.1316576985351374E-2,40,0]
[50,6.2857842301889559E-40,50,1.271000153623861E-26,50,1.1057494626791115E-2,50,0,null,null,50,0,50,6.8203114015527617E-39,50,8.3276366268301739E-3,50,0]
[60,1.349694205446234E-36,60,0,60,4.3136643411183402E-3,60,0,null,null,60,0,60,0,60,3.2487794541564479E-3,60,0]
[70,2.5347786039572372E-33,70,0,70,1.6824977161567507E-3,70,0,null,null,70,0,70,8.6593306093825102E-33,70,1.2671548317173705E-3,70,0]
[80,0,80,4.028952382518973E-23,80,6.5622137809297047E-4,80,0,null,null,80,0,80,6.5941596486394009E-30,80,4.9422620463835786E-4,80,0]
[90,0,90,1.0138066568553575E-21,90,2.5594372596416607E-4,90,0,null,null,90,0,90,0,90,1.927613245076885E-4,90,0]
[100,2.0929498774866515E-28,100,0,100,9.9824835124351846E-5,100,0,null,null,100,1.1555985526173147E-40,100,0,100,7.5182025220158359E-5,100,0]
[120,6.1317745882212732E-27,120,8.7107407413562271E-21,120,1.5185518373741966E-5,120,0,null,null,120,0,120,0,120,1.1436827606988104E-5,120,0]
[140,0,140,5.7739988358683905E-18,140,2.3101029675922509E-6,140,0,null,null,140,1.2465473867640187E-34,140,1.0908992222751939E-22,140,1.7398599973141128E-6,140,0]
[160,6.3608427030025508E-24,160,6.7092896430009315E-16,160,3.5140601158039331E-7,160,0,null,null,160,8.4860191988928337E-32,160,0,160,2.6470182907105865E-7,160,0]
[180,0,180,2.7296402897481466E-14,180,5.3349062533304765E-8,180,0,null,null,180,0,180,1.5413171548018265E-20,180,4.023271162247565E-8,180,0]
[200,0,200,5.2014971521408934E-13,200,7.9067051045943063E-9,200,0,null,null,200,0,200,0,200,6.0142421191440741E-9,200,0]
[250,0,250,9.8420504866322064E-11,250,0,250,0,null,null,250,0,250,2.1149318236993271E-18,250,0,250,0]
[]
[]
["Pollutant Linkage: Infill, Geo Barrier, Sst Unsaturated, Sst Saturated, Principal Aquifer",null,null,null,null,null,null,null,null,null,"Pollutant Linkage: Infill, Geo Barrier, Sst Unsaturated, Sst Saturated, Principal Aquifer at Site Boundary"]
["Remedial Target Concentrations in mg/L in Infill",null,null,null,null,null,null,null,null,null,"Remedial Target Concentrations in mg/L in Infill"]
[]
[null,"Species1",null,"Species2",null,"Species3",null,"Species4",null,null,null,"Species1",null,"Species2",null,"Species3",null,"Species4"]
["Time(years)","Hg","Time(years)","Pb","Time(years)","Benzene","Time(years)","BaP",null,null,"Time(years)","Hg","Time(years)","Pb","Time(years)","Benzene","Time(years)","BaP"]
[1,1E+40,1,1E+40,1,6328506.0244880784,1,1E+40,null,null,1,1E+40,1,1E+40,1,16574319689.90802,1,1E+40]
[2,1E+40,2,1E+40,2,76.481560449893678,2,1E+40,null,null,2,1E+40,2,1E+40,2,1307.3457362845461,2,1E+40]
[5,1E+40,5,1E+40,5,0.11877031847055984,5,1E+40,null,null,5,1E+40,5,1E+40,5,0.24177248622945624,5,1E+40]
[10,1E+40,10,1E+40,10,2.6025808428314718E-2,10,1E+40,null,null,10,1E+40,10,1E+40,10,3.7543554402513647E-2,10,1E+40]
[15,1E+40,15,1E+40,15,2.567406508808065E-2,15,1E+40,null,null,15,1E+40,15,1E+40,15,3.4952632714330772E-2,15,1E+40]
[20,1E+40,20,1E+40,20,3.514524267874785E-2,20,1E+40,null,null,20,1E+40,20,1E+40,20,4.7068950055771282E-2,20,1E+40]
[30,1E+40,30,2.0156942022147195E+30,30,8.3533040677965978E-2,30,1E+40,null,null,30,1E+40,30,1E+40,30,0.11104140611048124,30,1E+40]
[40,1E+40,40,1E+40,40,0.21195224614781497,40,1E+40,null,null,40,1E+40,40,1E+40,40,0.28147108253464731,40,1E+40]
[50,1.5908913882173446E+32,50,7.8678196627184634E+21,50,0.54261839616567831,50,1E+40,null,null,50,1E+40,50,1.466208712658388E+34,50,0.72049253213919784,50,1E+40]
[60,7.4090856726274636E+28,60,1E+40,60,1.3909288079759281,60,1E+40,null,null,60,1E+40,60,1E+40,60,1.8468474344491668,60,1E+40]
[70,3.9451177252278496E+25,70,1E+40,70,3.5661266831942657,70,1E+40,null,null,70,1E+40,70,1.1548236753040537E+28,70,4.7350172605728229,70,1E+40]
[80,1E+40,80,2.4820347947988956E+18,80,9.1432559198794454,80,1E+40,null,null,80,1E+40,80,1.5164934628271154E+25,80,12.140189944785313,80,1E+40]
[90,1E+40,90,9.8638137088369184E+16,90,23.442653174628092,90,1E+40,null,null,90,1E+40,90,1E+40,90,31.126575911033875,90,1E+40]
[100,4.7779452855357637E+20,100,1E+40,100,60.105283344828941,100,1E+40,null,null,100,8.6535241649022541E+32,100,1E+40,100,79.806309851722858,100,1E+40]
[120,1.630849251896723E+19,120,1.148007993456024E+16,120,395.11328176816789,120,1E+40,null,null,120,1E+40,120,1E+40,120,524.62100559545854,120,1E+40]
[140,1E+40,140,17319019771669.27,140,2597.2868240819653,140,1E+40,null,null,140,8.022157926911671E+26,140,9.166749591354432E+17,140,3448.553337200939,140,1E+40]
[160,1.572118737550236E+16,160,149047075504.2139,160,17074.266808971035,160,1E+40,null,null,160,1.1784088352409921E+24,160,1E+40,160,22667.013753007777,160,1E+40]
[180,1E+40,180,3663486371.2839842,180,112466.83100109432,180,1E+40,null,null,180,1E+40,180,6487957373890218,180,149132.37905267495,180,1E+40]
[200,1E+40,200,192252340.19178656,200,758849.5992488215,200,1E+40,null,null,200,1E+40,200,1E+40,200,997631.93452110293,200,1E+40]
[250,1E+40,250,1016048.4355960505,250,1E+40,250,1E+40,null,null,250,1E+40,250,47282848023481.57,250,1E+40,250,1E+40]
[]
["Compared with source concentrations in mg/L",null,null,null,null,null,null,null,null,null,"Compared with source concentrations in mg/L"]
[null,0.01,null,0.5,null,6,null,100,null,null,null,0.01,null,0.5,null,6,null,100]
[]
[]
["Pollutant Linkage: Infill, Geo Barrier, Sst Unsaturated, Sst Saturated, Principal Aquifer",null,null,null,null,null,null,null,null,null,"Pollutant Linkage: Infill, Geo Barrier, Sst Unsaturated, Sst Saturated, Principal Aquifer at Site Boundary"]
["Dilution Factor",null,null,null,null,null,null,null,null,null,"Dilution Factor"]
[]
[null,12.83921468512464,"for all species and timeslices",null,null,null,null,null,null,null,null,12.83921468512464,"for all species and timeslices"]
[]
[]
["Pollutant Linkage: Infill, Geo Barrier, Sst Unsaturated, Sst Saturated, Principal Aquifer",null,null,null,null,null,null,null,null,null,"Pollutant Linkage: Infill, Geo Barrier, Sst Unsaturated, Sst Saturated, Principal Aquifer at Site Boundary"]
["Attenuation Factor",null,null,null,null,null,null,null,null,null,"Attenuation Factor"]
[]
[null,"Species1",null,"Species2",null,"Species3",null,"Species4",null,null,null,"Species1",null,"Species2",null,"Species3",null,"Species4"]
["Time(years)","Hg","Time(years)","Pb","Time(years)","Benzene","Time(years)","BaP",null,null,"Time(years)","Hg","Time(years)","Pb","Time(years)","Benzene","Time(years)","BaP"]
[1,1E+40,1,3.8943191796558557E-2,1,1E+40,1,7.7886383593117108,null,null,1,1E+40,1,3.8943191796558557E-2,1,1E+40,1,7.7886383593117108]
[2,1E+40,2,1.9471595898279279E-2,2,1E+40,2,3.8943191796558554,null,null,2,1E+40,2,1.9471595898279279E-2,2,1E+40,2,3.8943191796558554]
[5,1E+40,5,7.7886383593117111E-3,5,1E+40,5,1.5577276718623423,null,null,5,1E+40,5,7.7886383593117111E-3,5,1E+40,5,1.5577276718623423]
[10,1E+40,10,3.8943191796558555E-3,10,1E+40,10,0.77886383593117114,null,null,10,1E+40,10,3.8943191796558555E-3,10,1E+40,10,0.77886383593117114]
[15,1E+40,15,2.596212786437237E-3,15,1E+40,15,0.51924255728744739,null,null,15,1E+40,15,2.596212786437237E-3,15,1E+40,15,0.51924255728744739]
[20,1E+40,20,1.9471595898279278E-3,20,1E+40,20,0.38943191796558557,null,null,20,1E+40,20,1.9471595898279278E-3,20,1E+40,20,0.38943191796558557]
[30,1E+40,30,1.2981063932186185E-3,30,9.4197079104070685E+33,30,0.2596212786437237,null,null,30,1E+40,30,1.2981063932186185E-3,30,1E+40,30,0.2596212786437237]
[40,1E+40,40,9.7357979491396389E-4,40,1E+40,40,0.19471595898279279,null,null,40,1E+40,40,9.7357979491396389E-4,40,1E+40,40,0.19471595898279279]
[50,1.2390877691768267E+36,50,7.7886383593117115E-4,50,3.6767761217517565E+25,50,0.15577276718623423,null,null,50,1E+40,50,7.7886383593117115E-4,50,6.8518616533008968E+37,50,0.15577276718623423]
[60,5.7706688877253064E+32,60,6.4905319660930926E-4,60,1E+40,60,0.12981063932186185,null,null,60,1E+40,60,6.4905319660930926E-4,60,1E+40,60,0.12981063932186185]
[70,3.0727095246710188E+29,70,5.563313113794079E-4,70,1E+40,70,0.11126626227588159,null,null,70,1E+40,70,5.563313113794079E-4,70,5.3967023854286904E+31,70,0.11126626227588159]
[80,1E+40,80,4.8678989745698194E-4,80,1.1599002847150229E+22,80,9.7357979491396393E-2,null,null,80,1E+40,80,4.8678989745698194E-4,80,7.0868514937324324E+28,80,9.7357979491396393E-2]
[90,1E+40,90,4.327021310728728E-4,90,4.6095406693051164E+20,90,8.6540426214574556E-2,null,null,90,1E+40,90,4.327021310728728E-4,90,1E+40,90,8.6540426214574556E-2]
[100,3.7213687929616393E+24,100,3.8943191796558558E-4,100,1E+40,100,7.7886383593117114E-2,null,null,100,6.7399170253988524E+36,100,3.8943191796558558E-4,100,1E+40,100,7.7886383593117114E-2]
[120,1.2702095041577624E+23,120,3.2452659830465463E-4,120,5.3648514567768334E+19,120,6.4905319660930924E-2,null,null,120,1E+40,120,3.2452659830465463E-4,120,1E+40,120,6.4905319660930924E-2]
[140,1E+40,140,2.7816565568970395E-4,140,8.0934949043580736E+16,140,5.5633131137940793E-2,null,null,140,6.2481686954000753E+30,140,2.7816565568970395E-4,140,4.2837898498456845E+21,140,5.5633131137940793E-2]
[160,1.2244664304676468E+20,160,2.4339494872849097E-4,160,696524261769209.5,160,4.8678989745698197E-2,null,null,160,9.1782002571098244E+27,160,2.4339494872849097E-4,160,1E+40,160,4.8678989745698197E-2]
[180,1E+40,180,2.163510655364364E-4,180,17120142288118.861,180,4.3270213107287278E-2,null,null,180,1E+40,180,2.163510655364364E-4,180,3.031941220551637E+19,180,4.3270213107287278E-2]
[200,1E+40,200,1.9471595898279279E-4,200,898430370891.11597,200,3.8943191796558557E-2,null,null,200,1E+40,200,1.9471595898279279E-4,200,1E+40,200,3.8943191796558557E-2]
[250,1E+40,250,1.5577276718623423E-4,250,4748180292.2412319,250,3.1154553437246844E-2,null,null,250,1E+40,250,1.5577276718623423E-4,250,2.2096140231191667E+17,250,3.1154553437246844E-2]
[]
[]
["Saved  19/07/2022: 15:58:44  Level Number: 5"]
[]
["BREAKTHROUGH RESULTS"]
[]
["Advanced"]
["Pollutant Linkage: Infill, Geo Barrier, Sst Unsaturated, Sst Saturated, Principal Aquifer",null,null,null,null,null,null,null,null,null,"Pollutant Linkage: Infill, Geo Barrier, Sst Unsaturated, Sst Saturated, Principal Aquifer at Site Boundary"]
["Concentrations in mg/L in Principal Aquifer",null,null,null,null,null,null,null,null,null,"Concentrations in mg/L in Principal Aquifer at Site Boundary"]
[]
["Compared with MRV target concentration in mg/L",null,null,null,null,null,null,null,null,null,"Compared with MRV target concentration in mg/L"]
[null,1.0000000000000001E-5,null,2.0000000000000001E-4,null,1E-3,null,4.9999999999999998E-8,null,null,null,1.0000000000000001E-5,null,2.0000000000000001E-4,null,1E-3,null,4.9999999999999998E-8]
[]
[null,"Species1",null,"Species2",null,"Species3",null,"Species4",null,null,null,"Species1",null,"Species2",null,"Species3",null,"Species4"]
["Time(years)","Hg","Time(years)","Pb","Time(years)","Benzene","Time(years)","BaP",null,null,"Time(years)","Hg","Time(years)","Pb","Time(years)","Benzene","Time(years)","BaP"]
[1,0,1,0,1,1.4955724365821958E-34,1,0,null,null,1,0,1,0,1,5.9877306286564844E-36,1,0]
[2,0,2,0,2,0,2,0,null,null,2,0,2,0,2,7.6451380550541403E-25,2,0]
[5,0,5,0,5,2.9329252218208671E-16,5,0,null,null,5,0,5,0,5,4.279969506316453E-18,5,0]
[10,0,10,0,10,2.9554648564069772E-8,10,0,null,null,10,0,10,0,10,9.3986047492911551E-9,10,0]
[15,0,15,0,15,1.3465467357941251E-5,15,0,null,null,15,0,15,0,15,6.7058112413717414E-6,15,0]
[20,0,20,0,20,2.7450717003010442E-4,20,0,null,null,20,0,20,0,20,1.6121103958930847E-4,20,0]
[30,0,30,0,30,4.9167308439132234E-3,30,0,null,null,30,0,30,0,30,3.2593774447513468E-3,30,0]
[40,0,40,0,40,1.7846129379770662E-2,40,0,null,null,40,0,40,0,40,1.2356029848266585E-2,40,0]
[50,0,50,0,50,3.3827131186659795E-2,50,0,null,null,50,0,50,0,50,2.390362372923609E-2,50,0]
[60,0,60,0,60,4.6183719028063605E-2,60,0,null,null,60,0,60,0,60,3.3000868345415775E-2,60,0]
[70,0,70,0,70,5.2272073029923025E-2,70,0,null,null,70,0,70,0,70,3.7601528057180207E-2,70,0]
[80,0,80,0,80,5.2688685181109189E-2,80,0,null,null,80,0,80,0,80,3.8062859557261762E-2,80,0]
[90,0,90,0,90,4.9247587399395859E-2,90,0,null,null,90,0,90,0,90,3.5677844057555086E-2,90,0]
[100,0,100,0,100,4.3743009082742729E-2,100,0,null,null,100,0,100,0,100,3.1751597723762799E-2,100,0]
[120,0,120,0,120,3.1359810021538419E-2,120,0,null,null,120,0,120,0,120,2.2816216359779842E-2,120,0]
[140,0,140,0,140,2.0879053788577847E-2,140,0,null,null,140,0,140,0,140,1.5209263507792519E-2,140,0]
[160,0,160,0,160,1.3366926017979707E-2,160,0,null,null,160,0,160,0,160,9.7434575456343334E-3,160,0]
[180,0,180,0,180,8.3772110434329645E-3,180,0,null,null,180,0,180,0,180,6.108528002919323E-3,180,0]
[200,0,200,0,200,5.1893140998682027E-3,200,0,null,null,200,0,200,0,200,3.7847006976060552E-3,200,0]
[250,0,250,3.0418221245650888E-33,250,1.5351727495017343E-3,250,0,null,null,250,0,250,0,250,1.1198158854062283E-3,250,0]
[]
[]
["Pollutant Linkage: Infill, Geo Barrier, Sst Unsaturated, Sst Saturated, Principal Aquifer",null,null,null,null,null,null,null,null,null,"Pollutant Linkage: Infill, Geo Barrier, Sst Unsaturated, Sst Saturated, Principal Aquifer at Site Boundary"]
["Remedial Target Concentrations in mg/L in Infill",null,null,null,null,null,null,null,null,null,"Remedial Target Concentrations in mg/L in Infill"]
[]
[null,"Species1",null,"Species2",null,"Species3",null,"Species4",null,null,null,"Species1",null,"Species2",null,"Species3",null,"Species4"]
["Time(years)","Hg","Time(years)","Pb","Time(years)","Benzene","Time(years)","BaP",null,null,"Time(years)","Hg","Time(years)","Pb","Time(years)","Benzene","Time(years)","BaP"]
[1,1E+40,1,1E+40,1,4.0118417892962039E+31,1,1E+40,null,null,1,1E+40,1,1E+40,1,1.0020490853888444E+33,1,1E+40]
[2,1E+40,2,1E+40,2,1E+40,2,1E+40,null,null,2,1E+40,2,1E+40,2,7.8481251179413918E+21,2,1E+40]
[5,1E+40,5,1E+40,5,20457391669450.684,5,1E+40,null,null,5,1E+40,5,1E+40,5,1401879146836232.5,5,1E+40]
[10,1E+40,10,1E+40,10,203013.74881832735,10,1E+40,null,null,10,1E+40,10,1E+40,10,638392.62954988307,10,1E+40]
[15,1E+40,15,1E+40,15,445.58423710867368,15,1E+40,null,null,15,1E+40,15,1E+40,15,894.74633031463611,15,1E+40]
[20,1E+40,20,1E+40,20,21.857352576043812,20,1E+40,null,null,20,1E+40,20,1E+40,20,37.218294822024831,20,1E+40]
[30,1E+40,30,1E+40,30,1.220323054174876,30,1E+40,null,null,30,1E+40,30,1E+40,30,1.8408423392822895,30,1E+40]
[40,1E+40,40,1E+40,40,0.33620735747894176,40,1E+40,null,null,40,1E+40,40,1E+40,40,0.48559287033785647,40,1E+40]
[50,1E+40,50,1E+40,50,0.17737241644559515,50,1E+40,null,null,50,1E+40,50,1E+40,50,0.25100796715861573,50,1E+40]
[60,1E+40,60,1E+40,60,0.1299159124962217,60,1E+40,null,null,60,1E+40,60,1E+40,60,0.18181339767180621,60,1E+40]
[70,1E+40,70,1E+40,70,0.11478404532694378,70,1E+40,null,null,70,1E+40,70,1E+40,70,0.15956798327120827,70,1E+40]
[80,1E+40,80,1E+40,80,0.11387644196046894,80,1E+40,null,null,80,1E+40,80,1E+40,80,0.15763397889151237,80,1E+40]
[90,1E+40,90,1E+40,90,0.1218333793966444,90,1E+40,null,null,90,1E+40,90,1E+40,90,0.16817159664470951,90,1E+40]
[100,1E+40,100,1E+40,100,0.13716477503069377,100,1E+40,null,null,100,1E+40,100,1E+40,100,0.18896686876042204,100,1E+40]
[120,1E+40,120,1E+40,120,0.19132768967283617,120,1E+40,null,null,120,1E+40,120,1E+40,120,0.26297085833112671,120,1E+40]
[140,1E+40,140,1E+40,140,0.28736934445192036,140,1E+40,null,null,140,1E+40,140,1E+40,140,0.39449641969355581,140,1E+40]
[160,1E+40,160,1E+40,160,0.4488690961504137,160,1E+40,null,null,160,1E+40,160,1E+40,160,0.6157978286351099,160,1E+40]
[180,1E+40,180,1E+40,180,0.71622882232428653,180,1E+40,null,null,180,1E+40,180,1E+40,180,0.98223336246188009,180,1E+40]
[200,1E+40,200,1E+40,200,1.1562221681960603,200,1E+40,null,null,200,1E+40,200,1E+40,200,1.5853301170671681,200,1E+40]
[250,1E+40,250,3.2875032104087194E+28,250,3.908354940476503,250,1E+40,null,null,250,1E+40,250,1E+40,250,5.3580236520965405,250,1E+40]
[]
["Compared with source concentrations in mg/L",null,null,null,null,null,null,null,null,null,"Compared with source concentrations in mg/L"]
[null,0.01,null,0.5,null,6,null,100,null,null,null,0.01,null,0.5,null,6,null,100]
[]
[]
["Pollutant Linkage: Infill, Geo Barrier, Sst Unsaturated, Sst Saturated, Principal Aquifer",null,null,null,null,null,null,null,null,null,"Pollutant Linkage: Infill, Geo Barrier, Sst Unsaturated, Sst Saturated, Principal Aquifer at Site Boundary"]
["Dilution Factor",null,null,null,null,null,null,null,null,null,"Dilution Factor"]
[]
[null,12.83921468512464,"for all species and timeslices",null,null,null,null,null,null,null,null,12.83921468512464,"for all species and timeslices"]
[]
[]
["Pollutant Linkage: Infill, Geo Barrier, Sst Unsaturated, Sst Saturated, Principal Aquifer",null,null,null,null,null,null,null,null,null,"Pollutant Linkage: Infill, Geo Barrier, Sst Unsaturated, Sst Saturated, Principal Aquifer at Site Boundary"]
["Attenuation Factor",null,null,null,null,null,null,null,null,null,"Attenuation Factor"]
[]
[null,"Species1",null,"Species2",null,"Species3",null,"Species4",null,null,null,"Species1",null,"Species2",null,"Species3",null,"Species4"]
["Time(years)","Hg","Time(years)","Pb","Time(years)","Benzene","Time(years)","BaP",null,null,"Time(years)","Hg","Time(years)","Pb","Time(years)","Benzene","Time(years)","BaP"]
[1,1E+40,1,3.8943191796558557E-2,1,1E+40,1,7.7886383593117108,null,null,1,1E+40,1,3.8943191796558557E-2,1,1E+40,1,7.7886383593117108]
[2,1E+40,2,1.9471595898279279E-2,2,1E+40,2,3.8943191796558554,null,null,2,1E+40,2,1.9471595898279279E-2,2,1E+40,2,3.8943191796558554]
[5,1E+40,5,7.7886383593117111E-3,5,1E+40,5,1.5577276718623423,null,null,5,1E+40,5,7.7886383593117111E-3,5,1E+40,5,1.5577276718623423]
[10,1E+40,10,3.8943191796558555E-3,10,1E+40,10,0.77886383593117114,null,null,10,1E+40,10,3.8943191796558555E-3,10,1E+40,10,0.77886383593117114]
[15,1E+40,15,2.596212786437237E-3,15,1E+40,15,0.51924255728744739,null,null,15,1E+40,15,2.596212786437237E-3,15,1E+40,15,0.51924255728744739]
[20,1E+40,20,1.9471595898279278E-3,20,1E+40,20,0.38943191796558557,null,null,20,1E+40,20,1.9471595898279278E-3,20,1E+40,20,0.38943191796558557]
[30,1E+40,30,1.2981063932186185E-3,30,1E+40,30,0.2596212786437237,null,null,30,1E+40,30,1.2981063932186185E-3,30,1E+40,30,0.2596212786437237]
[40,1E+40,40,9.7357979491396389E-4,40,1E+40,40,0.19471595898279279,null,null,40,1E+40,40,9.7357979491396389E-4,40,1E+40,40,0.19471595898279279]
[50,1E+40,50,7.7886383593117115E-4,50,1E+40,50,0.15577276718623423,null,null,50,1E+40,50,7.7886383593117115E-4,50,1E+40,50,0.15577276718623423]
[60,1E+40,60,6.4905319660930926E-4,60,1E+40,60,0.12981063932186185,null,null,60,1E+40,60,6.4905319660930926E-4,60,1E+40,60,0.12981063932186185]
[70,1E+40,70,5.563313113794079E-4,70,1E+40,70,0.11126626227588159,null,null,70,1E+40,70,5.563313113794079E-4,70,1E+40,70,0.11126626227588159]
[80,1E+40,80,4.8678989745698194E-4,80,1E+40,80,9.7357979491396393E-2,null,null,80,1E+40,80,4.8678989745698194E-4,80,1E+40,80,9.7357979491396393E-2]
[90,1E+40,90,4.327021310728728E-4,90,1E+40,90,8.6540426214574556E-2,null,null,90,1E+40,90,4.327021310728728E-4,90,1E+40,90,8.6540426214574556E-2]
[100,1E+40,100,3.8943191796558558E-4,100,1E+40,100,7.7886383593117114E-2,null,null,100,1E+40,100,3.8943191796558558E-4,100,1E+40,100,7.7886383593117114E-2]
[120,1E+40,120,3.2452659830465463E-4,120,1E+40,120,6.4905319660930924E-2,null,null,120,1E+40,120,3.2452659830465463E-4,120,1E+40,120,6.4905319660930924E-2]
[140,1E+40,140,2.7816565568970395E-4,140,1E+40,140,5.5633131137940793E-2,null,null,140,1E+40,140,2.7816565568970395E-4,140,1E+40,140,5.5633131137940793E-2]
[160,1E+40,160,2.4339494872849097E-4,160,1E+40,160,4.8678989745698197E-2,null,null,160,1E+40,160,2.4339494872849097E-4,160,1E+40,160,4.8678989745698197E-2]
[180,1E+40,180,2.163510655364364E-4,180,1E+40,180,4.3270213107287278E-2,null,null,180,1E+40,180,2.163510655364364E-4,180,1E+40,180,4.3270213107287278E-2]
[200,1E+40,200,1.9471595898279279E-4,200,1E+40,200,3.8943191796558557E-2,null,null,200,1E+40,200,1.9471595898279279E-4,200,1E+40,200,3.8943191796558557E-2]
[250,1E+40,250,1.5577276718623423E-4,250,1.5363104166569849E+32,250,3.1154553437246844E-2,null,null,250,1E+40,250,1.5577276718623423E-4,250,1E+40,250,3.1154553437246844E-2]
[]
[]
["Saved  19/07/2022: 15:59:51  Level Number: 5"]
[]
["BREAKTHROUGH RESULTS"]
[]
["Advanced"]
["Pollutant Linkage: Infill, Geo Barrier, Sst Unsaturated, Sst Saturated, Principal Aquifer",null,null,null,null,null,null,null,null,null,"Pollutant Linkage: Infill, Geo Barrier, Sst Unsaturated, Sst Saturated, Principal Aquifer at Site Boundary"]
["Concentrations in mg/L in Principal Aquifer",null,null,null,null,null,null,null,null,null,"Concentrations in mg/L in Principal Aquifer at Site Boundary"]
[]
["Compared with MRV target concentration in mg/L",null,null,null,null,null,null,null,null,null,"Compared with MRV target concentration in mg/L"]
[null,1.0000000000000001E-5,null,2.0000000000000001E-4,null,1E-3,null,4.9999999999999998E-8,null,null,null,1.0000000000000001E-5,null,2.0000000000000001E-4,null,1E-3,null,4.9999999999999998E-8]
[]
[null,"Species1",null,"Species2",null,"Species3",null,"Species4",null,null,null,"Species1",null,"Species2",null,"Species3",null,"Species4"]
["Time(years)","Hg","Time(years)","Pb","Time(years)","Benzene","Time(years)","BaP",null,null,"Time(years)","Hg","Time(years)","Pb","Time(years)","Benzene","Time(years)","BaP"]
[1,0,1,0,1,0,1,0,null,null,1,0,1,0,1,0,1,0]
[2,0,2,0,2,0,2,0,null,null,2,0,2,0,2,0,2,0]
[5,0,5,0,5,0,5,0,null,null,5,0,5,0,5,0,5,0]
[10,0,10,0,10,4.8176508561030904E-22,10,0,null,null,10,0,10,0,10,1.5311481434347562E-22,10,0]
[15,0,15,0,15,4.3152027661843045E-20,15,0,null,null,15,0,15,0,15,2.4501941695639702E-20,15,0]
[20,0,20,0,20,3.3659610698239966E-15,20,0,null,null,20,0,20,0,20,1.2061598856690147E-15,20,0]
[30,0,30,0,30,1.4123686088091891E-10,30,0,null,null,30,0,30,0,30,7.3989425984600972E-11,30,0]
[40,0,40,0,40,2.8620020207981877E-8,40,0,null,null,40,0,40,0,40,1.7232072897082461E-8,40,0]
[50,0,50,0,50,6.7728192848452068E-7,50,0,null,null,50,0,50,0,50,4.3550517317489115E-7,50,0]
[60,0,60,0,60,5.4404989844997388E-6,60,0,null,null,60,0,60,0,60,3.6271211808121332E-6,60,0]
[70,0,70,0,70,2.3496754228800752E-5,70,0,null,null,70,0,70,0,70,1.6012832047181861E-5,70,0]
[80,0,80,0,80,6.876768592554408E-5,80,0,null,null,80,0,80,0,80,4.7539979776336147E-5,80,0]
[90,0,90,0,90,1.5523241719470575E-4,90,0,null,null,90,0,90,0,90,1.0837295923456951E-4,90,0]
[100,0,100,0,100,2.9224751847364784E-4,100,0,null,null,100,0,100,0,100,2.0546257619970663E-4,100,0]
[120,0,120,0,120,7.2200309304507005E-4,120,0,null,null,120,0,120,0,120,5.1221599187280655E-4,120,0]
[140,0,140,0,140,1.3142568067112627E-3,140,0,null,null,140,0,140,0,140,9.3738973751250631E-4,140,0]
[160,0,160,0,160,1.9852451797165928E-3,160,0,null,null,160,0,160,0,160,1.420770567080732E-3,160,0]
[180,0,180,0,180,2.6577202556861195E-3,180,0,null,null,180,0,180,0,180,1.9063168820317084E-3,180,0]
[200,0,200,0,200,3.2788032765307482E-3,200,0,null,null,200,0,200,0,200,2.35545608982738E-3,200,0]
[250,0,250,0,250,4.4604068559683623E-3,250,0,null,null,250,0,250,0,250,3.2114842381106147E-3,250,0]
[]
[]
["Pollutant Linkage: Infill, Geo Barrier, Sst Unsaturated, Sst Saturated, Principal Aquifer",null,null,null,null,null,null,null,null,null,"Pollutant Linkage: Infill, Geo Barrier, Sst Unsaturated, Sst Saturated, Principal Aquifer at Site Boundary"]
["Remedial Target Concentrations in mg/L in Infill",null,null,null,null,null,null,null,null,null,"Remedial Target Concentrations in mg/L in Infill"]
[]
[null,"Species1",null,"Species2",null,"Species3",null,"Species4",null,null,null,"Species1",null,"Species2",null,"Species3",null,"Species4"]
["Time(years)","Hg","Time(years)","Pb","Time(years)","Benzene","Time(years)","BaP",null,null,"Time(years)","Hg","Time(years)","Pb","Time(years)","Benzene","Time(years)","BaP"]
[1,1E+40,1,1E+40,1,1E+40,1,1E+40,null,null,1,1E+40,1,1E+40,1,1E+40,1,1E+40]
[2,1E+40,2,1E+40,2,1E+40,2,1E+40,null,null,2,1E+40,2,1E+40,2,1E+40,2,1E+40]
[5,1E+40,5,1E+40,5,1E+40,5,1E+40,null,null,5,1E+40,5,1E+40,5,1E+40,5,1E+40]
[10,1E+40,10,1E+40,10,1.2454202637783697E+19,10,1E+40,null,null,10,1E+40,10,1E+40,10,3.9186280084828815E+19,10,1E+40]
[15,1E+40,15,1E+40,15,1.3904329240374187E+17,15,1E+40,null,null,15,1E+40,15,1E+40,15,2.4487855185239232E+17,15,1E+40]
[20,1E+40,20,1E+40,20,1782551810771.1611,20,1E+40,null,null,20,1E+40,20,1E+40,20,4974464887523.6055,20,1E+40]
[30,1E+40,30,1E+40,30,42481827.779072367,30,1E+40,null,null,30,1E+40,30,1E+40,30,81092668.582788423,30,1E+40]
[40,1E+40,40,1E+40,40,209643.45784517133,40,1E+40,null,null,40,1E+40,40,1E+40,40,348187.94209116028,40,1E+40]
[50,1E+40,50,1E+40,50,8858.9400479436099,50,1E+40,null,null,50,1E+40,50,1E+40,50,13777.103854494299,50,1E+40]
[60,1E+40,60,1E+40,60,1102.8400183685924,60,1E+40,null,null,60,1E+40,60,1E+40,60,1654.2044505545209,60,1E+40]
[70,1E+40,70,1E+40,70,255.35441795810252,70,1E+40,null,null,70,1E+40,70,1E+40,70,374.69948990415816,70,1E+40]
[80,1E+40,80,1E+40,80,87.250282152816666,80,1E+40,null,null,80,1E+40,80,1E+40,80,126.20956147285962,80,1E+40]
[90,1E+40,90,1E+40,90,38.651720487443598,90,1E+40,null,null,90,1E+40,90,1E+40,90,55.364364343075728,90,1E+40]
[100,1E+40,100,1E+40,100,20.530542162810612,100,1E+40,null,null,100,1E+40,100,1E+40,100,29.202398368489682,100,1E+40]
[120,1E+40,120,1E+40,120,8.3102137065574286,120,1E+40,null,null,120,1E+40,120,1E+40,120,11.7138084230098,120,1E+40]
[140,1E+40,140,1E+40,140,4.5653178049837395,140,1E+40,null,null,140,1E+40,140,1E+40,140,6.4007528137888858,140,1E+40]
[160,1E+40,160,1E+40,160,3.0222967224917481,160,1E+40,null,null,160,1E+40,160,1E+40,160,4.2230604567831422,160,1E+40]
[180,1E+40,180,1E+40,180,2.2575739441211562,180,1E+40,null,null,180,1E+40,180,1E+40,180,3.1474305539409264,180,1E+40]
[200,1E+40,200,1E+40,200,1.8299359534459501,200,1E+40,null,null,200,1E+40,200,1E+40,200,2.5472773726975784,200,1E+40]
[250,1E+40,250,1E+40,250,1.3451687690712666,250,1E+40,null,null,250,1E+40,250,1E+40,250,1.8682950172378643,250,1E+40]
[]
["Compared with source concentrations in mg/L",null,null,null,null,null,null,null,null,null,"Compared with source concentrations in mg/L"]
[null,0.01,null,0.5,null,6,null,100,null,null,null,0.01,null,0.5,null,6,null,100]
[]
[]
["Pollutant Linkage: Infill, Geo Barrier, Sst Unsaturated, Sst Saturated, Principal Aquifer",null,null,null,null,null,null,null,null,null,"Pollutant Linkage: Infill, Geo Barrier, Sst Unsaturated, Sst Saturated, Principal Aquifer at Site Boundary"]
["Dilution Factor",null,null,null,null,null,null,null,null,null,"Dilution Factor"]
[]
[null,12.83921468512464,"for all species and timeslices",null,null,null,null,null,null,null,null,12.83921468512464,"for all species and timeslices"]
[]
[]
["Pollutant Linkage: Infill, Geo Barrier, Sst Unsaturated, Sst Saturated, Principal Aquifer",null,null,null,null,null,null,null,null,null,"Pollutant Linkage: Infill, Geo Barrier, Sst Unsaturated, Sst Saturated, Principal Aquifer at Site Boundary"]
["Attenuation Factor",null,null,null,null,null,null,null,null,null,"Attenuation Factor"]
[]
[null,"Species1",null,"Species2",null,"Species3",null,"Species4",null,null,null,"Species1",null,"Species2",null,"Species3",null,"Species4"]
["Time(years)","Hg","Time(years)","Pb","Time(years)","Benzene","Time(years)","BaP",null,null,"Time(years)","Hg","Time(years)","Pb","Time(years)","Benzene","Time(years)","BaP"]
[1,1E+40,1,3.8943191796558557E-2,1,1E+40,1,7.7886383593117108,null,null,1,1E+40,1,3.8943191796558557E-2,1,1E+40,1,7.7886383593117108]
[2,1E+40,2,1.9471595898279279E-2,2,1E+40,2,3.8943191796558554,null,null,2,1E+40,2,1.9471595898279279E-2,2,1E+40,2,3.8943191796558554]
[5,1E+40,5,7.7886383593117111E-3,5,1E+40,5,1.5577276718623423,null,null,5,1E+40,5,7.7886383593117111E-3,5,1E+40,5,1.5577276718623423]
[10,1E+40,10,3.8943191796558555E-3,10,1E+40,10,0.77886383593117114,null,null,10,1E+40,10,3.8943191796558555E-3,10,1E+40,10,0.77886383593117114]
[15,1E+40,15,2.596212786437237E-3,15,1E+40,15,0.51924255728744739,null,null,15,1E+40,15,2.596212786437237E-3,15,1E+40,15,0.51924255728744739]
[20,1E+40,20,1.9471595898279278E-3,20,1E+40,20,0.38943191796558557,null,null,20,1E+40,20,1.9471595898279278E-3,20,1E+40,20,0.38943191796558557]
[30,1E+40,30,1.2981063932186185E-3,30,1E+40,30,0.2596212786437237,null,null,30,1E+40,30,1.2981063932186185E-3,30,1E+40,30,0.2596212786437237]
[40,1E+40,40,9.7357979491396389E-4,40,1E+40,40,0.19471595898279279,null,null,40,1E+40,40,9.7357979491396389E-4,40,1E+40,40,0.19471595898279279]
[50,1E+40,50,7.7886383593117115E-4,50,1E+40,50,0.15577276718623423,null,null,50,1E+40,50,7.7886383593117115E-4,50,1E+40,50,0.15577276718623423]
[60,1E+40,60,6.4905319660930926E-4,60,1E+40,60,0.12981063932186185,null,null,60,1E+40,60,6.4905319660930926E-4,60,1E+40,60,0.12981063932186185]
[70,1E+40,70,5.563313113794079E-4,70,1E+40,70,0.11126626227588159,null,null,70,1E+40,70,5.563313113794079E-4,70,1E+40,70,0.11126626227588159]
[80,1E+40,80,4.8678989745698194E-4,80,1E+40,80,9.7357979491396393E-2,null,null,80,1E+40,80,4.8678989745698194E-4,80,1E+40,80,9.7357979491396393E-2]
[90,1E+40,90,4.327021310728728E-4,90,1E+40,90,8.6540426214574556E-2,null,null,90,1E+40,90,4.327021310728728E-4,90,1E+40,90,8.6540426214574556E-2]
[100,1E+40,100,3.8943191796558558E-4,100,1E+40,100,7.7886383593117114E-2,null,null,100,1E+40,100,3.8943191796558558E-4,100,1E+40,100,7.7886383593117114E-2]
[120,1E+40,120,3.2452659830465463E-4,120,1E+40,120,6.4905319660930924E-2,null,null,120,1E+40,120,3.2452659830465463E-4,120,1E+40,120,6.4905319660930924E-2]
[140,1E+40,140,2.7816565568970395E-4,140,1E+40,140,5.5633131137940793E-2,null,null,140,1E+40,140,2.7816565568970395E-4,140,1E+40,140,5.5633131137940793E-2]
[160,1E+40,160,2.4339494872849097E-4,160,1E+40,160,4.8678989745698197E-2,null,null,160,1E+40,160,2.4339494872849097E-4,160,1E+40,160,4.8678989745698197E-2]
[180,1E+40,180,2.163510655364364E-4,180,1E+40,180,4.3270213107287278E-2,null,null,180,1E+40,180,2.163510655364364E-4,180,1E+40,180,4.3270213107287278E-2]
[200,1E+40,200,1.9471595898279279E-4,200,1E+40,200,3.8943191796558557E-2,null,null,200,1E+40,200,1.9471595898279279E-4,200,1E+40,200,3.8943191796558557E-2]
[250,1E+40,250,1.5577276718623423E-4,250,1E+40,250,3.1154553437246844E-2,null,null,250,1E+40,250,1.5577276718623423E-4,250,1E+40,250,3.1154553437246844E-2]
[]
[]
["Saved  19/07/2022: 16:10:14  Level Number: 5"]
[]
["BREAKTHROUGH RESULTS"]
[]
["Advanced"]
["Pollutant Linkage: Infill, Geo Barrier, Sst Unsaturated, Sst Saturated, Principal Aquifer",null,null,null,null,null,null,null,null,null,"Pollutant Linkage: Infill, Geo Barrier, Sst Unsaturated, Sst Saturated, Principal Aquifer at Site Boundary"]
["Concentrations in mg/L in Principal Aquifer",null,null,null,null,null,null,null,null,null,"Concentrations in mg/L in Principal Aquifer at Site Boundary"]
[]
["Compared with MRV target concentration in mg/L",null,null,null,null,null,null,null,null,null,"Compared with MRV target concentration in mg/L"]
[null,1.0000000000000001E-5,null,2.0000000000000001E-4,null,1E-3,null,4.9999999999999998E-8,null,null,null,1.0000000000000001E-5,null,2.0000000000000001E-4,null,1E-3,null,4.9999999999999998E-8]
[]
[null,"Species1",null,"Species2",null,"Species3",null,"Species4",null,null,null,"Species1",null,"Species2",null,"Species3",null,"Species4"]
["Time(years)","Hg","Time(years)","Pb","Time(years)","Benzene","Time(years)","BaP",null,null,"Time(years)","Hg","Time(years)","Pb","Time(years)","Benzene","Time(years)","BaP"]
[1,0,1,0,1,0,1,0,null,null,1,0,1,0,1,0,1,0]
[2,0,2,0,2,0,2,0,null,null,2,0,2,0,2,0,2,0]
[5,0,5,0,5,7.81954213321348E-36,5,0,null,null,5,0,5,0,5,0,5,0]
[10,0,10,0,10,0,10,0,null,null,10,0,10,0,10,0,10,0]
[15,0,15,0,15,1.2098057815284268E-21,15,0,null,null,15,0,15,0,15,8.7750369555113825E-22,15,0]
[20,0,20,0,20,6.4610467114557595E-20,20,0,null,null,20,0,20,0,20,5.1130910866518264E-20,20,0]
[30,0,30,0,30,9.1480531406077994E-15,30,0,null,null,30,0,30,0,30,4.1622908903561635E-15,30,0]
[40,0,40,0,40,2.1572292974220559E-11,40,0,null,null,40,0,40,0,40,1.1966676772908716E-11,40,0]
[50,0,50,0,50,2.2488483485146297E-9,50,0,null,null,50,0,50,0,50,1.3707094988536312E-9,50,0]
[60,0,60,0,60,4.8943648460755951E-8,60,0,null,null,60,0,60,0,60,3.1422116424538477E-8,60,0]
[70,0,70,0,70,4.3352572443547535E-7,70,0,null,null,70,0,70,0,70,2.8726540993813004E-7,70,0]
[80,0,80,0,80,2.1850108896843711E-6,80,0,null,null,80,0,80,0,80,1.4780511192711811E-6,80,0]
[90,0,90,0,90,7.554894434813932E-6,90,0,null,null,90,0,90,0,90,5.1836577012362237E-6,90,0]
[100,0,100,0,100,2.0058476332254148E-5,100,0,null,null,100,0,100,0,100,1.3903647092904043E-5,100,0]
[120,0,120,0,120,8.3402948749942797E-5,120,0,null,null,120,0,120,0,120,5.8582569782143378E-5,120,0]
[140,0,140,0,140,2.2100517942373084E-4,140,0,null,null,140,0,140,0,140,1.5647208819545344E-4,140,0]
[160,0,160,0,160,4.4317880245100003E-4,160,0,null,null,160,0,160,0,160,3.1537204415601973E-4,160,0]
[180,0,180,0,180,7.4005069934754105E-4,180,0,null,null,180,0,180,0,180,5.2843960518439632E-4,180,0]
[200,0,200,0,200,1.089752325948E-3,200,0,null,null,200,0,200,0,200,7.8002056644301606E-4,200,0]
[250,0,250,0,250,2.0378225753538239E-3,250,0,null,null,250,0,250,0,250,1.4638232190750384E-3,250,0]
[]
[]
["Pollutant Linkage: Infill, Geo Barrier, Sst Unsaturated, Sst Saturated, Principal Aquifer",null,null,null,null,null,null,null,null,null,"Pollutant Linkage: Infill, Geo Barrier, Sst Unsaturated, Sst Saturated, Principal Aquifer at Site Boundary"]
["Remedial Target Concentrations in mg/L in Infill",null,null,null,null,null,null,null,null,null,"Remedial Target Concentrations in mg/L in Infill"]
[]
[null,"Species1",null,"Species2",null,"Species3",null,"Species4",null,null,null,"Species1",null,"Species2",null,"Species3",null,"Species4"]
["Time(years)","Hg","Time(years)","Pb","Time(years)","Benzene","Time(years)","BaP",null,null,"Time(years)","Hg","Time(years)","Pb","Time(years)","Benzene","Time(years)","BaP"]
[1,1E+40,1,1E+40,1,1E+40,1,1E+40,null,null,1,1E+40,1,1E+40,1,1E+40,1,1E+40]
[2,1E+40,2,1E+40,2,1E+40,2,1E+40,null,null,2,1E+40,2,1E+40,2,1E+40,2,1E+40]
[5,1E+40,5,1E+40,5,7.6730835358185734E+32,5,1E+40,null,null,5,1E+40,5,1E+40,5,1E+40,5,1E+40]
[10,1E+40,10,1E+40,10,1E+40,10,1E+40,null,null,10,1E+40,10,1E+40,10,1E+40,10,1E+40]
[15,1E+40,15,1E+40,15,4.959473736701611E+18,15,1E+40,null,null,15,1E+40,15,1E+40,15,6.8375780414594714E+18,15,1E+40]
[20,1E+40,20,1E+40,20,9.2864210211662752E+16,20,1E+40,null,null,20,1E+40,20,1E+40,20,1.1734584614898661E+17,20,1E+40]
[30,1E+40,30,1E+40,30,655877256917.78809,30,1E+40,null,null,30,1E+40,30,1E+40,30,1441513858125.9961,30,1E+40]
[40,1E+40,40,1E+40,40,278134550.0531702,40,1E+40,null,null,40,1E+40,40,1E+40,40,501392334.21791434,40,1E+40]
[50,1E+40,50,1E+40,50,2668032.2859311593,50,1E+40,null,null,50,1E+40,50,1E+40,50,4377295.1198032806,50,1E+40]
[60,1E+40,60,1E+40,60,122589.96189895665,60,1E+40,null,null,60,1E+40,60,1E+40,60,190948.30911244475,60,1E+40]
[70,1E+40,70,1E+40,70,13840.009166268106,70,1E+40,null,null,70,1E+40,70,1E+40,70,20886.607967496864,70,1E+40]
[80,1E+40,80,1E+40,80,2745.9817378149137,80,1E+40,null,null,80,1E+40,80,1E+40,80,4059.3995172227651,80,1E+40]
[90,1E+40,90,1E+40,90,794.18713944581714,90,1E+40,null,null,90,1E+40,90,1E+40,90,1157.483835896242,90,1E+40]
[100,1E+40,100,1E+40,100,299.12541215067091,100,1E+40,null,null,100,1E+40,100,1E+40,100,431.54144807531827,100,1E+40]
[120,1E+40,120,1E+40,120,71.939902484612276,120,1E+40,null,null,120,1E+40,120,1E+40,120,102.41954257576572,120,1E+40]
[140,1E+40,140,1E+40,140,27.148685002066241,140,1E+40,null,null,140,1E+40,140,1E+40,140,38.345497073607412,140,1E+40]
[160,1E+40,160,1E+40,160,13.538553664608967,160,1E+40,null,null,160,1E+40,160,1E+40,160,19.025148586193968,160,1E+40]
[180,1E+40,180,1E+40,180,8.1075526383392997,180,1E+40,null,null,180,1E+40,180,1E+40,180,11.354183034608715,180,1E+40]
[200,1E+40,200,1E+40,200,5.5058382140001081,200,1E+40,null,null,200,1E+40,200,1E+40,200,7.6921048727736672,200,1E+40]
[250,1E+40,250,1E+40,250,2.9443191338471797,250,1E+40,null,null,250,1E+40,250,1E+40,250,4.0988556007406984,250,1E+40]
[]
["Compared with source concentrations in mg/L",null,null,null,null,null,null,null,null,null,"Compared with source concentrations in mg/L"]
[null,0.01,null,0.5,null,6,null,100,null,null,null,0.01,null,0.5,null,6,null,100]
[]
[]
["Pollutant Linkage: Infill, Geo Barrier, Sst Unsaturated, Sst Saturated, Principal Aquifer",null,null,null,null,null,null,null,null,null,"Pollutant Linkage: Infill, Geo Barrier, Sst Unsaturated, Sst Saturated, Principal Aquifer at Site Boundary"]
["Dilution Factor",null,null,null,null,null,null,null,null,null,"Dilution Factor"]
[]
[null,12.83921468512464,"for all species and timeslices",null,null,null,null,null,null,null,null,12.83921468512464,"for all species and timeslices"]
[]
[]
["Pollutant Linkage: Infill, Geo Barrier, Sst Unsaturated, Sst Saturated, Principal Aquifer",null,null,null,null,null,null,null,null,null,"Pollutant Linkage: Infill, Geo Barrier, Sst Unsaturated, Sst Saturated, Principal Aquifer at Site Boundary"]
["Attenuation Factor",null,null,null,null,null,null,null,null,null,"Attenuation Factor"]
[]
[null,"Species1",null,"Species2",null,"Species3",null,"Species4",null,null,null,"Species1",null,"Species2",null,"Species3",null,"Species4"]
["Time(years)","Hg","Time(years)","Pb","Time(years)","Benzene","Time(years)","BaP",null,null,"Time(years)","Hg","Time(years)","Pb","Time(years)","Benzene","Time(years)","BaP"]
[1,1E+40,1,3.8943191796558557E-2,1,1E+40,1,7.7886383593117108,null,null,1,1E+40,1,3.8943191796558557E-2,1,1E+40,1,7.7886383593117108]
[2,1E+40,2,1.9471595898279279E-2,2,1E+40,2,3.8943191796558554,null,null,2,1E+40,2,1.9471595898279279E-2,2,1E+40,2,3.8943191796558554]
[5,1E+40,5,7.7886383593117111E-3,5,1E+40,5,1.5577276718623423,null,null,5,1E+40,5,7.7886383593117111E-3,5,1E+40,5,1.5577276718623423]
[10,1E+40,10,3.8943191796558555E-3,10,1E+40,10,0.77886383593117114,null,null,10,1E+40,10,3.8943191796558555E-3,10,1E+40,10,0.77886383593117114]
[15,1E+40,15,2.596212786437237E-3,15,1E+40,15,0.51924255728744739,null,null,15,1E+40,15,2.596212786437237E-3,15,1E+40,15,0.51924255728744739]
[20,1E+40,20,1.9471595898279278E-3,20,1E+40,20,0.38943191796558557,null,null,20,1E+40,20,1.9471595898279278E-3,20,1E+40,20,0.38943191796558557]
[30,1E+40,30,1.2981063932186185E-3,30,1E+40,30,0.2596212786437237,null,null,30,1E+40,30,1.2981063932186185E-3,30,1E+40,30,0.2596212786437237]
[40,1E+40,40,9.7357979491396389E-4,40,1E+40,40,0.19471595898279279,null,null,40,1E+40,40,9.7357979491396389E-4,40,1E+40,40,0.19471595898279279]
[50,1E+40,50,7.7886383593117115E-4,50,1E+40,50,0.15577276718623423,null,null,50,1E+40,50,7.7886383593117115E-4,50,1E+40,50,0.15577276718623423]
[60,1E+40,60,6.4905319660930926E-4,60,1E+40,60,0.12981063932186185,null,null,60,1E+40,60,6.4905319660930926E-4,60,1E+40,60,0.12981063932186185]
[70,1E+40,70,5.563313113794079E-4,70,1E+40,70,0.11126626227588159,null,null,70,1E+40,70,5.563313113794079E-4,70,1E+40,70,0.11126626227588159]
[80,1E+40,80,4.8678989745698194E-4,80,1E+40,80,9.7357979491396393E-2,null,null,80,1E+40,80,4.8678989745698194E-4,80,1E+40,80,9.7357979491396393E-2]
[90,1E+40,90,4.327021310728728E-4,90,1E+40,90,8.6540426214574556E-2,null,null,90,1E+40,90,4.327021310728728E-4,90,1E+40,90,8.6540426214574556E-2]
[100,1E+40,100,3.8943191796558558E-4,100,1E+40,100,7.7886383593117114E-2,null,null,100,1E+40,100,3.8943191796558558E-4,100,1E+40,100,7.7886383593117114E-2]
[120,1E+40,120,3.2452659830465463E-4,120,1E+40,120,6.4905319660930924E-2,null,null,120,1E+40,120,3.2452659830465463E-4,120,1E+40,120,6.4905319660930924E-2]
[140,1E+40,140,2.7816565568970395E-4,140,1E+40,140,5.5633131137940793E-2,null,null,140,1E+40,140,2.7816565568970395E-4,140,1E+40,140,5.5633131137940793E-2]
[160,1E+40,160,2.4339494872849097E-4,160,1E+40,160,4.8678989745698197E-2,null,null,160,1E+40,160,2.4339494872849097E-4,160,1E+40,160,4.8678989745698197E-2]
[180,1E+40,180,2.163510655364364E-4,180,1E+40,180,4.3270213107287278E-2,null,null,180,1E+40,180,2.163510655364364E-4,180,1E+40,180,4.3270213107287278E-2]
[200,1E+40,200,1.9471595898279279E-4,200,1E+40,200,3.8943191796558557E-2,null,null,200,1E+40,200,1.9471595898279279E-4,200,1E+40,200,3.8943191796558557E-2]
[250,1E+40,250,1.5577276718623423E-4,250,1E+40,250,3.1154553437246844E-2,null,null,250,1E+40,250,1.5577276718623423E-4,250,1E+40,250,3.1154553437246844E-2]
[]
[]
["Saved  19/07/2022: 16:11:50  Level Number: 5"]
[]
["BREAKTHROUGH RESULTS"]
[]
["Advanced"]
["Pollutant Linkage: Infill, Geo Barrier, Sst Unsaturated, Sst Saturated, Principal Aquifer",null,null,null,null,null,null,null,null,null,"Pollutant Linkage: Infill, Geo Barrier, Sst Unsaturated, Sst Saturated, Principal Aquifer at Site Boundary"]
["Concentrations in mg/L in Principal Aquifer",null,null,null,null,null,null,null,null,null,"Concentrations in mg/L in Principal Aquifer at Site Boundary"]
[]
["Compared with MRV target concentration in mg/L",null,null,null,null,null,null,null,null,null,"Compared with MRV target concentration in mg/L"]
[null,1.0000000000000001E-5,null,2.0000000000000001E-4,null,1E-3,null,4.9999999999999998E-8,null,null,null,1.0000000000000001E-5,null,2.0000000000000001E-4,null,1E-3,null,4.9999999999999998E-8]
[]
[null,"Species1",null,"Species2",null,"Species3",null,"Species4",null,null,null,"Species1",null,"Species2",null,"Species3",null,"Species4"]
["Time(years)","Hg","Time(years)","Pb","Time(years)","Benzene","Time(years)","BaP",null,null,"Time(years)","Hg","Time(years)","Pb","Time(years)","Benzene","Time(years)","BaP"]
[1,0,1,0,1,0,1,0,null,null,1,0,1,0,1,0,1,0]
[2,0,2,0,2,0,2,0,null,null,2,0,2,0,2,0,2,0]
[5,0,5,0,5,0,5,0,null,null,5,0,5,0,5,3.305507393604844E-39,5,0]
[10,0,10,0,10,2.9003988710586555E-31,10,0,null,null,10,0,10,0,10,3.1054723619110071E-31,10,0]
[15,0,15,0,15,0,15,0,null,null,15,0,15,0,15,6.7236022243211801E-29,15,0]
[20,0,20,0,20,5.3425719073809424E-27,20,0,null,null,20,0,20,0,20,1.1988374153032624E-27,20,0]
[30,0,30,0,30,1.8868333080879758E-23,30,0,null,null,30,0,30,0,30,1.1242432105423758E-23,30,0]
[40,0,40,0,40,1.1303775526228306E-22,40,0,null,null,40,0,40,0,40,8.055324028979141E-23,40,0]
[50,0,50,0,50,7.2594548168578023E-23,50,0,null,null,50,0,50,0,50,5.4335925932759089E-23,50,0]
[60,0,60,0,60,2.9462962872549082E-23,60,0,null,null,60,0,60,0,60,2.2184174188823313E-23,60,0]
[70,0,70,0,70,1.1505648665114475E-23,70,0,null,null,70,0,70,0,70,8.6653198722373337E-24,70,0]
[80,0,80,0,80,4.4875892472510351E-24,80,0,null,null,80,0,80,0,80,3.3797807173873063E-24,80,0]
[90,0,90,0,90,1.7502769705111467E-24,90,0,null,null,90,0,90,0,90,1.3182027832888045E-24,90,0]
[100,0,100,0,100,6.8265358854723074E-25,100,0,null,null,100,0,100,0,100,5.1413340622425012E-25,100,0]
[120,0,120,0,120,1.0384547502362105E-25,120,0,null,null,120,0,120,0,120,7.8210132887527176E-26,120,0]
[140,0,140,0,140,1.5797002125421534E-26,140,0,null,null,140,0,140,0,140,1.1897347090450874E-26,140,0]
[160,0,160,0,160,2.4030457684342604E-27,160,0,null,null,160,0,160,0,160,1.8098279091892161E-27,160,0]
[180,0,180,0,180,3.6556403442536554E-28,180,0,null,null,180,0,180,0,180,2.7531967525881715E-28,180,0]
[200,0,200,0,200,5.5621278512364852E-29,200,0,null,null,200,0,200,0,200,4.1891099808674569E-29,200,0]
[250,0,250,0,250,4.6266761483279244E-31,250,0,null,null,250,0,250,0,250,3.5178494578869141E-31,250,0]
[]
[]
["Pollutant Linkage: Infill, Geo Barrier, Sst Unsaturated, Sst Saturated, Principal Aquifer",null,null,null,null,null,null,null,null,null,"Pollutant Linkage: Infill, Geo Barrier, Sst Unsaturated, Sst Saturated, Principal Aquifer at Site Boundary"]
["Remedial Target Concentrations in mg/L in Infill",null,null,null,null,null,null,null,null,null,"Remedial Target Concentrations in mg/L in Infill"]
[]
[null,"Species1",null,"Species2",null,"Species3",null,"Species4",null,null,null,"Species1",null,"Species2",null,"Species3",null,"Species4"]
["Time(years)","Hg","Time(years)","Pb","Time(years)","Benzene","Time(years)","BaP",null,null,"Time(years)","Hg","Time(years)","Pb","Time(years)","Benzene","Time(years)","BaP"]
[1,1E+40,1,1E+40,1,1E+40,1,1E+40,null,null,1,1E+40,1,1E+40,1,1E+40,1,1E+40]
[2,1E+40,2,1E+40,2,1E+40,2,1E+40,null,null,2,1E+40,2,1E+40,2,1E+40,2,1E+40]
[5,1E+40,5,1E+40,5,1E+40,5,1E+40,null,null,5,1E+40,5,1E+40,5,1.8151524971954935E+36,5,1E+40]
[10,1E+40,10,1E+40,10,2.0686809872498602E+28,10,1E+40,null,null,10,1E+40,10,1E+40,10,1.9320732245408859E+28,10,1E+40]
[15,1E+40,15,1E+40,15,1E+40,15,1E+40,null,null,15,1E+40,15,1E+40,15,8.9237878741492104E+25,15,1E+40]
[20,1E+40,20,1E+40,20,1.1230546081580669E+24,20,1E+40,null,null,20,1E+40,20,1E+40,20,5.0048488005208087E+24,20,1E+40]
[30,1E+40,30,1E+40,30,3.1799311440394833E+20,30,1E+40,null,null,30,1E+40,30,1E+40,30,5.3369234910526007E+20,30,1E+40]
[40,1E+40,40,1E+40,40,5.3079610313192415E+19,40,1E+40,null,null,40,1E+40,40,1E+40,40,7.4484899408328163E+19,40,1E+40]
[50,1E+40,50,1E+40,50,8.2650834688947798E+19,50,1E+40,null,null,50,1E+40,50,1E+40,50,1.1042417879148729E+20,50,1E+40]
[60,1E+40,60,1E+40,60,2.0364550659602045E+20,60,1E+40,null,null,60,1E+40,60,1E+40,60,2.7046307646749734E+20,60,1E+40]
[70,1E+40,70,1E+40,70,5.2148298410955375E+20,70,1E+40,null,null,70,1E+40,70,1E+40,70,6.9241529319919216E+20,70,1E+40]
[80,1E+40,80,1E+40,80,1.3370207631358915E+21,80,1E+40,null,null,80,1E+40,80,1E+40,80,1.7752631018731353E+21,80,1E+40]
[90,1E+40,90,1E+40,90,3.4280288783367668E+21,90,1E+40,null,null,90,1E+40,90,1E+40,90,4.5516517458948973E+21,90,1E+40]
[100,1E+40,100,1E+40,100,8.7892308788249761E+21,100,1E+40,null,null,100,1E+40,100,1E+40,100,1.1670122826803777E+22,100,1E+40]
[120,1E+40,120,1E+40,120,5.7778155462577638E+22,120,1E+40,null,null,120,1E+40,120,1E+40,120,7.6716402062997525E+22,120,1E+40]
[140,1E+40,140,1E+40,140,3.7981890186267815E+23,140,1E+40,null,null,140,1E+40,140,1E+40,140,5.0431410921984105E+23,140,1E+40]
[160,1E+40,160,1E+40,160,2.4968313457922141E+24,160,1E+40,null,null,160,1E+40,160,1E+40,160,3.315232332055227E+24,160,1E+40]
[180,1E+40,180,1E+40,180,1.6412993169394991E+25,180,1E+40,null,null,180,1E+40,180,1E+40,180,2.1792848601755896E+25,180,1E+40]
[200,1E+40,200,1E+40,200,1.0787238554155446E+26,200,1E+40,null,null,200,1E+40,200,1E+40,200,1.4322851458670833E+26,200,1E+40]
[250,1E+40,250,1E+40,250,1.2968273135279619E+28,250,1E+40,null,null,250,1E+40,250,1E+40,250,1.7055874823034788E+28,250,1E+40]
[]
["Compared with source concentrations in mg/L",null,null,null,null,null,null,null,null,null,"Compared with source concentrations in mg/L"]
[null,0.01,null,0.5,null,6,null,100,null,null,null,0.01,null,0.5,null,6,null,100]
[]
[]
["Pollutant Linkage: Infill, Geo Barrier, Sst Unsaturated, Sst Saturated, Principal Aquifer",null,null,null,null,null,null,null,null,null,"Pollutant Linkage: Infill, Geo Barrier, Sst Unsaturated, Sst Saturated, Principal Aquifer at Site Boundary"]
["Dilution Factor",null,null,null,null,null,null,null,null,null,"Dilution Factor"]
[]
[null,12.83921468512464,"for all species and timeslices",null,null,null,null,null,null,null,null,12.83921468512464,"for all species and timeslices"]
[]
[]
["Pollutant Linkage: Infill, Geo Barrier, Sst Unsaturated, Sst Saturated, Principal Aquifer",null,null,null,null,null,null,null,null,null,"Pollutant Linkage: Infill, Geo Barrier, Sst Unsaturated, Sst Saturated, Principal Aquifer at Site Boundary"]
["Attenuation Factor",null,null,null,null,null,null,null,null,null,"Attenuation Factor"]
[]
[null,"Species1",null,"Species2",null,"Species3",null,"Species4",null,null,null,"Species1",null,"Species2",null,"Species3",null,"Species4"]
["Time(years)","Hg","Time(years)","Pb","Time(years)","Benzene","Time(years)","BaP",null,null,"Time(years)","Hg","Time(years)","Pb","Time(years)","Benzene","Time(years)","BaP"]
[1,1E+40,1,3.8943191796558557E-2,1,1E+40,1,7.7886383593117108,null,null,1,1E+40,1,3.8943191796558557E-2,1,1E+40,1,7.7886383593117108]
[2,1E+40,2,1.9471595898279279E-2,2,1E+40,2,3.8943191796558554,null,null,2,1E+40,2,1.9471595898279279E-2,2,1E+40,2,3.8943191796558554]
[5,1E+40,5,7.7886383593117111E-3,5,1E+40,5,1.5577276718623423,null,null,5,1E+40,5,7.7886383593117111E-3,5,1E+40,5,1.5577276718623423]
[10,1E+40,10,3.8943191796558555E-3,10,1E+40,10,0.77886383593117114,null,null,10,1E+40,10,3.8943191796558555E-3,10,1E+40,10,0.77886383593117114]
[15,1E+40,15,2.596212786437237E-3,15,1E+40,15,0.51924255728744739,null,null,15,1E+40,15,2.596212786437237E-3,15,1E+40,15,0.51924255728744739]
[20,1E+40,20,1.9471595898279278E-3,20,1E+40,20,0.38943191796558557,null,null,20,1E+40,20,1.9471595898279278E-3,20,1E+40,20,0.38943191796558557]
[30,1E+40,30,1.2981063932186185E-3,30,1E+40,30,0.2596212786437237,null,null,30,1E+40,30,1.2981063932186185E-3,30,1E+40,30,0.2596212786437237]
[40,1E+40,40,9.7357979491396389E-4,40,1E+40,40,0.19471595898279279,null,null,40,1E+40,40,9.7357979491396389E-4,40,1E+40,40,0.19471595898279279]
[50,1E+40,50,7.7886383593117115E-4,50,1E+40,50,0.15577276718623423,null,null,50,1E+40,50,7.7886383593117115E-4,50,1E+40,50,0.15577276718623423]
[60,1E+40,60,6.4905319660930926E-4,60,1E+40,60,0.12981063932186185,null,null,60,1E+40,60,6.4905319660930926E-4,60,1E+40,60,0.12981063932186185]
[70,1E+40,70,5.563313113794079E-4,70,1E+40,70,0.11126626227588159,null,null,70,1E+40,70,5.563313113794079E-4,70,1E+40,70,0.11126626227588159]
[80,1E+40,80,4.8678989745698194E-4,80,1E+40,80,9.7357979491396393E-2,null,null,80,1E+40,80,4.8678989745698194E-4,80,1E+40,80,9.7357979491396393E-2]
[90,1E+40,90,4.327021310728728E-4,90,1E+40,90,8.6540426214574556E-2,null,null,90,1E+40,90,4.327021310728728E-4,90,1E+40,90,8.6540426214574556E-2]
[100,1E+40,100,3.8943191796558558E-4,100,1E+40,100,7.7886383593117114E-2,null,null,100,1E+40,100,3.8943191796558558E-4,100,1E+40,100,7.7886383593117114E-2]
[120,1E+40,120,3.2452659830465463E-4,120,1E+40,120,6.4905319660930924E-2,null,null,120,1E+40,120,3.2452659830465463E-4,120,1E+40,120,6.4905319660930924E-2]
[140,1E+40,140,2.7816565568970395E-4,140,1E+40,140,5.5633131137940793E-2,null,null,140,1E+40,140,2.7816565568970395E-4,140,1E+40,140,5.5633131137940793E-2]
[160,1E+40,160,2.4339494872849097E-4,160,1E+40,160,4.8678989745698197E-2,null,null,160,1E+40,160,2.4339494872849097E-4,160,1E+40,160,4.8678989745698197E-2]
[180,1E+40,180,2.163510655364364E-4,180,1E+40,180,4.3270213107287278E-2,null,null,180,1E+40,180,2.163510655364364E-4,180,1E+40,180,4.3270213107287278E-2]
[200,1E+40,200,1.9471595898279279E-4,200,1E+40,200,3.8943191796558557E-2,null,null,200,1E+40,200,1.9471595898279279E-4,200,1E+40,200,3.8943191796558557E-2]
[250,1E+40,250,1.5577276718623423E-4,250,1E+40,250,3.1154553437246844E-2,null,null,250,1E+40,250,1.5577276718623423E-4,250,1E+40,250,3.1154553437246844E-2]
[]
[]
["Saved  19/07/2022: 16:12:34  Level Number: 5"]
[]
["BREAKTHROUGH RESULTS"]
[]
["Advanced"]
["Pollutant Linkage: Infill, Geo Barrier, Sst Unsaturated, Sst Saturated, Principal Aquifer",null,null,null,null,null,null,null,null,null,"Pollutant Linkage: Infill, Geo Barrier, Sst Unsaturated, Sst Saturated, Principal Aquifer at Site Boundary"]
["Concentrations in mg/L in Principal Aquifer",null,null,null,null,null,null,null,null,null,"Concentrations in mg/L in Principal Aquifer at Site Boundary"]
[]
["Compared with MRV target concentration in mg/L",null,null,null,null,null,null,null,null,null,"Compared with MRV target concentration in mg/L"]
[null,1.0000000000000001E-5,null,2.0000000000000001E-4,null,1E-3,null,4.9999999999999998E-8,null,null,null,1.0000000000000001E-5,null,2.0000000000000001E-4,null,1E-3,null,4.9999999999999998E-8]
[]
[null,"Species1",null,"Species2",null,"Species3",null,"Species4",null,null,null,"Species1",null,"Species2",null,"Species3",null,"Species4"]
["Time(years)","Hg","Time(years)","Pb","Time(years)","Benzene","Time(years)","BaP",null,null,"Time(years)","Hg","Time(years)","Pb","Time(years)","Benzene","Time(years)","BaP"]
[1,0,1,0,1,5.0123112513824932E-5,1,0,null,null,1,0,1,0,1,3.8013001973918386E-7,1,0]
[2,0,2,0,2,6.1919711869033115E-3,2,0,null,null,2,0,2,0,2,1.4076605735095376E-3,2,0]
[5,0,5,0,5,2.8820255971746207E-2,5,0,null,null,5,0,5,0,5,2.0607929544379289E-2,5,0]
[10,0,10,0,10,1.9429044831401156E-2,10,0,null,null,10,0,10,0,10,1.4629823512326275E-2,10,0]
[15,0,15,2.2156346995723199E-34,15,1.2137079969508082E-2,15,0,null,null,15,0,15,0,15,9.1409092208746979E-3,15,0]
[20,0,20,0,20,7.5798630191818619E-3,20,0,null,null,20,0,20,0,20,5.7086944984073087E-3,20,0]
[30,5.3647716598688425E-35,30,4.5686083180112379E-25,30,2.9563439411843216E-3,30,0,null,null,30,0,30,0,30,2.2265394954324256E-3,30,0]
[40,0,40,4.8532473795992992E-22,40,1.1530511223082241E-3,40,0,null,null,40,0,40,0,40,8.6840838424708997E-4,40,0]
[50,0,50,0,50,4.4971996616477222E-4,50,0,null,null,50,0,50,3.4631013316863366E-30,50,3.3870189129648129E-4,50,0]
[60,1.2513928965520281E-25,60,0,60,1.7540249274100594E-4,60,0,null,null,60,0,60,0,60,1.3210256238613575E-4,60,0]
[70,0,70,2.084245478128227E-17,70,6.8411525012207732E-5,70,0,null,null,70,3.7970734498077121E-40,70,2.8225004600290184E-25,70,5.1523437886495687E-5,70,0]
[80,2.5711656554896475E-23,80,2.1663966368010263E-15,80,2.6682251866785386E-5,80,0,null,null,80,5.820158369946481E-37,80,0,80,2.0095473922182958E-5,80,0]
[90,0,90,8.0403770550677223E-14,90,1.0406740414405505E-5,90,0,null,null,90,5.9190916180298463E-34,90,1.4115963576424214E-22,90,7.8377430440101197E-6,90,0]
[100,5.2906437616717399E-22,100,1.4297713199573885E-12,100,4.0588602354075E-6,100,0,null,null,100,8.0429115125820085E-32,100,0,100,3.0569030514908819E-6,100,0]
[120,0,120,1.0364691532869003E-10,120,6.1736719052365017E-7,120,0,null,null,120,0,120,5.9321784293760631E-20,120,4.6497688480366211E-7,120,0]
[140,1.6144556674785536E-18,140,2.1250487633871033E-9,140,9.3836126154092605E-8,140,0,null,null,140,5.5685299879039413E-27,140,0,140,7.0682943594918385E-8,140,0]
[160,1.3067273458529965E-16,160,1.9785769104925917E-8,160,1.4190069862460018E-8,160,0,null,null,160,0,160,3.6237317313838138E-18,160,1.0696617791535044E-8,160,0]
[180,3.9465488434188281E-15,180,1.0888911633067685E-7,180,2.070898910462144E-9,180,0,null,null,180,3.2767559311454114E-24,180,0,180,1.5676539294960113E-9,180,0]
[200,5.9113074777153441E-14,200,4.1503961505162133E-7,200,2.2575279433114267E-10,200,0,null,null,200,0,200,2.1573083350420022E-16,200,1.7672989012085987E-10,200,0]
[250,7.2350259593340185E-12,250,4.2301854123120086E-6,250,0,250,0,null,null,250,0,250,3.8233084105625244E-13,250,0,250,0]
[]
[]
["Pollutant Linkage: Infill, Geo Barrier, Sst Unsaturated, Sst Saturated, Principal Aquifer",null,null,null,null,null,null,null,null,null,"Pollutant Linkage: Infill, Geo Barrier, Sst Unsaturated, Sst Saturated, Principal Aquifer at Site Boundary"]
["Remedial Target Concentrations in mg/L in Infill",null,null,null,null,null,null,null,null,null,"Remedial Target Concentrations in mg/L in Infill"]
[]
[null,"Species1",null,"Species2",null,"Species3",null,"Species4",null,null,null,"Species1",null,"Species2",null,"Species3",null,"Species4"]
["Time(years)","Hg","Time(years)","Pb","Time(years)","Benzene","Time(years)","BaP",null,null,"Time(years)","Hg","Time(years)","Pb","Time(years)","Benzene","Time(years)","BaP"]
[1,1E+40,1,1E+40,1,119.70525570105175,1,1E+40,null,null,1,1E+40,1,1E+40,1,15784.073049838949,1,1E+40]
[2,1E+40,2,1E+40,2,0.96899675707319965,2,1E+40,null,null,2,1E+40,2,1E+40,2,4.2623911707926707,2,1E+40]
[5,1E+40,5,1E+40,5,0.20818690874508783,5,1E+40,null,null,5,1E+40,5,1E+40,5,0.29115006372081037,5,1E+40]
[10,1E+40,10,1E+40,10,0.30881600470151888,10,1E+40,null,null,10,1E+40,10,1E+40,10,0.41012114704902175,10,1E+40]
[15,1E+40,15,4.5133793950466125E+29,15,0.49435284393558965,15,1E+40,null,null,15,1E+40,15,1E+40,15,0.6563898464605753,15,1E+40]
[20,1E+40,20,1E+40,20,0.79157103298782494,20,1E+40,null,null,20,1E+40,20,1E+40,20,1.0510283921611085,20,1E+40]
[30,1.8640122327675135E+27,30,2.1888503684100247E+20,30,2.029533815878128,30,1E+40,null,null,30,1E+40,30,1E+40,30,2.6947646840797295,30,1E+40]
[40,1E+40,40,2.0604760519801971E+17,40,5.2035854125782031,40,1E+40,null,null,40,1E+40,40,1E+40,40,6.9091916992510383,40,1E+40]
[50,1E+40,50,1E+40,50,13.341635798757641,50,1E+40,null,null,50,1E+40,50,2.8875851562595082E+25,50,17.714692932576291,50,1E+40]
[60,7.9910953846334541E+17,60,1E+40,60,34.207039513739524,60,1E+40,null,null,60,1E+40,60,1E+40,60,45.419255248524266,60,1E+40]
[70,1E+40,70,4797899338124.3076,70,87.704520531143359,70,1E+40,null,null,70,2.633607206230475E+32,70,3.5429577927853336E+20,70,116.4518565942317,70,1E+40]
[80,3889286549331891,80,46159598986.297981,80,224.86857668369899,80,1E+40,null,null,80,1.7181663048271924E+29,80,1E+40,80,298.57469513952248,80,1E+40]
[90,1E+40,90,1243722767.1676366,90,576.54940558472219,90,1E+40,null,null,90,1.6894484230552379E+26,90,7.0841780979808614E+17,90,765.52649995146396,90,1E+40]
[100,189012915071798.31,100,69941254.663704053,100,1478.2475010247831,100,1E+40,null,null,100,1.2433308490782723E+24,100,1E+40,100,1962.7707843314627,100,1E+40]
[120,1E+40,120,964814.04856936878,120,9718.6894478645791,120,1E+40,null,null,120,1E+40,120,1685721378588368.8,120,12903.867258978946,120,1E+40]
[140,61940381525.730812,140,47057.743672954857,140,63941.258510044681,140,1E+40,null,null,140,1.7958060783945093E+19,140,1E+40,140,84886.10822981286,140,1E+40]
[160,765270584.69663155,160,5054.1376213221729,160,422830.89922432759,160,1E+40,null,null,160,1E+40,160,27595861783568.75,160,560924.96870816546,160,1E+40]
[180,25338594.292772446,180,918.36542870196342,180,2897292.5572021445,180,1E+40,null,null,180,3.0517988553710912E+16,180,1E+40,180,3827375.3454813552,180,1E+40]
[200,1691673.1260720838,200,240.94085570015363,200,26577744.110661924,200,1E+40,null,null,200,1E+40,200,463540599995.19275,200,33950114.470714569,200,1E+40]
[250,13821.650476732357,250,23.639625749960921,250,1E+40,250,1E+40,null,null,250,1E+40,250,261553579.41758871,250,1E+40,250,1E+40]
[]
["Compared with source concentrations in mg/L",null,null,null,null,null,null,null,null,null,"Compared with source concentrations in mg/L"]
[null,0.01,null,0.5,null,6,null,100,null,null,null,0.01,null,0.5,null,6,null,100]
[]
[]
["Pollutant Linkage: Infill, Geo Barrier, Sst Unsaturated, Sst Saturated, Principal Aquifer",null,null,null,null,null,null,null,null,null,"Pollutant Linkage: Infill, Geo Barrier, Sst Unsaturated, Sst Saturated, Principal Aquifer at Site Boundary"]
["Dilution Factor",null,null,null,null,null,null,null,null,null,"Dilution Factor"]
[]
[null,12.83921468512464,"for all species and timeslices",null,null,null,null,null,null,null,null,12.83921468512464,"for all species and timeslices"]
[]
[]
["Pollutant Linkage: Infill, Geo Barrier, Sst Unsaturated, Sst Saturated, Principal Aquifer",null,null,null,null,null,null,null,null,null,"Pollutant Linkage: Infill, Geo Barrier, Sst Unsaturated, Sst Saturated, Principal Aquifer at Site Boundary"]
["Attenuation Factor",null,null,null,null,null,null,null,null,null,"Attenuation Factor"]
[]
[null,"Species1",null,"Species2",null,"Species3",null,"Species4",null,null,null,"Species1",null,"Species2",null,"Species3",null,"Species4"]
["Time(years)","Hg","Time(years)","Pb","Time(years)","Benzene","Time(years)","BaP",null,null,"Time(years)","Hg","Time(years)","Pb","Time(years)","Benzene","Time(years)","BaP"]
[1,1E+40,1,3.8943191796558557E-2,1,1E+40,1,7.7886383593117108,null,null,1,1E+40,1,3.8943191796558557E-2,1,1E+40,1,7.7886383593117108]
[2,1E+40,2,1.9471595898279279E-2,2,1E+40,2,3.8943191796558554,null,null,2,1E+40,2,1.9471595898279279E-2,2,1E+40,2,3.8943191796558554]
[5,1E+40,5,7.7886383593117111E-3,5,1E+40,5,1.5577276718623423,null,null,5,1E+40,5,7.7886383593117111E-3,5,1E+40,5,1.5577276718623423]
[10,1E+40,10,3.8943191796558555E-3,10,1E+40,10,0.77886383593117114,null,null,10,1E+40,10,3.8943191796558555E-3,10,1E+40,10,0.77886383593117114]
[15,1E+40,15,2.596212786437237E-3,15,2.1091847931832279E+33,15,0.51924255728744739,null,null,15,1E+40,15,2.596212786437237E-3,15,1E+40,15,0.51924255728744739]
[20,1E+40,20,1.9471595898279278E-3,20,1E+40,20,0.38943191796558557,null,null,20,1E+40,20,1.9471595898279278E-3,20,1E+40,20,0.38943191796558557]
[30,1.4518117178359324E+31,30,1.2981063932186185E-3,30,1.0228898365315133E+24,30,0.2596212786437237,null,null,30,1E+40,30,1.2981063932186185E-3,30,1E+40,30,0.2596212786437237]
[40,1E+40,40,9.7357979491396389E-4,40,9.6289816901376685E+20,40,0.19471595898279279,null,null,40,1E+40,40,9.7357979491396389E-4,40,1E+40,40,0.19471595898279279]
[50,1E+40,50,7.7886383593117115E-4,50,1E+40,50,0.15577276718623423,null,null,50,1E+40,50,7.7886383593117115E-4,50,1.3494213908293142E+29,50,0.15577276718623423]
[60,6.2239752045674889E+21,60,6.4905319660930926E-4,60,1E+40,60,0.12981063932186185,null,null,60,1E+40,60,6.4905319660930926E-4,60,1E+40,60,0.12981063932186185]
[70,1E+40,70,5.563313113794079E-4,70,2.2421461697418748E+16,70,0.11126626227588159,null,null,70,2.0512214109806427E+36,70,5.563313113794079E-4,70,1.6556890182186124E+24,70,0.11126626227588159]
[80,3.0292246408481444E+19,80,4.8678989745698194E-4,80,215712253989075.84,80,9.7357979491396393E-2,null,null,80,1.3382175989453928E+33,80,4.8678989745698194E-4,80,1E+40,80,9.7357979491396393E-2]
[90,1E+40,90,4.327021310728728E-4,90,5812144111626.6963,90,8.6540426214574556E-2,null,null,90,1.3158502793886706E+30,90,4.327021310728728E-4,90,3.3105660766877762E+21,90,8.6540426214574556E-2]
[100,1.472153240733535E+18,100,3.8943191796558558E-4,100,326848283383.26868,100,7.7886383593117114E-2,null,null,100,9.6838543444466308E+27,100,3.8943191796558558E-4,100,1E+40,100,7.7886383593117114E-2]
[120,1E+40,120,3.2452659830465463E-4,120,4508752624.9741306,120,6.4905319660930924E-2,null,null,120,1E+40,120,3.2452659830465463E-4,120,7.8776845154311117E+18,120,6.4905319660930924E-2]
[140,482431231541709.38,140,2.7816565568970395E-4,140,219909448.48430049,140,5.5633131137940793E-2,null,null,140,1.3986884108068608E+23,140,2.7816565568970395E-4,140,1E+40,140,5.5633131137940793E-2]
[160,5960415831221.085,160,2.4339494872849097E-4,160,23618910.09040219,160,4.8678989745698197E-2,null,null,160,1E+40,160,2.4339494872849097E-4,160,1.2896051258746059E+17,160,4.8678989745698197E-2]
[180,197353147479.72424,180,2.163510655364364E-4,180,4291689.7235123133,180,4.3270213107287278E-2,null,null,180,2.3769357629846851E+20,180,2.163510655364364E-4,180,1E+40,180,4.3270213107287278E-2]
[200,13175830201.141787,200,1.9471595898279279E-4,200,1125960.7146189625,200,3.8943191796558557E-2,null,null,200,1E+40,200,1.9471595898279279E-4,200,2166210058932554.5,200,3.8943191796558557E-2]
[250,107651837.09207663,250,1.5577276718623423E-4,250,110472.29754955108,250,3.1154553437246844E-2,null,null,250,1E+40,250,1.5577276718623423E-4,250,1222287745000.2678,250,3.1154553437246844E-2]
[]
[]
["Saved  19/07/2022: 16:13:23  Level Number: 5"]
[]
["BREAKTHROUGH RESULTS"]
[]
["Advanced"]
["Pollutant Linkage: Infill, Geo Barrier, Sst Unsaturated, Sst Saturated, Principal Aquifer",null,null,null,null,null,null,null,null,null,"Pollutant Linkage: Infill, Geo Barrier, Sst Unsaturated, Sst Saturated, Principal Aquifer at Site Boundary"]
["Concentrations in mg/L in Principal Aquifer",null,null,null,null,null,null,null,null,null,"Concentrations in mg/L in Principal Aquifer at Site Boundary"]
[]
["Compared with MRV target concentration in mg/L",null,null,null,null,null,null,null,null,null,"Compared with MRV target concentration in mg/L"]
[null,1.0000000000000001E-5,null,2.0000000000000001E-4,null,1E-3,null,4.9999999999999998E-8,null,null,null,1.0000000000000001E-5,null,2.0000000000000001E-4,null,1E-3,null,4.9999999999999998E-8]
[]
[null,"Species1",null,"Species2",null,"Species3",null,"Species4",null,null,null,"Species1",null,"Species2",null,"Species3",null,"Species4"]
["Time(years)","Hg","Time(years)","Pb","Time(years)","Benzene","Time(years)","BaP",null,null,"Time(years)","Hg","Time(years)","Pb","Time(years)","Benzene","Time(years)","BaP"]
[1,0,1,0,1,1.6012553920717659E-7,1,0,null,null,1,0,1,0,1,2.5748151318858809E-10,1,0]
[2,0,2,0,2,3.8254770945769372E-4,2,0,null,null,2,0,2,0,2,4.6528795075267863E-5,2,0]
[5,0,5,0,5,9.5409411062504102E-3,5,0,null,null,5,0,5,0,5,6.2502846049577229E-3,5,0]
[10,0,10,0,10,7.920587996550519E-3,10,0,null,null,10,0,10,0,10,5.954461123788661E-3,10,0]
[15,0,15,0,15,4.9621686199568041E-3,15,0,null,null,15,0,15,0,15,3.737148370571828E-3,15,0]
[20,0,20,0,20,3.0990549360140579E-3,20,0,null,null,20,0,20,0,20,2.3340205265970637E-3,20,0]
[30,0,30,0,30,1.2087123393918924E-3,30,0,null,null,30,0,30,0,30,9.1032904844672144E-4,30,0]
[40,0,40,0,40,4.7142928575146664E-4,40,0,null,null,40,0,40,0,40,3.5505203127455853E-4,40,0]
[50,9.8106934518258038E-34,50,1.5161846028887559E-23,50,1.8386970114529877E-4,50,0,null,null,50,0,50,0,50,1.3847954015619638E-4,50,0]
[60,0,60,1.2935064694182259E-22,60,7.1713975534142964E-5,60,0,null,null,60,0,60,9.6117449976819188E-32,60,5.4010630673958464E-5,60,0]
[70,7.0932375507512127E-29,70,0,70,2.7970320061216579E-5,70,0,null,null,70,0,70,3.7279116723156092E-29,70,2.106555583794009E-5,70,0]
[80,0,80,2.5014088643407461E-20,80,1.090915246382051E-5,80,0,null,null,80,0,80,0,80,8.2161171453358958E-6,80,0]
[90,2.8250754818579891E-26,90,8.9903319061390125E-21,90,4.2548498029554899E-6,90,0,null,null,90,0,90,2.2540327293302733E-25,90,3.2044994615639546E-6,90,0]
[100,4.3092819460194996E-27,100,8.6011736429606958E-19,100,1.6594955435045326E-6,100,0,null,null,100,0,100,0,100,1.2498359537021924E-6,100,0]
[120,1.2681306885629785E-23,120,1.0238345261148432E-15,120,2.5242764284652082E-7,120,0,null,null,120,2.1412093241987813E-33,120,3.7145340201885147E-22,120,1.9011765235039531E-7,120,0]
[140,0,140,1.1543183277579133E-13,140,3.8378500137368516E-8,140,0,null,null,140,3.6712675582274872E-31,140,0,140,2.8908503112211773E-8,140,0]
[160,8.6892581326833576E-22,160,3.8909072287199395E-12,160,5.8132717543343307E-9,160,0,null,null,160,0,160,6.2090080965834005E-20,160,4.3819532176976921E-9,160,0]
[180,0,180,5.8611212215265101E-11,180,8.5671071108672703E-10,180,0,null,null,180,3.6036132197777955E-27,180,0,180,6.4852919349935764E-10,180,0]
[200,5.5990772105301151E-20,200,5.0248411820019256E-10,200,1.0095165697536E-10,200,0,null,null,200,0,200,2.3531585014800777E-18,200,7.8921430028777545E-11,200,0]
[250,1.1675451214880728E-16,250,2.2362488090216611E-8,250,0,250,0,null,null,250,0,250,5.4894913131389397E-17,250,0,250,0]
[]
[]
["Pollutant Linkage: Infill, Geo Barrier, Sst Unsaturated, Sst Saturated, Principal Aquifer",null,null,null,null,null,null,null,null,null,"Pollutant Linkage: Infill, Geo Barrier, Sst Unsaturated, Sst Saturated, Principal Aquifer at Site Boundary"]
["Remedial Target Concentrations in mg/L in Infill",null,null,null,null,null,null,null,null,null,"Remedial Target Concentrations in mg/L in Infill"]
[]
[null,"Species1",null,"Species2",null,"Species3",null,"Species4",null,null,null,"Species1",null,"Species2",null,"Species3",null,"Species4"]
["Time(years)","Hg","Time(years)","Pb","Time(years)","Benzene","Time(years)","BaP",null,null,"Time(years)","Hg","Time(years)","Pb","Time(years)","Benzene","Time(years)","BaP"]
[1,1E+40,1,1E+40,1,37470.599816291447,1,1E+40,null,null,1,1E+40,1,1E+40,1,23302643.850804929,1,1E+40]
[2,1E+40,2,1E+40,2,15.68431819525388,2,1E+40,null,null,2,1E+40,2,1E+40,2,128.95240442599101,2,1E+40]
[5,1E+40,5,1E+40,5,0.6288687806771297,5,1E+40,null,null,5,1E+40,5,1E+40,5,0.95995628666905874,5,1E+40]
[10,1E+40,10,1E+40,10,0.75751951782027416,10,1E+40,null,null,10,1E+40,10,1E+40,10,1.0076478585155937,10,1E+40]
[15,1E+40,15,1E+40,15,1.20914875320223,15,1E+40,null,null,15,1E+40,15,1E+40,15,1.6055022185490402,15,1E+40]
[20,1E+40,20,1E+40,20,1.9360741012603924,20,1E+40,null,null,20,1E+40,20,1E+40,20,2.5706714793754757,20,1E+40]
[30,1E+40,30,1E+40,30,4.9639602446837117,30,1E+40,null,null,30,1E+40,30,1E+40,30,6.5910233340765023,30,1E+40]
[40,1E+40,40,1E+40,40,12.727253442551609,40,1E+40,null,null,40,1E+40,40,1E+40,40,16.898931625489713,40,1E+40]
[50,1.0192959395891599E+26,50,6.5955029360852255E+18,50,32.631803731810272,50,1E+40,null,null,50,1E+40,50,1E+40,50,43.327700202010853,50,1E+40]
[60,1E+40,60,7.7309238387479053E+17,60,83.665700518072725,60,1E+40,null,null,60,1E+40,60,1.0403938101158237E+27,60,111.08924160170814,60,1E+40]
[70,1.4097934727902839E+21,70,1E+40,70,214.51309770028524,70,1E+40,null,null,70,1E+40,70,2.6824669892965718E+24,70,284.82514518765788,70,1E+40]
[80,1E+40,80,3997747086674505.5,80,549.99689663322681,80,1E+40,null,null,80,1E+40,80,1E+40,80,730.27196349142423,80,1E+40]
[90,3.5397284299898506E+18,90,1.1123059865199794E+16,90,1410.1555349456282,90,1E+40,null,null,90,1E+40,90,4.4364928112517861E+20,90,1872.3672985333262,90,1E+40]
[100,2.3205722264789471E+19,100,116263203315097.83,100,3615.5565608384609,100,1E+40,null,null,100,1E+40,100,1E+40,100,4800.6300204656009,100,1E+40]
[120,7885622586211371,120,97672033369.95401,120,23769.187606953474,120,1E+40,null,null,120,4.6702580112021034E+25,120,2.6921277192912867E+17,120,31559.405062196605,120,1E+40]
[140,1E+40,140,866312156.66682434,140,156337.53217359056,140,1E+40,null,null,140,2.7238548652193764E+23,140,1E+40,140,207551.38986997324,140,1E+40]
[160,115084623420110.88,160,25700946.879912831,160,1032121.0247097852,160,1E+40,null,null,160,1E+40,160,1610563208236537.8,160,1369252.4091237197,160,1E+40]
[180,1E+40,180,1706158.1943182421,180,7003530.9730037972,180,1E+40,null,null,180,2.7749925949646217E+19,180,1E+40,180,9251703.793972604,180,1E+40]
[200,1786008591057.313,200,199011.26498919399,200,59434388.496114172,200,1E+40,null,null,200,1E+40,200,42496074929547.891,200,76024978.232302532,200,1E+40]
[250,856497947.35596061,250,4471.7743212012756,250,1E+40,250,1E+40,null,null,250,1E+40,250,1821662414523.7808,250,1E+40,250,1E+40]
[]
["Compared with source concentrations in mg/L",null,null,null,null,null,null,null,null,null,"Compared with source concentrations in mg/L"]
[null,0.01,null,0.5,null,6,null,100,null,null,null,0.01,null,0.5,null,6,null,100]
[]
[]
["Pollutant Linkage: Infill, Geo Barrier, Sst Unsaturated, Sst Saturated, Principal Aquifer",null,null,null,null,null,null,null,null,null,"Pollutant Linkage: Infill, Geo Barrier, Sst Unsaturated, Sst Saturated, Principal Aquifer at Site Boundary"]
["Dilution Factor",null,null,null,null,null,null,null,null,null,"Dilution Factor"]
[]
[null,12.83921468512464,"for all species and timeslices",null,null,null,null,null,null,null,null,12.83921468512464,"for all species and timeslices"]
[]
[]
["Pollutant Linkage: Infill, Geo Barrier, Sst Unsaturated, Sst Saturated, Principal Aquifer",null,null,null,null,null,null,null,null,null,"Pollutant Linkage: Infill, Geo Barrier, Sst Unsaturated, Sst Saturated, Principal Aquifer at Site Boundary"]
["Attenuation Factor",null,null,null,null,null,null,null,null,null,"Attenuation Factor"]
[]
[null,"Species1",null,"Species2",null,"Species3",null,"Species4",null,null,null,"Species1",null,"Species2",null,"Species3",null,"Species4"]
["Time(years)","Hg","Time(years)","Pb","Time(years)","Benzene","Time(years)","BaP",null,null,"Time(years)","Hg","Time(years)","Pb","Time(years)","Benzene","Time(years)","BaP"]
[1,1E+40,1,3.8943191796558557E-2,1,1E+40,1,7.7886383593117108,null,null,1,1E+40,1,3.8943191796558557E-2,1,1E+40,1,7.7886383593117108]
[2,1E+40,2,1.9471595898279279E-2,2,1E+40,2,3.8943191796558554,null,null,2,1E+40,2,1.9471595898279279E-2,2,1E+40,2,3.8943191796558554]
[5,1E+40,5,7.7886383593117111E-3,5,1E+40,5,1.5577276718623423,null,null,5,1E+40,5,7.7886383593117111E-3,5,1E+40,5,1.5577276718623423]
[10,1E+40,10,3.8943191796558555E-3,10,1E+40,10,0.77886383593117114,null,null,10,1E+40,10,3.8943191796558555E-3,10,1E+40,10,0.77886383593117114]
[15,1E+40,15,2.596212786437237E-3,15,1E+40,15,0.51924255728744739,null,null,15,1E+40,15,2.596212786437237E-3,15,1E+40,15,0.51924255728744739]
[20,1E+40,20,1.9471595898279278E-3,20,1E+40,20,0.38943191796558557,null,null,20,1E+40,20,1.9471595898279278E-3,20,1E+40,20,0.38943191796558557]
[30,1E+40,30,1.2981063932186185E-3,30,1E+40,30,0.2596212786437237,null,null,30,1E+40,30,1.2981063932186185E-3,30,1E+40,30,0.2596212786437237]
[40,1E+40,40,9.7357979491396389E-4,40,1E+40,40,0.19471595898279279,null,null,40,1E+40,40,9.7357979491396389E-4,40,1E+40,40,0.19471595898279279]
[50,7.938927454574803E+29,50,7.7886383593117115E-4,50,3.0821992300167838E+22,50,0.15577276718623423,null,null,50,1E+40,50,7.7886383593117115E-4,50,1E+40,50,0.15577276718623423]
[60,1E+40,60,6.4905319660930926E-4,60,3.6128021978033564E+21,60,0.12981063932186185,null,null,60,1E+40,60,6.4905319660930926E-4,60,4.8619506829551407E+30,60,0.12981063932186185]
[70,1.0980371520881676E+25,70,5.563313113794079E-4,70,1E+40,70,0.11126626227588159,null,null,70,1E+40,70,5.563313113794079E-4,70,1.2535659174253605E+28,70,0.11126626227588159]
[80,1E+40,80,4.8678989745698194E-4,80,1.8682203786059813E+19,80,9.7357979491396393E-2,null,null,80,1E+40,80,4.8678989745698194E-4,80,1E+40,80,9.7357979491396393E-2]
[90,2.7569664631365167E+22,90,4.327021310728728E-4,90,5.1980094443409392E+19,90,8.6540426214574556E-2,null,null,90,1E+40,90,4.327021310728728E-4,90,2.0732542854315784E+24,90,8.6540426214574556E-2]
[100,1.8074097858707311E+23,100,3.8943191796558558E-4,100,5.4331922706985645E+17,100,7.7886383593117114E-2,null,null,100,1E+40,100,3.8943191796558558E-4,100,1E+40,100,7.7886383593117114E-2]
[120,6.1418262562020696E+19,120,3.2452659830465463E-4,120,456439287442318.31,120,6.4905319660930924E-2,null,null,120,3.6374950693931524E+29,120,3.2452659830465463E-4,120,1.2580805533583079E+21,120,6.4905319660930924E-2]
[140,1E+40,140,2.7816565568970395E-4,140,4048435256731.9707,140,5.5633131137940793E-2,null,null,140,2.1215120488445462E+27,140,2.7816565568970395E-4,140,1E+40,140,5.5633131137940793E-2]
[160,8.9635251253681843E+17,160,2.4339494872849097E-4,160,120105228443.71301,160,4.8678989745698197E-2,null,null,160,1E+40,160,2.4339494872849097E-4,160,7.5264566302603397E+18,160,4.8678989745698197E-2]
[180,1E+40,180,2.163510655364364E-4,180,7973189495.592638,180,4.3270213107287278E-2,null,null,180,2.1613413771947397E+23,180,2.163510655364364E-4,180,1E+40,180,4.3270213107287278E-2]
[200,1.3910575022369248E+16,200,1.9471595898279279E-4,200,930016063.45799041,200,3.8943191796558557E-2,null,null,200,1E+40,200,1.9471595898279279E-4,200,1.9859193558987683E+17,200,3.8943191796558557E-2]
[250,6670952767448.377,250,1.5577276718623423E-4,250,20897419.807376005,250,3.1154553437246844E-2,null,null,250,1E+40,250,1.5577276718623423E-4,250,8512961855685785,250,3.1154553437246844E-2]
[]
[]
["Saved  19/07/2022: 16:14:57  Level Number: 5"]
[]
["BREAKTHROUGH RESULTS"]
[]
["Advanced"]
["Pollutant Linkage: Infill, Geo Barrier, Sst Unsaturated, Sst Saturated, Principal Aquifer",null,null,null,null,null,null,null,null,null,"Pollutant Linkage: Infill, Geo Barrier, Sst Unsaturated, Sst Saturated, Principal Aquifer at Site Boundary"]
["Concentrations in mg/L in Principal Aquifer",null,null,null,null,null,null,null,null,null,"Concentrations in mg/L in Principal Aquifer at Site Boundary"]
[]
["Compared with MRV target concentration in mg/L",null,null,null,null,null,null,null,null,null,"Compared with MRV target concentration in mg/L"]
[null,1.0000000000000001E-5,null,2.0000000000000001E-4,null,1E-3,null,4.9999999999999998E-8,null,null,null,1.0000000000000001E-5,null,2.0000000000000001E-4,null,1E-3,null,4.9999999999999998E-8]
[]
[null,"Species1",null,"Species2",null,"Species3",null,"Species4",null,null,null,"Species1",null,"Species2",null,"Species3",null,"Species4"]
["Time(years)","Hg","Time(years)","Pb","Time(years)","Benzene","Time(years)","BaP",null,null,"Time(years)","Hg","Time(years)","Pb","Time(years)","Benzene","Time(years)","BaP"]
[1,0,1,0,1,1.9230225451233816E-14,1,0,null,null,1,0,1,0,1,0,1,0]
[2,0,2,0,2,1.2656117055721311E-7,2,0,null,null,2,0,2,0,2,3.7904654296092921E-9,2,0]
[5,0,5,0,5,3.6385364589223182E-4,5,0,null,null,5,0,5,0,5,1.7910500169680555E-4,5,0]
[10,0,10,0,10,8.5848972478309643E-4,10,0,null,null,10,0,10,0,10,6.3184821526593167E-4,10,0]
[15,0,15,0,15,5.6983478628073634E-4,15,0,null,null,15,0,15,0,15,4.2883598452655969E-4,15,0]
[20,0,20,0,20,3.5651078717028326E-4,20,0,null,null,20,0,20,0,20,2.6849739375735889E-4,20,0]
[30,0,30,0,30,1.3905433356377843E-4,30,0,null,null,30,0,30,0,30,1.0472731530027102E-4,30,0]
[40,0,40,1.5779927773499538E-36,40,5.423481131731026E-5,40,0,null,null,40,0,40,0,40,4.0846380575211504E-5,40,0]
[50,0,50,1.2096875616398481E-31,50,2.1152988512712959E-5,50,0,null,null,50,0,50,0,50,1.5931151853856398E-5,50,0]
[60,0,60,0,60,8.2502165563673096E-6,60,0,null,null,60,0,60,0,60,6.2135641348127466E-6,60,0]
[70,0,70,7.4053442181609806E-27,70,3.2177997417517199E-6,70,0,null,null,70,0,70,0,70,2.4234520865903466E-6,70,0]
[80,7.284299402051993E-37,80,0,80,1.2550262253555851E-6,80,0,null,null,80,0,80,0,80,9.452098075747421E-7,80,0]
[90,3.4305626110937598E-34,90,3.6730206423366507E-24,90,4.8949341019455283E-7,90,0,null,null,90,0,90,1.8505245943959766E-32,90,3.6865685052757948E-7,90,0]
[100,5.7617903999257181E-33,100,0,100,1.9091556843450504E-7,100,0,null,null,100,0,100,3.0454751354689721E-30,100,1.4378614373577801E-7,100,0]
[120,3.4388313750308366E-31,120,9.5888726747214172E-22,120,2.9042270899084478E-8,120,0,null,null,120,0,120,0,120,2.1873073468099179E-8,120,0]
[140,0,140,0,140,4.4175131409371021E-9,140,0,null,null,140,2.6574832362824926E-38,140,2.3154865682351115E-25,140,3.3272552803813092E-9,140,0]
[160,4.5171069534677349E-27,160,4.7324483309745969E-20,160,6.7107539870552935E-10,160,0,null,null,160,7.4777097447461111E-36,160,0,160,5.05692132696934E-10,160,0]
[180,0,180,0,180,1.0072634917563889E-10,180,0,null,null,180,2.2751428142425437E-33,180,1.3859770187181829E-22,180,7.6142431461810072E-11,180,0]
[200,0,200,7.0143580179430826E-18,200,1.3610920283129755E-11,200,0,null,null,200,1.0591534783359295E-31,200,0,200,1.0522469853952316E-11,200,0]
[250,0,250,1.1967845287543042E-14,250,0,250,0,null,null,250,8.9313625138741064E-29,250,0,250,0,250,0]
[]
[]
["Pollutant Linkage: Infill, Geo Barrier, Sst Unsaturated, Sst Saturated, Principal Aquifer",null,null,null,null,null,null,null,null,null,"Pollutant Linkage: Infill, Geo Barrier, Sst Unsaturated, Sst Saturated, Principal Aquifer at Site Boundary"]
["Remedial Target Concentrations in mg/L in Infill",null,null,null,null,null,null,null,null,null,"Remedial Target Concentrations in mg/L in Infill"]
[]
[null,"Species1",null,"Species2",null,"Species3",null,"Species4",null,null,null,"Species1",null,"Species2",null,"Species3",null,"Species4"]
["Time(years)","Hg","Time(years)","Pb","Time(years)","Benzene","Time(years)","BaP",null,null,"Time(years)","Hg","Time(years)","Pb","Time(years)","Benzene","Time(years)","BaP"]
[1,1E+40,1,1E+40,1,312008822528.65314,1,1E+40,null,null,1,1E+40,1,1E+40,1,1E+40,1,1E+40]
[2,1E+40,2,1E+40,2,47407.905391390537,2,1E+40,null,null,2,1E+40,2,1E+40,2,1582919.0666483559,2,1E+40]
[5,1E+40,5,1E+40,5,16.490146705241791,5,1E+40,null,null,5,1E+40,5,1E+40,5,33.499901974580162,5,1E+40]
[10,1E+40,10,1E+40,10,6.9890178377102217,10,1E+40,null,null,10,1E+40,10,1E+40,10,9.4959514880875719,10,1E+40]
[15,1E+40,15,1E+40,15,10.529367712282879,15,1E+40,null,null,15,1E+40,15,1E+40,15,13.991363170290095,15,1E+40]
[20,1E+40,20,1E+40,20,16.829785285386524,20,1E+40,null,null,20,1E+40,20,1E+40,20,22.346585626161424,20,1E+40]
[30,1E+40,30,1E+40,30,43.148601314521777,30,1E+40,null,null,30,1E+40,30,1E+40,30,57.291643376868585,30,1E+40]
[40,1E+40,40,6.3371646204831049E+31,40,110.63005206925031,40,1E+40,null,null,40,1E+40,40,1E+40,40,146.89183999919024,40,1E+40]
[50,1E+40,50,8.2665973571258646E+26,50,283.64786358173438,50,1E+40,null,null,50,1E+40,50,1E+40,50,376.62060188997577,50,1E+40]
[60,1E+40,60,1E+40,60,727.25363740535408,60,1E+40,null,null,60,1E+40,60,1E+40,60,965.62936662772813,60,1E+40]
[70,1E+40,70,1.35037612100135E+22,70,1864.6281563605614,70,1E+40,null,null,70,1E+40,70,1E+40,70,2475.8071484886027,70,1E+40]
[80,1.3728156200146019E+29,80,1E+40,80,4780.7765915808077,80,1E+40,null,null,80,1E+40,80,1E+40,80,6347.7970202140041,80,1E+40]
[90,2.9149737619310554E+26,90,2.7225548053654118E+19,90,12257.570531164567,90,1E+40,null,null,90,1E+40,90,5.4038730586361469E+27,90,16275.297723108866,90,1E+40]
[100,1.7355716376161344E+25,100,1E+40,100,31427.505096622561,100,1E+40,null,null,100,1E+40,100,3.2835598897313285E+25,100,41728.638407784441,100,1E+40]
[120,2.9079646279283844E+23,120,1.0428754598402806E+17,120,206595.41469221481,120,1E+40,null,null,120,1E+40,120,1E+40,120,274309.87276436988,120,1E+40]
[140,1E+40,140,1E+40,140,1358230.2550269719,140,1E+40,null,null,140,3.7629588264078116E+30,140,4.3187467105983286E+20,140,1803288.1442485501,140,1E+40]
[160,2.2138063373334802E+19,160,2113071142171479,160,8940873.1292693764,160,1E+40,null,null,160,1.337307857800454E+28,160,1E+40,160,11864926.527531832,160,1E+40]
[180,1E+40,180,1E+40,180,59567333.166594371,180,1E+40,null,null,180,4.3953284767001627E+25,180,7.21512684910784E+17,180,78799690.065182045,180,1E+40]
[200,1E+40,200,14256472188074.082,200,440822506.86875182,200,1E+40,null,null,200,9.4415022983367113E+23,200,1E+40,200,570208333.52602637,200,1E+40]
[250,1E+40,250,8355722989.1739073,250,1E+40,250,1E+40,null,null,250,1.1196499956715292E+21,250,1E+40,250,1E+40,250,1E+40]
[]
["Compared with source concentrations in mg/L",null,null,null,null,null,null,null,null,null,"Compared with source concentrations in mg/L"]
[null,0.01,null,0.5,null,6,null,100,null,null,null,0.01,null,0.5,null,6,null,100]
[]
[]
["Pollutant Linkage: Infill, Geo Barrier, Sst Unsaturated, Sst Saturated, Principal Aquifer",null,null,null,null,null,null,null,null,null,"Pollutant Linkage: Infill, Geo Barrier, Sst Unsaturated, Sst Saturated, Principal Aquifer at Site Boundary"]
["Dilution Factor",null,null,null,null,null,null,null,null,null,"Dilution Factor"]
[]
[null,12.83921468512464,"for all species and timeslices",null,null,null,null,null,null,null,null,12.83921468512464,"for all species and timeslices"]
[]
[]
["Pollutant Linkage: Infill, Geo Barrier, Sst Unsaturated, Sst Saturated, Principal Aquifer",null,null,null,null,null,null,null,null,null,"Pollutant Linkage: Infill, Geo Barrier, Sst Unsaturated, Sst Saturated, Principal Aquifer at Site Boundary"]
["Attenuation Factor",null,null,null,null,null,null,null,null,null,"Attenuation Factor"]
[]
[null,"Species1",null,"Species2",null,"Species3",null,"Species4",null,null,null,"Species1",null,"Species2",null,"Species3",null,"Species4"]
["Time(years)","Hg","Time(years)","Pb","Time(years)","Benzene","Time(years)","BaP",null,null,"Time(years)","Hg","Time(years)","Pb","Time(years)","Benzene","Time(years)","BaP"]
[1,1E+40,1,3.8943191796558557E-2,1,1E+40,1,7.7886383593117108,null,null,1,1E+40,1,3.8943191796558557E-2,1,1E+40,1,7.7886383593117108]
[2,1E+40,2,1.9471595898279279E-2,2,1E+40,2,3.8943191796558554,null,null,2,1E+40,2,1.9471595898279279E-2,2,1E+40,2,3.8943191796558554]
[5,1E+40,5,7.7886383593117111E-3,5,1E+40,5,1.5577276718623423,null,null,5,1E+40,5,7.7886383593117111E-3,5,1E+40,5,1.5577276718623423]
[10,1E+40,10,3.8943191796558555E-3,10,1E+40,10,0.77886383593117114,null,null,10,1E+40,10,3.8943191796558555E-3,10,1E+40,10,0.77886383593117114]
[15,1E+40,15,2.596212786437237E-3,15,1E+40,15,0.51924255728744739,null,null,15,1E+40,15,2.596212786437237E-3,15,1E+40,15,0.51924255728744739]
[20,1E+40,20,1.9471595898279278E-3,20,1E+40,20,0.38943191796558557,null,null,20,1E+40,20,1.9471595898279278E-3,20,1E+40,20,0.38943191796558557]
[30,1E+40,30,1.2981063932186185E-3,30,1E+40,30,0.2596212786437237,null,null,30,1E+40,30,1.2981063932186185E-3,30,1E+40,30,0.2596212786437237]
[40,1E+40,40,9.7357979491396389E-4,40,2.9614730071420651E+35,40,0.19471595898279279,null,null,40,1E+40,40,9.7357979491396389E-4,40,1E+40,40,0.19471595898279279]
[50,1E+40,50,7.7886383593117115E-4,50,3.8631322366017189E+30,50,0.15577276718623423,null,null,50,1E+40,50,7.7886383593117115E-4,50,1E+40,50,0.15577276718623423]
[60,1E+40,60,6.4905319660930926E-4,60,1E+40,60,0.12981063932186185,null,null,60,1E+40,60,6.4905319660930926E-4,60,1E+40,60,0.12981063932186185]
[70,1E+40,70,5.563313113794079E-4,70,6.3105547533177998E+25,70,0.11126626227588159,null,null,70,1E+40,70,5.563313113794079E-4,70,1E+40,70,0.11126626227588159]
[80,1.0692364398308019E+33,80,4.8678989745698194E-4,80,1E+40,80,9.7357979491396393E-2,null,null,80,1E+40,80,4.8678989745698194E-4,80,1E+40,80,9.7357979491396393E-2]
[90,2.2703676458563379E+30,90,4.327021310728728E-4,90,1.2722996875438486E+23,90,8.6540426214574556E-2,null,null,90,1E+40,90,4.327021310728728E-4,90,2.5253287796006757E+31,90,8.6540426214574556E-2]
[100,1.3517739832070468E+29,100,3.8943191796558558E-4,100,1E+40,100,7.7886383593117114E-2,null,null,100,1E+40,100,3.8943191796558558E-4,100,1.5344676307355253E+29,100,7.7886383593117114E-2]
[120,2.2649084848604618E+27,120,3.2452659830465463E-4,120,4.8735478862981104E+20,120,6.4905319660930924E-2,null,null,120,1E+40,120,3.2452659830465463E-4,120,1E+40,120,6.4905319660930924E-2]
[140,1E+40,140,2.7816565568970395E-4,140,1E+40,140,5.5633131137940793E-2,null,null,140,2.9308325459870457E+34,140,2.7816565568970395E-4,140,2.0182293776590448E+24,140,5.5633131137940793E-2]
[160,1.7242536959042901E+23,160,2.4339494872849097E-4,160,9.8747681723228344E+18,160,4.8678989745698197E-2,null,null,160,1.0415807279473586E+32,160,2.4339494872849097E-4,160,1E+40,160,4.8678989745698197E-2]
[180,1E+40,180,2.163510655364364E-4,180,1E+40,180,4.3270213107287278E-2,null,null,180,3.4233623975401995E+29,180,2.163510655364364E-4,180,3.3717608246556691E+21,180,4.3270213107287278E-2]
[200,1E+40,200,1.9471595898279279E-4,200,6.6623103691496616E+16,200,3.8943191796558557E-2,null,null,200,7.3536446970354997E+27,200,1.9471595898279279E-4,200,1E+40,200,3.8943191796558557E-2]
[250,1E+40,250,1.5577276718623423E-4,250,39047822755957.563,250,3.1154553437246844E-2,null,null,250,8.7205489052904622E+24,250,1.5577276718623423E-4,250,1E+40,250,3.1154553437246844E-2]
[]
[]
["Saved  19/07/2022: 16:24:37  Level Number: 5"]
[]
["BREAKTHROUGH RESULTS"]
[]
["Advanced"]
["Pollutant Linkage: Infill, Geo Barrier, Sst Unsaturated, Sst Saturated, Principal Aquifer",null,null,null,null,null,null,null,null,null,"Pollutant Linkage: Infill, Geo Barrier, Sst Unsaturated, Sst Saturated, Principal Aquifer at Site Boundary"]
["Concentrations in mg/L in Principal Aquifer",null,null,null,null,null,null,null,null,null,"Concentrations in mg/L in Principal Aquifer at Site Boundary"]
[]
["Compared with MRV target concentration in mg/L",null,null,null,null,null,null,null,null,null,"Compared with MRV target concentration in mg/L"]
[null,1.0000000000000001E-5,null,2.0000000000000001E-4,null,1E-3,null,4.9999999999999998E-8,null,null,null,1.0000000000000001E-5,null,2.0000000000000001E-4,null,1E-3,null,4.9999999999999998E-8]
[]
[null,"Species1",null,"Species2",null,"Species3",null,"Species4",null,null,null,"Species1",null,"Species2",null,"Species3",null,"Species4"]
["Time(years)","Hg","Time(years)","Pb","Time(years)","Benzene","Time(years)","BaP",null,null,"Time(years)","Hg","Time(years)","Pb","Time(years)","Benzene","Time(years)","BaP"]
[1,0,1,0,1,1.9230225451233816E-14,1,0,null,null,1,0,1,0,1,0,1,0]
[2,0,2,0,2,1.2656117055721311E-7,2,0,null,null,2,0,2,0,2,3.7904654296092921E-9,2,0]
[5,0,5,0,5,3.6385364589223182E-4,5,0,null,null,5,0,5,0,5,1.7910500169680555E-4,5,0]
[10,0,10,0,10,8.5848972478309643E-4,10,0,null,null,10,0,10,0,10,6.3184821526593167E-4,10,0]
[15,0,15,0,15,5.6983478628073634E-4,15,0,null,null,15,0,15,0,15,4.2883598452655969E-4,15,0]
[20,0,20,0,20,3.5651078717028326E-4,20,0,null,null,20,0,20,0,20,2.6849739375735889E-4,20,0]
[30,0,30,0,30,1.3905433356377843E-4,30,0,null,null,30,0,30,0,30,1.0472731530027102E-4,30,0]
[40,0,40,1.5779927773499538E-36,40,5.423481131731026E-5,40,0,null,null,40,0,40,0,40,4.0846380575211504E-5,40,0]
[50,0,50,1.2096875616398481E-31,50,2.1152988512712959E-5,50,0,null,null,50,0,50,0,50,1.5931151853856398E-5,50,0]
[60,0,60,0,60,8.2502165563673096E-6,60,0,null,null,60,0,60,0,60,6.2135641348127466E-6,60,0]
[70,0,70,7.4053442181609806E-27,70,3.2177997417517199E-6,70,0,null,null,70,0,70,0,70,2.4234520865903466E-6,70,0]
[80,7.284299402051993E-37,80,0,80,1.2550262253555851E-6,80,0,null,null,80,0,80,0,80,9.452098075747421E-7,80,0]
[90,3.4305626110937598E-34,90,3.6730206423366507E-24,90,4.8949341019455283E-7,90,0,null,null,90,0,90,1.8505245943959766E-32,90,3.6865685052757948E-7,90,0]
[100,5.7617903999257181E-33,100,0,100,1.9091556843450504E-7,100,0,null,null,100,0,100,3.0454751354689721E-30,100,1.4378614373577801E-7,100,0]
[120,3.4388313750308366E-31,120,9.5888726747214172E-22,120,2.9042270899084478E-8,120,0,null,null,120,0,120,0,120,2.1873073468099179E-8,120,0]
[140,0,140,0,140,4.4175131409371021E-9,140,0,null,null,140,2.6574832362824926E-38,140,2.3154865682351115E-25,140,3.3272552803813092E-9,140,0]
[160,4.5171069534677349E-27,160,4.7324483309745969E-20,160,6.7107539870552935E-10,160,0,null,null,160,7.4777097447461111E-36,160,0,160,5.05692132696934E-10,160,0]
[180,0,180,0,180,1.0072634917563889E-10,180,0,null,null,180,2.2751428142425437E-33,180,1.3859770187181829E-22,180,7.6142431461810072E-11,180,0]
[200,0,200,7.0143580179430826E-18,200,1.3610920283129755E-11,200,0,null,null,200,1.0591534783359295E-31,200,0,200,1.0522469853952316E-11,200,0]
[250,0,250,1.1967845287543042E-14,250,0,250,0,null,null,250,8.9313625138741064E-29,250,0,250,0,250,0]
[]
[]
["Pollutant Linkage: Infill, Geo Barrier, Sst Unsaturated, Sst Saturated, Principal Aquifer",null,null,null,null,null,null,null,null,null,"Pollutant Linkage: Infill, Geo Barrier, Sst Unsaturated, Sst Saturated, Principal Aquifer at Site Boundary"]
["Remedial Target Concentrations in mg/L in Infill",null,null,null,null,null,null,null,null,null,"Remedial Target Concentrations in mg/L in Infill"]
[]
[null,"Species1",null,"Species2",null,"Species3",null,"Species4",null,null,null,"Species1",null,"Species2",null,"Species3",null,"Species4"]
["Time(years)","Hg","Time(years)","Pb","Time(years)","Benzene","Time(years)","BaP",null,null,"Time(years)","Hg","Time(years)","Pb","Time(years)","Benzene","Time(years)","BaP"]
[1,1E+40,1,1E+40,1,312008822528.65314,1,1E+40,null,null,1,1E+40,1,1E+40,1,1E+40,1,1E+40]
[2,1E+40,2,1E+40,2,47407.905391390537,2,1E+40,null,null,2,1E+40,2,1E+40,2,1582919.0666483559,2,1E+40]
[5,1E+40,5,1E+40,5,16.490146705241791,5,1E+40,null,null,5,1E+40,5,1E+40,5,33.499901974580162,5,1E+40]
[10,1E+40,10,1E+40,10,6.9890178377102217,10,1E+40,null,null,10,1E+40,10,1E+40,10,9.4959514880875719,10,1E+40]
[15,1E+40,15,1E+40,15,10.529367712282879,15,1E+40,null,null,15,1E+40,15,1E+40,15,13.991363170290095,15,1E+40]
[20,1E+40,20,1E+40,20,16.829785285386524,20,1E+40,null,null,20,1E+40,20,1E+40,20,22.346585626161424,20,1E+40]
[30,1E+40,30,1E+40,30,43.148601314521777,30,1E+40,null,null,30,1E+40,30,1E+40,30,57.291643376868585,30,1E+40]
[40,1E+40,40,6.3371646204831049E+31,40,110.63005206925031,40,1E+40,null,null,40,1E+40,40,1E+40,40,146.89183999919024,40,1E+40]
[50,1E+40,50,8.2665973571258646E+26,50,283.64786358173438,50,1E+40,null,null,50,1E+40,50,1E+40,50,376.62060188997577,50,1E+40]
[60,1E+40,60,1E+40,60,727.25363740535408,60,1E+40,null,null,60,1E+40,60,1E+40,60,965.62936662772813,60,1E+40]
[70,1E+40,70,1.35037612100135E+22,70,1864.6281563605614,70,1E+40,null,null,70,1E+40,70,1E+40,70,2475.8071484886027,70,1E+40]
[80,1.3728156200146019E+29,80,1E+40,80,4780.7765915808077,80,1E+40,null,null,80,1E+40,80,1E+40,80,6347.7970202140041,80,1E+40]
[90,2.9149737619310554E+26,90,2.7225548053654118E+19,90,12257.570531164567,90,1E+40,null,null,90,1E+40,90,5.4038730586361469E+27,90,16275.297723108866,90,1E+40]
[100,1.7355716376161344E+25,100,1E+40,100,31427.505096622561,100,1E+40,null,null,100,1E+40,100,3.2835598897313285E+25,100,41728.638407784441,100,1E+40]
[120,2.9079646279283844E+23,120,1.0428754598402806E+17,120,206595.41469221481,120,1E+40,null,null,120,1E+40,120,1E+40,120,274309.87276436988,120,1E+40]
[140,1E+40,140,1E+40,140,1358230.2550269719,140,1E+40,null,null,140,3.7629588264078116E+30,140,4.3187467105983286E+20,140,1803288.1442485501,140,1E+40]
[160,2.2138063373334802E+19,160,2113071142171479,160,8940873.1292693764,160,1E+40,null,null,160,1.337307857800454E+28,160,1E+40,160,11864926.527531832,160,1E+40]
[180,1E+40,180,1E+40,180,59567333.166594371,180,1E+40,null,null,180,4.3953284767001627E+25,180,7.21512684910784E+17,180,78799690.065182045,180,1E+40]
[200,1E+40,200,14256472188074.082,200,440822506.86875182,200,1E+40,null,null,200,9.4415022983367113E+23,200,1E+40,200,570208333.52602637,200,1E+40]
[250,1E+40,250,8355722989.1739073,250,1E+40,250,1E+40,null,null,250,1.1196499956715292E+21,250,1E+40,250,1E+40,250,1E+40]
[]
["Compared with source concentrations in mg/L",null,null,null,null,null,null,null,null,null,"Compared with source concentrations in mg/L"]
[null,0.01,null,0.5,null,6,null,100,null,null,null,0.01,null,0.5,null,6,null,100]
[]
[]
["Pollutant Linkage: Infill, Geo Barrier, Sst Unsaturated, Sst Saturated, Principal Aquifer",null,null,null,null,null,null,null,null,null,"Pollutant Linkage: Infill, Geo Barrier, Sst Unsaturated, Sst Saturated, Principal Aquifer at Site Boundary"]
["Dilution Factor",null,null,null,null,null,null,null,null,null,"Dilution Factor"]
[]
[null,12.83921468512464,"for all species and timeslices",null,null,null,null,null,null,null,null,12.83921468512464,"for all species and timeslices"]
[]
[]
["Pollutant Linkage: Infill, Geo Barrier, Sst Unsaturated, Sst Saturated, Principal Aquifer",null,null,null,null,null,null,null,null,null,"Pollutant Linkage: Infill, Geo Barrier, Sst Unsaturated, Sst Saturated, Principal Aquifer at Site Boundary"]
["Attenuation Factor",null,null,null,null,null,null,null,null,null,"Attenuation Factor"]
[]
[null,"Species1",null,"Species2",null,"Species3",null,"Species4",null,null,null,"Species1",null,"Species2",null,"Species3",null,"Species4"]
["Time(years)","Hg","Time(years)","Pb","Time(years)","Benzene","Time(years)","BaP",null,null,"Time(years)","Hg","Time(years)","Pb","Time(years)","Benzene","Time(years)","BaP"]
[1,1E+40,1,3.8943191796558557E-2,1,1E+40,1,7.7886383593117108,null,null,1,1E+40,1,3.8943191796558557E-2,1,1E+40,1,7.7886383593117108]
[2,1E+40,2,1.9471595898279279E-2,2,1E+40,2,3.8943191796558554,null,null,2,1E+40,2,1.9471595898279279E-2,2,1E+40,2,3.8943191796558554]
[5,1E+40,5,7.7886383593117111E-3,5,1E+40,5,1.5577276718623423,null,null,5,1E+40,5,7.7886383593117111E-3,5,1E+40,5,1.5577276718623423]
[10,1E+40,10,3.8943191796558555E-3,10,1E+40,10,0.77886383593117114,null,null,10,1E+40,10,3.8943191796558555E-3,10,1E+40,10,0.77886383593117114]
[15,1E+40,15,2.596212786437237E-3,15,1E+40,15,0.51924255728744739,null,null,15,1E+40,15,2.596212786437237E-3,15,1E+40,15,0.51924255728744739]
[20,1E+40,20,1.9471595898279278E-3,20,1E+40,20,0.38943191796558557,null,null,20,1E+40,20,1.9471595898279278E-3,20,1E+40,20,0.38943191796558557]
[30,1E+40,30,1.2981063932186185E-3,30,1E+40,30,0.2596212786437237,null,null,30,1E+40,30,1.2981063932186185E-3,30,1E+40,30,0.2596212786437237]
[40,1E+40,40,9.7357979491396389E-4,40,2.9614730071420651E+35,40,0.19471595898279279,null,null,40,1E+40,40,9.7357979491396389E-4,40,1E+40,40,0.19471595898279279]
[50,1E+40,50,7.7886383593117115E-4,50,3.8631322366017189E+30,50,0.15577276718623423,null,null,50,1E+40,50,7.7886383593117115E-4,50,1E+40,50,0.15577276718623423]
[60,1E+40,60,6.4905319660930926E-4,60,1E+40,60,0.12981063932186185,null,null,60,1E+40,60,6.4905319660930926E-4,60,1E+40,60,0.12981063932186185]
[70,1E+40,70,5.563313113794079E-4,70,6.3105547533177998E+25,70,0.11126626227588159,null,null,70,1E+40,70,5.563313113794079E-4,70,1E+40,70,0.11126626227588159]
[80,1.0692364398308019E+33,80,4.8678989745698194E-4,80,1E+40,80,9.7357979491396393E-2,null,null,80,1E+40,80,4.8678989745698194E-4,80,1E+40,80,9.7357979491396393E-2]
[90,2.2703676458563379E+30,90,4.327021310728728E-4,90,1.2722996875438486E+23,90,8.6540426214574556E-2,null,null,90,1E+40,90,4.327021310728728E-4,90,2.5253287796006757E+31,90,8.6540426214574556E-2]
[100,1.3517739832070468E+29,100,3.8943191796558558E-4,100,1E+40,100,7.7886383593117114E-2,null,null,100,1E+40,100,3.8943191796558558E-4,100,1.5344676307355253E+29,100,7.7886383593117114E-2]
[120,2.2649084848604618E+27,120,3.2452659830465463E-4,120,4.8735478862981104E+20,120,6.4905319660930924E-2,null,null,120,1E+40,120,3.2452659830465463E-4,120,1E+40,120,6.4905319660930924E-2]
[140,1E+40,140,2.7816565568970395E-4,140,1E+40,140,5.5633131137940793E-2,null,null,140,2.9308325459870457E+34,140,2.7816565568970395E-4,140,2.0182293776590448E+24,140,5.5633131137940793E-2]
[160,1.7242536959042901E+23,160,2.4339494872849097E-4,160,9.8747681723228344E+18,160,4.8678989745698197E-2,null,null,160,1.0415807279473586E+32,160,2.4339494872849097E-4,160,1E+40,160,4.8678989745698197E-2]
[180,1E+40,180,2.163510655364364E-4,180,1E+40,180,4.3270213107287278E-2,null,null,180,3.4233623975401995E+29,180,2.163510655364364E-4,180,3.3717608246556691E+21,180,4.3270213107287278E-2]
[200,1E+40,200,1.9471595898279279E-4,200,6.6623103691496616E+16,200,3.8943191796558557E-2,null,null,200,7.3536446970354997E+27,200,1.9471595898279279E-4,200,1E+40,200,3.8943191796558557E-2]
[250,1E+40,250,1.5577276718623423E-4,250,39047822755957.563,250,3.1154553437246844E-2,null,null,250,8.7205489052904622E+24,250,1.5577276718623423E-4,250,1E+40,250,3.1154553437246844E-2]
[]
[]
["Saved  19/07/2022: 16:35:18  Level Number: 5"]
[]
["BREAKTHROUGH RESULTS"]
[]
["Advanced"]
["Pollutant Linkage: Infill, Geo Barrier, Sst Unsaturated, Sst Saturated, Principal Aquifer",null,null,null,null,null,null,null,null,null,"Pollutant Linkage: Infill, Geo Barrier, Sst Unsaturated, Sst Saturated, Principal Aquifer at Site Boundary"]
["Concentrations in mg/L in Principal Aquifer",null,null,null,null,null,null,null,null,null,"Concentrations in mg/L in Principal Aquifer at Site Boundary"]
[]
["Compared with MRV target concentration in mg/L",null,null,null,null,null,null,null,null,null,"Compared with MRV target concentration in mg/L"]
[null,1.0000000000000001E-5,null,2.0000000000000001E-4,null,1E-3,null,4.9999999999999998E-8,null,null,null,1.0000000000000001E-5,null,2.0000000000000001E-4,null,1E-3,null,4.9999999999999998E-8]
[]
[null,"Species1",null,"Species2",null,"Species3",null,"Species4",null,null,null,"Species1",null,"Species2",null,"Species3",null,"Species4"]
["Time(years)","Hg","Time(years)","Pb","Time(years)","Benzene","Time(years)","BaP",null,null,"Time(years)","Hg","Time(years)","Pb","Time(years)","Benzene","Time(years)","BaP"]
[1,0,1,0,1,1.9230225451233816E-14,1,0,null,null,1,0,1,0,1,0,1,0]
[2,0,2,0,2,1.2656117055721311E-7,2,0,null,null,2,0,2,0,2,3.7904654296092921E-9,2,0]
[5,0,5,0,5,3.6385364589223182E-4,5,0,null,null,5,0,5,0,5,1.7910500169680555E-4,5,0]
[10,0,10,0,10,8.5848972478309643E-4,10,0,null,null,10,0,10,0,10,6.3184821526593167E-4,10,0]
[15,0,15,0,15,5.6983478628073634E-4,15,0,null,null,15,0,15,0,15,4.2883598452655969E-4,15,0]
[20,0,20,0,20,3.5651078717028326E-4,20,0,null,null,20,0,20,0,20,2.6849739375735889E-4,20,0]
[30,0,30,0,30,1.3905433356377843E-4,30,0,null,null,30,0,30,0,30,1.0472731530027102E-4,30,0]
[40,0,40,1.5779927773499538E-36,40,5.423481131731026E-5,40,0,null,null,40,0,40,0,40,4.0846380575211504E-5,40,0]
[50,0,50,1.2096875616398481E-31,50,2.1152988512712959E-5,50,0,null,null,50,0,50,0,50,1.5931151853856398E-5,50,0]
[60,0,60,0,60,8.2502165563673096E-6,60,0,null,null,60,0,60,0,60,6.2135641348127466E-6,60,0]
[70,0,70,7.4053442181609806E-27,70,3.2177997417517199E-6,70,0,null,null,70,0,70,0,70,2.4234520865903466E-6,70,0]
[80,7.284299402051993E-37,80,0,80,1.2550262253555851E-6,80,0,null,null,80,0,80,0,80,9.452098075747421E-7,80,0]
[90,3.4305626110937598E-34,90,3.6730206423366507E-24,90,4.8949341019455283E-7,90,0,null,null,90,0,90,1.8505245943959766E-32,90,3.6865685052757948E-7,90,0]
[100,5.7617903999257181E-33,100,0,100,1.9091556843450504E-7,100,0,null,null,100,0,100,3.0454751354689721E-30,100,1.4378614373577801E-7,100,0]
[120,3.4388313750308366E-31,120,9.5888726747214172E-22,120,2.9042270899084478E-8,120,0,null,null,120,0,120,0,120,2.1873073468099179E-8,120,0]
[140,0,140,0,140,4.4175131409371021E-9,140,0,null,null,140,2.6574832362824926E-38,140,2.3154865682351115E-25,140,3.3272552803813092E-9,140,0]
[160,4.5171069534677349E-27,160,4.7324483309745969E-20,160,6.7107539870552935E-10,160,0,null,null,160,7.4777097447461111E-36,160,0,160,5.05692132696934E-10,160,0]
[180,0,180,0,180,1.0072634917563889E-10,180,0,null,null,180,2.2751428142425437E-33,180,1.3859770187181829E-22,180,7.6142431461810072E-11,180,0]
[200,0,200,7.0143580179430826E-18,200,1.3610920283129755E-11,200,0,null,null,200,1.0591534783359295E-31,200,0,200,1.0522469853952316E-11,200,0]
[250,0,250,1.1967845287543042E-14,250,0,250,0,null,null,250,8.9313625138741064E-29,250,0,250,0,250,0]
[]
[]
["Pollutant Linkage: Infill, Geo Barrier, Sst Unsaturated, Sst Saturated, Principal Aquifer",null,null,null,null,null,null,null,null,null,"Pollutant Linkage: Infill, Geo Barrier, Sst Unsaturated, Sst Saturated, Principal Aquifer at Site Boundary"]
["Remedial Target Concentrations in mg/L in Infill",null,null,null,null,null,null,null,null,null,"Remedial Target Concentrations in mg/L in Infill"]
[]
[null,"Species1",null,"Species2",null,"Species3",null,"Species4",null,null,null,"Species1",null,"Species2",null,"Species3",null,"Species4"]
["Time(years)","Hg","Time(years)","Pb","Time(years)","Benzene","Time(years)","BaP",null,null,"Time(years)","Hg","Time(years)","Pb","Time(years)","Benzene","Time(years)","BaP"]
[1,1E+40,1,1E+40,1,312008822528.65314,1,1E+40,null,null,1,1E+40,1,1E+40,1,1E+40,1,1E+40]
[2,1E+40,2,1E+40,2,47407.905391390537,2,1E+40,null,null,2,1E+40,2,1E+40,2,1582919.0666483559,2,1E+40]
[5,1E+40,5,1E+40,5,16.490146705241791,5,1E+40,null,null,5,1E+40,5,1E+40,5,33.499901974580162,5,1E+40]
[10,1E+40,10,1E+40,10,6.9890178377102217,10,1E+40,null,null,10,1E+40,10,1E+40,10,9.4959514880875719,10,1E+40]
[15,1E+40,15,1E+40,15,10.529367712282879,15,1E+40,null,null,15,1E+40,15,1E+40,15,13.991363170290095,15,1E+40]
[20,1E+40,20,1E+40,20,16.829785285386524,20,1E+40,null,null,20,1E+40,20,1E+40,20,22.346585626161424,20,1E+40]
[30,1E+40,30,1E+40,30,43.148601314521777,30,1E+40,null,null,30,1E+40,30,1E+40,30,57.291643376868585,30,1E+40]
[40,1E+40,40,6.3371646204831049E+31,40,110.63005206925031,40,1E+40,null,null,40,1E+40,40,1E+40,40,146.89183999919024,40,1E+40]
[50,1E+40,50,8.2665973571258646E+26,50,283.64786358173438,50,1E+40,null,null,50,1E+40,50,1E+40,50,376.62060188997577,50,1E+40]
[60,1E+40,60,1E+40,60,727.25363740535408,60,1E+40,null,null,60,1E+40,60,1E+40,60,965.62936662772813,60,1E+40]
[70,1E+40,70,1.35037612100135E+22,70,1864.6281563605614,70,1E+40,null,null,70,1E+40,70,1E+40,70,2475.8071484886027,70,1E+40]
[80,1.3728156200146019E+29,80,1E+40,80,4780.7765915808077,80,1E+40,null,null,80,1E+40,80,1E+40,80,6347.7970202140041,80,1E+40]
[90,2.9149737619310554E+26,90,2.7225548053654118E+19,90,12257.570531164567,90,1E+40,null,null,90,1E+40,90,5.4038730586361469E+27,90,16275.297723108866,90,1E+40]
[100,1.7355716376161344E+25,100,1E+40,100,31427.505096622561,100,1E+40,null,null,100,1E+40,100,3.2835598897313285E+25,100,41728.638407784441,100,1E+40]
[120,2.9079646279283844E+23,120,1.0428754598402806E+17,120,206595.41469221481,120,1E+40,null,null,120,1E+40,120,1E+40,120,274309.87276436988,120,1E+40]
[140,1E+40,140,1E+40,140,1358230.2550269719,140,1E+40,null,null,140,3.7629588264078116E+30,140,4.3187467105983286E+20,140,1803288.1442485501,140,1E+40]
[160,2.2138063373334802E+19,160,2113071142171479,160,8940873.1292693764,160,1E+40,null,null,160,1.337307857800454E+28,160,1E+40,160,11864926.527531832,160,1E+40]
[180,1E+40,180,1E+40,180,59567333.166594371,180,1E+40,null,null,180,4.3953284767001627E+25,180,7.21512684910784E+17,180,78799690.065182045,180,1E+40]
[200,1E+40,200,14256472188074.082,200,440822506.86875182,200,1E+40,null,null,200,9.4415022983367113E+23,200,1E+40,200,570208333.52602637,200,1E+40]
[250,1E+40,250,8355722989.1739073,250,1E+40,250,1E+40,null,null,250,1.1196499956715292E+21,250,1E+40,250,1E+40,250,1E+40]
[]
["Compared with source concentrations in mg/L",null,null,null,null,null,null,null,null,null,"Compared with source concentrations in mg/L"]
[null,0.01,null,0.5,null,6,null,100,null,null,null,0.01,null,0.5,null,6,null,100]
[]
[]
["Pollutant Linkage: Infill, Geo Barrier, Sst Unsaturated, Sst Saturated, Principal Aquifer",null,null,null,null,null,null,null,null,null,"Pollutant Linkage: Infill, Geo Barrier, Sst Unsaturated, Sst Saturated, Principal Aquifer at Site Boundary"]
["Dilution Factor",null,null,null,null,null,null,null,null,null,"Dilution Factor"]
[]
[null,12.83921468512464,"for all species and timeslices",null,null,null,null,null,null,null,null,12.83921468512464,"for all species and timeslices"]
[]
[]
["Pollutant Linkage: Infill, Geo Barrier, Sst Unsaturated, Sst Saturated, Principal Aquifer",null,null,null,null,null,null,null,null,null,"Pollutant Linkage: Infill, Geo Barrier, Sst Unsaturated, Sst Saturated, Principal Aquifer at Site Boundary"]
["Attenuation Factor",null,null,null,null,null,null,null,null,null,"Attenuation Factor"]
[]
[null,"Species1",null,"Species2",null,"Species3",null,"Species4",null,null,null,"Species1",null,"Species2",null,"Species3",null,"Species4"]
["Time(years)","Hg","Time(years)","Pb","Time(years)","Benzene","Time(years)","BaP",null,null,"Time(years)","Hg","Time(years)","Pb","Time(years)","Benzene","Time(years)","BaP"]
[1,1E+40,1,3.8943191796558557E-2,1,1E+40,1,7.7886383593117108,null,null,1,1E+40,1,3.8943191796558557E-2,1,1E+40,1,7.7886383593117108]
[2,1E+40,2,1.9471595898279279E-2,2,1E+40,2,3.8943191796558554,null,null,2,1E+40,2,1.9471595898279279E-2,2,1E+40,2,3.8943191796558554]
[5,1E+40,5,7.7886383593117111E-3,5,1E+40,5,1.5577276718623423,null,null,5,1E+40,5,7.7886383593117111E-3,5,1E+40,5,1.5577276718623423]
[10,1E+40,10,3.8943191796558555E-3,10,1E+40,10,0.77886383593117114,null,null,10,1E+40,10,3.8943191796558555E-3,10,1E+40,10,0.77886383593117114]
[15,1E+40,15,2.596212786437237E-3,15,1E+40,15,0.51924255728744739,null,null,15,1E+40,15,2.596212786437237E-3,15,1E+40,15,0.51924255728744739]
[20,1E+40,20,1.9471595898279278E-3,20,1E+40,20,0.38943191796558557,null,null,20,1E+40,20,1.9471595898279278E-3,20,1E+40,20,0.38943191796558557]
[30,1E+40,30,1.2981063932186185E-3,30,1E+40,30,0.2596212786437237,null,null,30,1E+40,30,1.2981063932186185E-3,30,1E+40,30,0.2596212786437237]
[40,1E+40,40,9.7357979491396389E-4,40,2.9614730071420651E+35,40,0.19471595898279279,null,null,40,1E+40,40,9.7357979491396389E-4,40,1E+40,40,0.19471595898279279]
[50,1E+40,50,7.7886383593117115E-4,50,3.8631322366017189E+30,50,0.15577276718623423,null,null,50,1E+40,50,7.7886383593117115E-4,50,1E+40,50,0.15577276718623423]
[60,1E+40,60,6.4905319660930926E-4,60,1E+40,60,0.12981063932186185,null,null,60,1E+40,60,6.4905319660930926E-4,60,1E+40,60,0.12981063932186185]
[70,1E+40,70,5.563313113794079E-4,70,6.3105547533177998E+25,70,0.11126626227588159,null,null,70,1E+40,70,5.563313113794079E-4,70,1E+40,70,0.11126626227588159]
[80,1.0692364398308019E+33,80,4.8678989745698194E-4,80,1E+40,80,9.7357979491396393E-2,null,null,80,1E+40,80,4.8678989745698194E-4,80,1E+40,80,9.7357979491396393E-2]
[90,2.2703676458563379E+30,90,4.327021310728728E-4,90,1.2722996875438486E+23,90,8.6540426214574556E-2,null,null,90,1E+40,90,4.327021310728728E-4,90,2.5253287796006757E+31,90,8.6540426214574556E-2]
[100,1.3517739832070468E+29,100,3.8943191796558558E-4,100,1E+40,100,7.7886383593117114E-2,null,null,100,1E+40,100,3.8943191796558558E-4,100,1.5344676307355253E+29,100,7.7886383593117114E-2]
[120,2.2649084848604618E+27,120,3.2452659830465463E-4,120,4.8735478862981104E+20,120,6.4905319660930924E-2,null,null,120,1E+40,120,3.2452659830465463E-4,120,1E+40,120,6.4905319660930924E-2]
[140,1E+40,140,2.7816565568970395E-4,140,1E+40,140,5.5633131137940793E-2,null,null,140,2.9308325459870457E+34,140,2.7816565568970395E-4,140,2.0182293776590448E+24,140,5.5633131137940793E-2]
[160,1.7242536959042901E+23,160,2.4339494872849097E-4,160,9.8747681723228344E+18,160,4.8678989745698197E-2,null,null,160,1.0415807279473586E+32,160,2.4339494872849097E-4,160,1E+40,160,4.8678989745698197E-2]
[180,1E+40,180,2.163510655364364E-4,180,1E+40,180,4.3270213107287278E-2,null,null,180,3.4233623975401995E+29,180,2.163510655364364E-4,180,3.3717608246556691E+21,180,4.3270213107287278E-2]
[200,1E+40,200,1.9471595898279279E-4,200,6.6623103691496616E+16,200,3.8943191796558557E-2,null,null,200,7.3536446970354997E+27,200,1.9471595898279279E-4,200,1E+40,200,3.8943191796558557E-2]
[250,1E+40,250,1.5577276718623423E-4,250,39047822755957.563,250,3.1154553437246844E-2,null,null,250,8.7205489052904622E+24,250,1.5577276718623423E-4,250,1E+40,250,3.1154553437246844E-2]
[]
[]
["Saved  21/07/2022: 11:53:12  Level Number: 5"]
[]
["BREAKTHROUGH RESULTS"]
[]
["Advanced"]
["Pollutant Linkage: Infill, Geo Barrier, Sst Unsaturated, Sst Saturated, Principal Aquifer",null,null,null,null,null,null,null,null,null,"Pollutant Linkage: Infill, Geo Barrier, Sst Unsaturated, Sst Saturated, Principal Aquifer at Site Boundary"]
["Concentrations in mg/L in Principal Aquifer",null,null,null,null,null,null,null,null,null,"Concentrations in mg/L in Principal Aquifer at Site Boundary"]
[]
["Compared with MRV target concentration in mg/L",null,null,null,null,null,null,null,null,null,"Compared with MRV target concentration in mg/L"]
[null,1.0000000000000001E-5,null,2.0000000000000001E-4,null,1E-3,null,4.9999999999999998E-8,null,null,null,1.0000000000000001E-5,null,2.0000000000000001E-4,null,1E-3,null,4.9999999999999998E-8]
[]
[null,"Species1",null,"Species2",null,"Species3",null,"Species4",null,null,null,"Species1",null,"Species2",null,"Species3",null,"Species4"]
["Time(years)","Hg","Time(years)","Pb","Time(years)","Benzene","Time(years)","BaP",null,null,"Time(years)","Hg","Time(years)","Pb","Time(years)","Benzene","Time(years)","BaP"]
[1,0,1,0,1,1.0891002003970756E-14,1,0,null,null,1,0,1,0,1,0,1,0]
[2,0,2,0,2,4.2111905095230994E-8,2,0,null,null,2,0,2,0,2,1.2391678862333165E-9,2,0]
[5,0,5,0,5,3.2933480673354064E-5,5,0,null,null,5,0,5,0,5,1.4716809955371574E-5,5,0]
[10,0,10,0,10,3.4967002564891156E-5,10,0,null,null,10,0,10,0,10,2.021397710134591E-5,10,0]
[15,0,15,0,15,2.1890804816245029E-5,15,0,null,null,15,0,15,0,15,1.2677630135052965E-5,15,0]
[20,0,20,0,20,1.3671315851411835E-5,20,0,null,null,20,0,20,0,20,7.9175017533383515E-6,20,0]
[30,0,30,0,30,5.3321691433387445E-6,30,0,null,null,30,0,30,0,30,3.0880318474931429E-6,30,0]
[40,0,40,1.5779927773499538E-36,40,2.0796847928631847E-6,40,0,null,null,40,0,40,0,40,1.2044128160275192E-6,40,0]
[50,0,50,1.2096875616398481E-31,50,8.1113123444417652E-7,50,0,null,null,50,0,50,0,50,4.6975236209831752E-7,50,0]
[60,0,60,0,60,3.1636232884531933E-7,60,0,null,null,60,0,60,0,60,1.832156661493278E-7,60,0]
[70,0,70,7.4053442181609806E-27,70,1.2338957267069896E-7,70,0,null,null,70,0,70,0,70,7.1458897123684825E-8,70,0]
[80,7.284299402051993E-37,80,0,80,4.8125165746530885E-8,80,0,null,null,80,0,80,0,80,2.7870845484310608E-8,80,0]
[90,3.4305626110937598E-34,90,3.6730206423366507E-24,90,1.8770076403409671E-8,90,0,null,null,90,0,90,1.8505245943959766E-32,90,1.0870365897150015E-8,90,0]
[100,5.7617903999257181E-33,100,0,100,7.3208152003922082E-9,100,0,null,null,100,0,100,3.0454751354689721E-30,100,4.2397302936405836E-9,100,0]
[120,3.4388313750308366E-31,120,9.5888726747214172E-22,120,1.1136123367412133E-9,120,0,null,null,120,0,120,0,120,6.4494053352428896E-10,120,0]
[140,0,140,0,140,1.6934320504302039E-10,140,0,null,null,140,2.6574832362824926E-38,140,2.3154865682351115E-25,140,9.8084072619786384E-11,140,0]
[160,4.5171069534677349E-27,160,4.7324483309745969E-20,160,2.5679348223820279E-11,160,0,null,null,160,7.4777097447461111E-36,160,0,160,1.4883092982632073E-11,160,0]
[180,0,180,0,180,3.8096002803971673E-12,180,0,null,null,180,2.2751428142425437E-33,180,1.3859770187181829E-22,180,2.2166876108398668E-12,180,0]
[200,0,200,7.0143580179430826E-18,200,4.715155692048876E-13,200,0,null,null,200,1.0591534783359295E-31,200,0,200,2.824602373543759E-13,200,0]
[250,0,250,1.1967845287543042E-14,250,0,250,0,null,null,250,8.9313625138741064E-29,250,0,250,0,250,0]
[]
[]
["Pollutant Linkage: Infill, Geo Barrier, Sst Unsaturated, Sst Saturated, Principal Aquifer",null,null,null,null,null,null,null,null,null,"Pollutant Linkage: Infill, Geo Barrier, Sst Unsaturated, Sst Saturated, Principal Aquifer at Site Boundary"]
["Remedial Target Concentrations in mg/L in Infill",null,null,null,null,null,null,null,null,null,"Remedial Target Concentrations in mg/L in Infill"]
[]
[null,"Species1",null,"Species2",null,"Species3",null,"Species4",null,null,null,"Species1",null,"Species2",null,"Species3",null,"Species4"]
["Time(years)","Hg","Time(years)","Pb","Time(years)","Benzene","Time(years)","BaP",null,null,"Time(years)","Hg","Time(years)","Pb","Time(years)","Benzene","Time(years)","BaP"]
[1,1E+40,1,1E+40,1,550913497014.54993,1,1E+40,null,null,1,1E+40,1,1E+40,1,1E+40,1,1E+40]
[2,1E+40,2,1E+40,2,142477.52473871043,2,1E+40,null,null,2,1E+40,2,1E+40,2,4841958.9198991647,2,1E+40]
[5,1E+40,5,1E+40,5,182.18541974078377,5,1E+40,null,null,5,1E+40,5,1E+40,5,407.69704971355054,5,1E+40]
[10,1E+40,10,1E+40,10,171.59034403550331,10,1E+40,null,null,10,1E+40,10,1E+40,10,296.82431962389535,10,1E+40]
[15,1E+40,15,1E+40,15,274.08768432065312,15,1E+40,null,null,15,1E+40,15,1E+40,15,473.27457388193739,15,1E+40]
[20,1E+40,20,1E+40,20,438.87509185009293,20,1E+40,null,null,20,1E+40,20,1E+40,20,757.81479902674448,20,1E+40]
[30,1E+40,30,1E+40,30,1125.2456249433776,30,1E+40,null,null,30,1E+40,30,1E+40,30,1942.9851427441677,30,1E+40]
[40,1E+40,40,6.3371646204831049E+31,40,2885.0525909455546,40,1E+40,null,null,40,1E+40,40,1E+40,40,4981.6806332148062,40,1E+40]
[50,1E+40,50,8.2665973571258646E+26,50,7397.0767555406355,50,1E+40,null,null,50,1E+40,50,1E+40,50,12772.68723716225,50,1E+40]
[60,1E+40,60,1E+40,60,18965.595625431153,60,1E+40,null,null,60,1E+40,60,1E+40,60,32748.291268443005,60,1E+40]
[70,1E+40,70,1.35037612100135E+22,70,48626.475237196493,70,1E+40,null,null,70,1E+40,70,1E+40,70,83964.352117202201,70,1E+40]
[80,1.3728156200146019E+29,80,1E+40,80,124674.89528454271,80,1E+40,null,null,80,1E+40,80,1E+40,80,215278.72211044305,80,1E+40]
[90,2.9149737619310554E+26,90,2.7225548053654118E+19,90,319657.72919869801,90,1E+40,null,null,90,1E+40,90,5.4038730586361469E+27,90,551959.34127415856,90,1E+40]
[100,1.7355716376161344E+25,100,1E+40,100,819580.85756331531,100,1E+40,null,null,100,1E+40,100,3.2835598897313285E+25,100,1415184.3594862029,100,1E+40]
[120,2.9079646279283844E+23,120,1.0428754598402806E+17,120,5387871.3462872757,120,1E+40,null,null,120,1E+40,120,1E+40,120,9303183.2984862868,120,1E+40]
[140,1E+40,140,1E+40,140,35431005.327174149,140,1E+40,null,null,140,3.7629588264078116E+30,140,4.3187467105983286E+20,140,61172011.313788243,140,1E+40]
[160,2.2138063373334802E+19,160,2113071142171479,160,233650790.03190482,160,1E+40,null,null,160,1.337307857800454E+28,160,1E+40,160,403142008.65382898,160,1E+40]
[180,1E+40,180,1E+40,180,1574968384.7079291,180,1E+40,null,null,180,4.3953284767001627E+25,180,7.21512684910784E+17,180,2706741342.6498547,180,1E+40]
[200,1E+40,200,14256472188074.082,200,12724924460.326401,200,1E+40,null,null,200,9.4415022983367113E+23,200,1E+40,200,21241927912.396294,200,1E+40]
[250,1E+40,250,8355722989.1739073,250,1E+40,250,1E+40,null,null,250,1.1196499956715292E+21,250,1E+40,250,1E+40,250,1E+40]
[]
["Compared with source concentrations in mg/L",null,null,null,null,null,null,null,null,null,"Compared with source concentrations in mg/L"]
[null,0.01,null,0.5,null,6,null,100,null,null,null,0.01,null,0.5,null,6,null,100]
[]
[]
["Pollutant Linkage: Infill, Geo Barrier, Sst Unsaturated, Sst Saturated, Principal Aquifer",null,null,null,null,null,null,null,null,null,"Pollutant Linkage: Infill, Geo Barrier, Sst Unsaturated, Sst Saturated, Principal Aquifer at Site Boundary"]
["Dilution Factor",null,null,null,null,null,null,null,null,null,"Dilution Factor"]
[]
[null,12.83921468512464,"for all species and timeslices",null,null,null,null,null,null,null,null,12.83921468512464,"for all species and timeslices"]
[]
[]
["Pollutant Linkage: Infill, Geo Barrier, Sst Unsaturated, Sst Saturated, Principal Aquifer",null,null,null,null,null,null,null,null,null,"Pollutant Linkage: Infill, Geo Barrier, Sst Unsaturated, Sst Saturated, Principal Aquifer at Site Boundary"]
["Attenuation Factor",null,null,null,null,null,null,null,null,null,"Attenuation Factor"]
[]
[null,"Species1",null,"Species2",null,"Species3",null,"Species4",null,null,null,"Species1",null,"Species2",null,"Species3",null,"Species4"]
["Time(years)","Hg","Time(years)","Pb","Time(years)","Benzene","Time(years)","BaP",null,null,"Time(years)","Hg","Time(years)","Pb","Time(years)","Benzene","Time(years)","BaP"]
[1,1E+40,1,3.8943191796558557E-2,1,1E+40,1,7.7886383593117108,null,null,1,1E+40,1,3.8943191796558557E-2,1,1E+40,1,7.7886383593117108]
[2,1E+40,2,1.9471595898279279E-2,2,1E+40,2,3.8943191796558554,null,null,2,1E+40,2,1.9471595898279279E-2,2,1E+40,2,3.8943191796558554]
[5,1E+40,5,7.7886383593117111E-3,5,1E+40,5,1.5577276718623423,null,null,5,1E+40,5,7.7886383593117111E-3,5,1E+40,5,1.5577276718623423]
[10,1E+40,10,3.8943191796558555E-3,10,1E+40,10,0.77886383593117114,null,null,10,1E+40,10,3.8943191796558555E-3,10,1E+40,10,0.77886383593117114]
[15,1E+40,15,2.596212786437237E-3,15,1E+40,15,0.51924255728744739,null,null,15,1E+40,15,2.596212786437237E-3,15,1E+40,15,0.51924255728744739]
[20,1E+40,20,1.9471595898279278E-3,20,1E+40,20,0.38943191796558557,null,null,20,1E+40,20,1.9471595898279278E-3,20,1E+40,20,0.38943191796558557]
[30,1E+40,30,1.2981063932186185E-3,30,1E+40,30,0.2596212786437237,null,null,30,1E+40,30,1.2981063932186185E-3,30,1E+40,30,0.2596212786437237]
[40,1E+40,40,9.7357979491396389E-4,40,2.9614730071420651E+35,40,0.19471595898279279,null,null,40,1E+40,40,9.7357979491396389E-4,40,1E+40,40,0.19471595898279279]
[50,1E+40,50,7.7886383593117115E-4,50,3.8631322366017189E+30,50,0.15577276718623423,null,null,50,1E+40,50,7.7886383593117115E-4,50,1E+40,50,0.15577276718623423]
[60,1E+40,60,6.4905319660930926E-4,60,1E+40,60,0.12981063932186185,null,null,60,1E+40,60,6.4905319660930926E-4,60,1E+40,60,0.12981063932186185]
[70,1E+40,70,5.563313113794079E-4,70,6.3105547533177998E+25,70,0.11126626227588159,null,null,70,1E+40,70,5.563313113794079E-4,70,1E+40,70,0.11126626227588159]
[80,1.0692364398308019E+33,80,4.8678989745698194E-4,80,1E+40,80,9.7357979491396393E-2,null,null,80,1E+40,80,4.8678989745698194E-4,80,1E+40,80,9.7357979491396393E-2]
[90,2.2703676458563379E+30,90,4.327021310728728E-4,90,1.2722996875438486E+23,90,8.6540426214574556E-2,null,null,90,1E+40,90,4.327021310728728E-4,90,2.5253287796006757E+31,90,8.6540426214574556E-2]
[100,1.3517739832070468E+29,100,3.8943191796558558E-4,100,1E+40,100,7.7886383593117114E-2,null,null,100,1E+40,100,3.8943191796558558E-4,100,1.5344676307355253E+29,100,7.7886383593117114E-2]
[120,2.2649084848604618E+27,120,3.2452659830465463E-4,120,4.8735478862981104E+20,120,6.4905319660930924E-2,null,null,120,1E+40,120,3.2452659830465463E-4,120,1E+40,120,6.4905319660930924E-2]
[140,1E+40,140,2.7816565568970395E-4,140,1E+40,140,5.5633131137940793E-2,null,null,140,2.9308325459870457E+34,140,2.7816565568970395E-4,140,2.0182293776590448E+24,140,5.5633131137940793E-2]
[160,1.7242536959042901E+23,160,2.4339494872849097E-4,160,9.8747681723228344E+18,160,4.8678989745698197E-2,null,null,160,1.0415807279473586E+32,160,2.4339494872849097E-4,160,1E+40,160,4.8678989745698197E-2]
[180,1E+40,180,2.163510655364364E-4,180,1E+40,180,4.3270213107287278E-2,null,null,180,3.4233623975401995E+29,180,2.163510655364364E-4,180,3.3717608246556691E+21,180,4.3270213107287278E-2]
[200,1E+40,200,1.9471595898279279E-4,200,6.6623103691496616E+16,200,3.8943191796558557E-2,null,null,200,7.3536446970354997E+27,200,1.9471595898279279E-4,200,1E+40,200,3.8943191796558557E-2]
[250,1E+40,250,1.5577276718623423E-4,250,39047822755957.563,250,3.1154553437246844E-2,null,null,250,8.7205489052904622E+24,250,1.5577276718623423E-4,250,1E+40,250,3.1154553437246844E-2]
[]
[]
["Saved  21/07/2022: 11:59:05  Level Number: 5"]
[]
["BREAKTHROUGH RESULTS"]
[]
["Advanced"]
["Pollutant Linkage: Infill, Geo Barrier, Sst Unsaturated, Sst Saturated, Principal Aquifer",null,null,null,null,null,null,null,null,null,"Pollutant Linkage: Infill, Geo Barrier, Sst Unsaturated, Sst Saturated, Principal Aquifer at Site Boundary"]
["Concentrations in mg/L in Principal Aquifer",null,null,null,null,null,null,null,null,null,"Concentrations in mg/L in Principal Aquifer at Site Boundary"]
[]
["Compared with MRV target concentration in mg/L",null,null,null,null,null,null,null,null,null,"Compared with MRV target concentration in mg/L"]
[null,1.0000000000000001E-5,null,2.0000000000000001E-4,null,1E-3,null,4.9999999999999998E-8,null,null,null,1.0000000000000001E-5,null,2.0000000000000001E-4,null,1E-3,null,4.9999999999999998E-8]
[]
[null,"Species1",null,"Species2",null,"Species3",null,"Species4",null,null,null,"Species1",null,"Species2",null,"Species3",null,"Species4"]
["Time(years)","Hg","Time(years)","Pb","Time(years)","Benzene","Time(years)","BaP",null,null,"Time(years)","Hg","Time(years)","Pb","Time(years)","Benzene","Time(years)","BaP"]
[1,0,1,0,1,0.18420717770958309,1,0,null,null,1,0,1,0,1,5.8399712731545872E-2,1,0]
[2,0,2,0,2,0.18060111285996067,2,0,null,null,2,0,2,0,2,0.10373710281222455,2,0]
[5,4.3680141596758242E-36,5,0,5,0.13622419507814057,5,0,null,null,5,0,5,0,5,7.8891843117759083E-2,5,0]
[10,0,10,0,10,8.50748221698574E-2,10,0,null,null,10,0,10,0,10,4.9269584859226535E-2,10,0]
[15,5.3977342755822583E-23,15,1.9975790949171065E-13,15,5.3130982610130224E-2,15,0,null,null,15,0,15,0,15,3.0769872959091546E-2,15,0]
[20,1.1800893539286726E-21,20,2.8761515285952744E-10,20,3.3181395267032357E-2,20,0,null,null,20,0,20,1.2698316835121998E-31,20,1.9216420887955117E-2,20,0]
[30,2.2807461181742009E-15,30,3.6038506742761173E-7,30,1.2941607622491514E-2,30,0,null,null,30,0,30,3.0961197343948853E-25,30,7.4949043294247116E-3,30,0]
[40,3.6299839932023248E-12,40,1.1308736428772712E-5,40,5.0475634752293348E-3,40,0,null,null,40,6.2757882106854516E-34,40,5.9173496664902488E-22,40,2.9232076399695948E-3,40,0]
[50,2.8086994179260727E-10,50,8.1225454287439951E-5,50,1.9686807260081403E-3,50,0,null,null,50,0,50,1.5628833858307043E-20,50,1.1401268790842108E-3,50,0]
[60,4.8233630331369797E-9,60,2.7856843931105084E-4,60,7.6783629171694263E-4,60,0,null,null,60,2.1800882235660786E-27,60,0,60,4.4467894461154475E-4,60,0]
[70,3.5108070381820683E-8,70,6.2558280155782127E-4,70,2.9947569924856232E-4,70,0,null,null,70,0,70,8.0365132343709973E-18,70,1.7343613571067096E-4,70,0]
[80,1.4953356557361392E-7,80,1.078136918293508E-3,80,1.1680287682580815E-4,80,0,null,null,80,5.8137922424909835E-24,80,0,80,6.7644372868874277E-5,80,0]
[90,4.4574715968958169E-7,90,1.5582426984386624E-3,90,4.5555725402117714E-5,90,0,null,null,90,0,90,1.5371308881225428E-15,90,2.6382829522922461E-5,90,0]
[100,1.0354494024182917E-6,100,1.9926892568442236E-3,100,1.7767487906505268E-5,100,0,null,null,100,9.0853137079459074E-23,100,5.7653440708617972E-14,100,1.0289753197414915E-5,100,0]
[120,3.3991578615012524E-6,120,2.5598390199418294E-3,120,2.7022125649941731E-6,120,0,null,null,120,0,120,1.4231792874089629E-11,120,1.5649544614688108E-6,120,0]
[140,7.3108977666160025E-6,140,2.6879327895737515E-3,140,4.104985583843702E-7,140,0,null,null,140,1.0221813438987251E-19,140,6.7944341173540298E-10,140,2.3774228172832284E-7,140,0]
[160,1.2115832319373847E-5,160,2.5015364688987063E-3,160,6.1903516154704772E-8,160,0,null,null,160,0,160,1.1626979628642196E-8,160,3.5855621208470381E-8,160,0]
[180,1.6928778645564212E-5,180,2.1569777990678419E-3,180,8.8963645337924715E-9,180,0,null,null,180,1.2578623152851906E-17,180,1.0040239708170918E-7,180,5.1549291084425943E-9,180,0]
[200,2.1044918874135252E-5,200,1.7685658952987465E-3,200,8.5414108043948216E-10,200,0,null,null,200,4.6866630225681633E-16,200,5.3738250044721452E-7,200,4.956258631708625E-10,200,0]
[250,2.6440088924919082E-5,250,9.465938816424701E-4,250,0,250,0,null,null,250,3.7247868778086436E-13,250,9.3688407210551382E-6,250,0,250,0]
[]
[]
["Pollutant Linkage: Infill, Geo Barrier, Sst Unsaturated, Sst Saturated, Principal Aquifer",null,null,null,null,null,null,null,null,null,"Pollutant Linkage: Infill, Geo Barrier, Sst Unsaturated, Sst Saturated, Principal Aquifer at Site Boundary"]
["Remedial Target Concentrations in mg/L in Infill",null,null,null,null,null,null,null,null,null,"Remedial Target Concentrations in mg/L in Infill"]
[]
[null,"Species1",null,"Species2",null,"Species3",null,"Species4",null,null,null,"Species1",null,"Species2",null,"Species3",null,"Species4"]
["Time(years)","Hg","Time(years)","Pb","Time(years)","Benzene","Time(years)","BaP",null,null,"Time(years)","Hg","Time(years)","Pb","Time(years)","Benzene","Time(years)","BaP"]
[1,1E+40,1,1E+40,1,3.2572020670440245E-2,1,1E+40,null,null,1,1E+40,1,1E+40,1,0.10274023140457966,1,1E+40]
[2,1E+40,2,1E+40,2,3.3222386645271898E-2,2,1E+40,null,null,2,1E+40,2,1E+40,2,5.7838515221122509E-2,2,1E+40]
[5,2.2893698679635599E+28,5,1E+40,5,4.4045039110403958E-2,5,1E+40,null,null,5,1E+40,5,1E+40,5,7.6053489979236652E-2,5,1E+40]
[10,1E+40,10,1E+40,10,7.0526153883937723E-2,10,1E+40,null,null,10,1E+40,10,1E+40,10,0.12177898427890654,10,1E+40]
[15,1852629175399949,15,500605959.75625038,15,0.11292845916341117,15,1E+40,null,null,15,1E+40,15,1E+40,15,0.19499593020669867,15,1E+40]
[20,84739345937735.016,20,347686.82736559596,20,0.18082422248112479,20,1E+40,null,null,20,1E+40,20,7.8750594506676809E+26,20,0.31223296132948514,20,1E+40]
[30,43845300.975477584,30,277.4809753183971,30,0.46362091751046941,30,1E+40,null,null,30,1E+40,30,3.2298492493393284E+20,30,0.80054390773798489,30,1E+40]
[40,27548.330843128955,40,8.8427209025378772,40,1.1886923323390979,40,1E+40,null,null,40,1.5934253458352104E+26,40,1.6899457634943667E+17,40,2.0525397915498087,40,1E+40]
[50,356.03667434744381,50,1.2311411598403728,50,3.0477262873224222,50,1E+40,null,null,50,1E+40,50,6398430036854476,50,5.2625721839129049,50,1E+40]
[60,20.732422443218589,60,0.35897821105405098,60,7.8141656818324199,60,1E+40,null,null,60,4.5869703307889549E+19,60,1E+40,60,13.492880813687684,60,1E+40]
[70,2.8483479414402972,70,0.15985094179536394,70,20.035014577326525,70,1E+40,null,null,70,1E+40,70,12443207282023.074,70,34.594866723791057,70,1E+40]
[80,0.66874617492332167,80,9.2752597840988105E-2,80,51.368597786747934,80,1E+40,null,null,80,1.7200477043045126E+16,80,1E+40,80,88.699174011572893,80,1E+40]
[90,0.22434242782307351,90,6.4174855496001118E-2,90,131.70682602545239,90,1E+40,null,null,90,1E+40,90,65056268644.851944,90,227.42064094326801,90,1E+40]
[100,9.6576423499255534E-2,100,5.018343911702907E-2,100,337.69545990816181,100,1E+40,null,null,100,1100677458308800,100,1734501857.4936867,100,583.10436459325126,100,1E+40]
[120,2.941905144582917E-2,120,3.9064956515223535E-2,120,2220.4026721387618,120,1E+40,null,null,120,1E+40,120,7026521.5974341352,120,3833.9773761650627,120,1E+40]
[140,1.3678210692075789E-2,140,3.7203311179465119E-2,140,14616.372889626331,140,1E+40,null,null,140,978299991453.45129,140,147179.29156835095,140,25237.412362586932,140,1E+40]
[160,8.2536632535013549E-3,160,3.9975431597055508E-2,160,96925.027408866983,160,1E+40,null,null,160,1E+40,160,8600.6859213597891,160,167337.77850661211,160,1E+40]
[180,5.9071006889326099E-3,180,4.6361163310635806E-2,180,674432.79524003866,180,1E+40,null,null,180,7949995701.8210983,180,995.99215662767801,180,1163934.532130301,180,1E+40]
[200,4.7517408167775162E-3,200,5.6542987889692392E-2,200,7024600.6630576923,200,1E+40,null,null,200,213371431.90892941,200,186.08719099855151,200,12105905.776615122,200,1E+40]
[250,3.7821355398601803E-3,250,0.10564192515853399,250,1E+40,250,1E+40,null,null,250,268471.73618382087,250,10.673679164516503,250,1E+40,250,1E+40]
[]
["Compared with source concentrations in mg/L",null,null,null,null,null,null,null,null,null,"Compared with source concentrations in mg/L"]
[null,0.01,null,0.5,null,6,null,100,null,null,null,0.01,null,0.5,null,6,null,100]
[]
[]
["Pollutant Linkage: Infill, Geo Barrier, Sst Unsaturated, Sst Saturated, Principal Aquifer",null,null,null,null,null,null,null,null,null,"Pollutant Linkage: Infill, Geo Barrier, Sst Unsaturated, Sst Saturated, Principal Aquifer at Site Boundary"]
["Dilution Factor",null,null,null,null,null,null,null,null,null,"Dilution Factor"]
[]
[null,12.83921468512464,"for all species and timeslices",null,null,null,null,null,null,null,null,12.83921468512464,"for all species and timeslices"]
[]
[]
["Pollutant Linkage: Infill, Geo Barrier, Sst Unsaturated, Sst Saturated, Principal Aquifer",null,null,null,null,null,null,null,null,null,"Pollutant Linkage: Infill, Geo Barrier, Sst Unsaturated, Sst Saturated, Principal Aquifer at Site Boundary"]
["Attenuation Factor",null,null,null,null,null,null,null,null,null,"Attenuation Factor"]
[]
[null,"Species1",null,"Species2",null,"Species3",null,"Species4",null,null,null,"Species1",null,"Species2",null,"Species3",null,"Species4"]
["Time(years)","Hg","Time(years)","Pb","Time(years)","Benzene","Time(years)","BaP",null,null,"Time(years)","Hg","Time(years)","Pb","Time(years)","Benzene","Time(years)","BaP"]
[1,1E+40,1,3.8943191796558557E-2,1,1E+40,1,7.7886383593117108,null,null,1,1E+40,1,3.8943191796558557E-2,1,1E+40,1,7.7886383593117108]
[2,1E+40,2,1.9471595898279279E-2,2,1E+40,2,3.8943191796558554,null,null,2,1E+40,2,1.9471595898279279E-2,2,1E+40,2,3.8943191796558554]
[5,1.7831073972273365E+32,5,7.7886383593117111E-3,5,1E+40,5,1.5577276718623423,null,null,5,1E+40,5,7.7886383593117111E-3,5,1E+40,5,1.5577276718623423]
[10,1E+40,10,3.8943191796558555E-3,10,1E+40,10,0.77886383593117114,null,null,10,1E+40,10,3.8943191796558555E-3,10,1E+40,10,0.77886383593117114]
[15,1.4429458661100067E+19,15,2.596212786437237E-3,15,2339423268634.5513,15,0.51924255728744739,null,null,15,1E+40,15,2.596212786437237E-3,15,1E+40,15,0.51924255728744739]
[20,6.600041203136279E+17,20,1.9471595898279278E-3,20,1624804176.3882415,20,0.38943191796558557,null,null,20,1E+40,20,1.9471595898279278E-3,20,3.6801594071598299E+30,20,0.38943191796558557]
[30,341495193053.17188,30,1.2981063932186185E-3,30,1296719.3810064562,30,0.2596212786437237,null,null,30,1E+40,30,1.2981063932186185E-3,30,1.5093676654919055E+24,30,0.2596212786437237]
[40,214563986.33980408,40,9.7357979491396389E-4,40,41323.653133316388,40,0.19471595898279279,null,null,40,1.2410613771271647E+30,40,9.7357979491396389E-4,40,7.8974258392251249E+20,40,0.19471595898279279]
[50,2773040.8991442723,50,7.7886383593117115E-4,50,5753.3479579561426,50,0.15577276718623423,null,null,50,1E+40,50,7.7886383593117115E-4,50,2.9901034574650208E+19,50,0.15577276718623423]
[60,161477.34072270733,60,6.4905319660930926E-4,60,1677.5708788636059,60,0.12981063932186185,null,null,60,3.5726253071407575E+23,60,6.4905319660930926E-4,60,1E+40,60,0.12981063932186185]
[70,22184.752037368442,70,5.563313113794079E-4,70,747.01270622368509,70,0.11126626227588159,null,null,70,1E+40,70,5.563313113794079E-4,70,5.814938492977904E+16,70,0.11126626227588159]
[80,5208.6221106507619,80,4.8678989745698194E-4,80,433.44986488207951,80,9.7357979491396393E-2,null,null,80,1.3396829529592173E+20,80,4.8678989745698194E-4,80,1E+40,80,9.7357979491396393E-2]
[90,1747.3220389639091,90,4.327021310728728E-4,90,299.90084473166411,90,8.6540426214574556E-2,null,null,90,1E+40,90,4.327021310728728E-4,90,304019849688588.94,90,8.6540426214574556E-2]
[100,752.19883667143461,100,3.8943191796558558E-4,100,234.51639534544586,100,7.7886383593117114E-2,null,null,100,8.5727786730136351E+18,100,3.8943191796558558E-4,100,8105644620943.6455,100,7.7886383593117114E-2]
[120,229.13435258554972,120,3.2452659830465463E-4,120,182.55769129158838,120,6.4905319660930924E-2,null,null,120,1E+40,120,3.2452659830465463E-4,120,32836221387.784622,120,6.4905319660930924E-2]
[140,106.53463648304907,140,2.7816565568970395E-4,140,173.85788192747535,140,5.5633131137940793E-2,null,null,140,7619624840348669,140,2.7816565568970395E-4,140,687795765.60334861,140,5.5633131137940793E-2]
[160,64.284798221062147,160,2.4339494872849097E-4,160,186.81250798012076,160,4.8678989745698197E-2,null,null,160,1E+40,160,2.4339494872849097E-4,160,40192579.370097019,160,4.8678989745698197E-2]
[180,46.008271018137158,180,2.163510655364364E-4,180,216.65420096611965,180,4.3270213107287278E-2,null,null,180,61919641479567.039,180,2.163510655364364E-4,180,4654453.6300103581,180,4.3270213107287278E-2]
[200,37.009590799060518,200,1.9471595898279279E-4,200,264.2357306566534,200,3.8943191796558557E-2,null,null,200,1661872919347.1543,200,1.9471595898279279E-4,200,869619.50039273,200,3.8943191796558557E-2]
[250,29.457685945871106,250,1.5577276718623423E-4,250,493.68405038477681,250,3.1154553437246844E-2,null,null,250,2091029262.8323212,250,1.5577276718623423E-4,250,49880.056185443646,250,3.1154553437246844E-2]
[]
[]
["Saved  21/07/2022: 12:08:16  Level Number: 5"]
[]
["BREAKTHROUGH RESULTS"]
[]
["Advanced"]
["Pollutant Linkage: Infill, Geo Barrier, Sst Unsaturated, Sst Saturated, Principal Aquifer",null,null,null,null,null,null,null,null,null,"Pollutant Linkage: Infill, Geo Barrier, Sst Unsaturated, Sst Saturated, Principal Aquifer at Site Boundary"]
["Concentrations in mg/L in Principal Aquifer",null,null,null,null,null,null,null,null,null,"Concentrations in mg/L in Principal Aquifer at Site Boundary"]
[]
["Compared with MRV target concentration in mg/L",null,null,null,null,null,null,null,null,null,"Compared with MRV target concentration in mg/L"]
[null,1.0000000000000001E-5,null,2.0000000000000001E-4,null,1E-3,null,4.9999999999999998E-8,null,null,null,1.0000000000000001E-5,null,2.0000000000000001E-4,null,1E-3,null,4.9999999999999998E-8]
[]
[null,"Species1",null,"Species2",null,"Species3",null,"Species4",null,null,null,"Species1",null,"Species2",null,"Species3",null,"Species4"]
["Time(years)","Hg","Time(years)","Pb","Time(years)","Benzene","Time(years)","BaP",null,null,"Time(years)","Hg","Time(years)","Pb","Time(years)","Benzene","Time(years)","BaP"]
[1,0,1,0,1,0.1263550131634629,1,0,null,null,1,0,1,0,1,2.8597748711439119E-2,1,0]
[2,0,2,0,2,0.14265907920044968,2,0,null,null,2,0,2,0,2,8.0239502450398251E-2,2,0]
[5,0,5,0,5,0.10797570277602725,5,0,null,null,5,0,5,0,5,6.2532217439618246E-2,5,0]
[10,0,10,0,10,6.7433056715349049E-2,10,0,null,null,10,0,10,0,10,3.905266708615672E-2,10,0]
[15,7.5662217475266401E-25,15,1.3185518692310604E-17,15,4.2113336008079053E-2,15,0,null,null,15,0,15,9.964604932733786E-40,15,2.4389196872103742E-2,15,0]
[20,1.7735861186322929E-23,20,2.2535201397178612E-13,20,2.6300647623821675E-2,20,0,null,null,20,0,20,6.2405436400918411E-34,20,1.5231556974466699E-2,20,0]
[30,1.1225653859942639E-19,30,3.2559503306183305E-9,30,1.02579370441741E-2,30,0,null,null,30,0,30,0,30,5.9407037232618084E-3,30,0]
[40,2.4722550953069909E-15,40,3.534574766384884E-7,40,4.0008622042607281E-3,40,0,null,null,40,4.6560465738249116E-37,40,0,40,2.3170290050311855E-3,40,0]
[50,8.5964108030704437E-13,50,5.4453617675385032E-6,50,1.5604400951185046E-3,50,0,null,null,50,2.0296787257553668E-31,50,0,50,9.0370149266521952E-4,50,0]
[60,4.0471244682990402E-11,60,3.1563308732026783E-5,60,6.0861192669862355E-4,60,0,null,null,60,0,60,1.6886712146020773E-19,60,3.5246694991556088E-4,60,0]
[70,6.0960174990026278E-10,70,1.0453606292029523E-4,70,2.3737415639086366E-4,70,0,null,null,70,1.4849408042841287E-26,70,0,70,1.374711168080989E-4,70,0]
[80,4.5086232608432475E-9,80,2.4392321234103479E-4,80,9.2581760084327428E-5,80,0,null,null,80,0,80,6.9228952143057473E-18,80,5.3617137888401582E-5,80,0]
[90,2.0763079838932726E-8,90,4.5071427277181654E-4,90,3.6108957767020133E-5,90,0,null,null,90,8.5435457928918687E-24,90,0,90,2.0911899886615277E-5,90,0]
[100,6.8650833407355628E-8,100,7.0764355674425431E-4,100,1.4083097330197162E-5,100,0,null,null,100,0,100,1.5224544147561847E-15,100,8.1560037201016442E-6,100,0]
[120,3.8733253847132901E-7,120,1.2625062852065711E-3,120,2.1418675689105472E-6,120,0,null,null,120,2.1301633707421551E-21,120,6.6593374225921395E-13,120,1.2404416879263052E-6,120,0]
[140,1.2423355764125265E-6,140,1.7144685790329325E-3,140,3.2537819524255634E-7,140,0,null,null,140,0,140,5.1396878746018833E-11,140,1.8844796497578656E-7,140,0]
[160,2.8071585200591041E-6,160,1.972076938823232E-3,160,4.9068801393085948E-8,160,0,null,null,160,7.7041716549262342E-20,160,1.2672683486414073E-9,160,2.8424368327857468E-8,160,0]
[180,5.0348501466941647E-6,180,2.0383081208279396E-3,180,7.0522972241589187E-9,180,0,null,null,180,0,180,1.4610693849586177E-8,180,4.0888040246994028E-9,180,0]
[200,7.6994324018097352E-6,200,1.9604734108625036E-3,200,6.7705256783320393E-10,200,0,null,null,200,1.2140327102120467E-17,200,9.8957672198275279E-8,200,3.9486993929948162E-10,200,0]
[250,1.4395308676834639E-5,250,1.4714817393345102E-3,250,0,250,0,null,null,250,1.891991131265597E-14,250,2.6709581952397963E-6,250,0,250,0]
[]
[]
["Pollutant Linkage: Infill, Geo Barrier, Sst Unsaturated, Sst Saturated, Principal Aquifer",null,null,null,null,null,null,null,null,null,"Pollutant Linkage: Infill, Geo Barrier, Sst Unsaturated, Sst Saturated, Principal Aquifer at Site Boundary"]
["Remedial Target Concentrations in mg/L in Infill",null,null,null,null,null,null,null,null,null,"Remedial Target Concentrations in mg/L in Infill"]
[]
[null,"Species1",null,"Species2",null,"Species3",null,"Species4",null,null,null,"Species1",null,"Species2",null,"Species3",null,"Species4"]
["Time(years)","Hg","Time(years)","Pb","Time(years)","Benzene","Time(years)","BaP",null,null,"Time(years)","Hg","Time(years)","Pb","Time(years)","Benzene","Time(years)","BaP"]
[1,1E+40,1,1E+40,1,4.7485254837003756E-2,1,1E+40,null,null,1,1E+40,1,1E+40,1,0.20980672501678413,1,1E+40]
[2,1E+40,2,1E+40,2,4.2058311560874619E-2,2,1E+40,null,null,2,1E+40,2,1E+40,2,7.477613665051111E-2,2,1E+40]
[5,1E+40,5,1E+40,5,5.5568056940048176E-2,5,1E+40,null,null,5,1E+40,5,1E+40,5,9.5950539508592697E-2,5,1E+40]
[10,1E+40,10,1E+40,10,8.8977132170167297E-2,10,1E+40,null,null,10,1E+40,10,1E+40,10,0.15363867432569961,10,1E+40]
[15,1.3216636167541549E+17,15,7584077830651.9697,15,0.14247268368501978,15,1E+40,null,null,15,1E+40,15,1.0035520793353224E+35,15,0.24601056080131831,15,1E+40]
[20,5638294016256473,20,443750194.36267352,20,0.22813126451553731,20,1E+40,null,null,20,1E+40,20,1.6024244964422412E+29,20,0.39391902023266911,20,1E+40]
[30,890816706515.75745,30,30712.999230860263,30,0.5849129288044953,30,1E+40,null,null,30,1E+40,30,1E+40,30,1.0099813556609476,30,1E+40]
[40,40448900.354104668,40,282.91946446015817,40,1.4996767430806004,40,1E+40,null,null,40,2.1477448391984333E+29,40,1E+40,40,2.5895230430743981,40,1E+40]
[50,116327.61892240221,50,18.364252784109063,50,3.8450691050362571,50,1E+40,null,null,50,4.926888119339376E+23,50,1E+40,50,6.6393605064263497,50,1E+40]
[60,2470.8901538189871,60,3.1682356513698329,60,9.8584988837576955,60,1E+40,null,null,60,1E+40,60,592181587127748,60,17.022872645044867,60,1E+40]
[70,164.04152385776624,70,0.95660767400668423,70,25.276551125979843,70,1E+40,null,null,70,6.7342751786128435E+18,70,1E+40,70,43.645531798331319,70,1E+40]
[80,22.179719664866614,80,0.40996508302861989,80,64.80758190960016,80,1E+40,null,null,80,1E+40,80,14444823575164.912,80,111.9045185233193,80,1E+40]
[90,4.8162411730696428,90,0.22187005391468284,90,166.16375467585661,90,1E+40,null,null,90,1.1704742085329354E+16,90,1E+40,90,286.91797648860768,90,1E+40]
[100,1.4566465552810821,100,0.14131408255885594,100,426.04264241891741,100,1E+40,null,null,100,1E+40,100,65683411621.893867,100,735.65439716660956,100,1E+40]
[120,0.25817608919371016,120,7.9207526466799349E-2,120,2801.2936406950116,120,1E+40,null,null,120,46944756150397.852,120,150165089.48885056,120,4836.986743028956,120,1E+40]
[140,8.049354932647787E-2,140,5.8327111516039712E-2,140,18440.080152043505,140,1E+40,null,null,140,1E+40,140,1945643.4406096293,140,31839.027822725137,140,1E+40]
[160,3.5623210903634517E-2,160,5.0707960745016122E-2,160,122277.28882013066,160,1E+40,null,null,160,1297998077912.2124,160,78909.885271897147,160,211086.48504669374,160,1E+40]
[180,1.986156431401619E-2,180,4.9060296124111523E-2,180,850786.60318596836,180,1E+40,null,null,180,1E+40,180,6844.3019222411767,180,1467421.760435462,180,1E+40]
[200,1.2987970382920074E-2,200,5.1008087865882019E-2,200,8861941.1328754276,200,1E+40,null,null,200,8237010350.6135101,200,1010.5330671040471,200,15194876.598214315,200,1E+40]
[250,6.9467075868211844E-3,250,6.7958709460591626E-2,250,1E+40,250,1E+40,null,null,250,5285437.0375989908,250,37.439747345436118,250,1E+40,250,1E+40]
[]
["Compared with source concentrations in mg/L",null,null,null,null,null,null,null,null,null,"Compared with source concentrations in mg/L"]
[null,0.01,null,0.5,null,6,null,100,null,null,null,0.01,null,0.5,null,6,null,100]
[]
[]
["Pollutant Linkage: Infill, Geo Barrier, Sst Unsaturated, Sst Saturated, Principal Aquifer",null,null,null,null,null,null,null,null,null,"Pollutant Linkage: Infill, Geo Barrier, Sst Unsaturated, Sst Saturated, Principal Aquifer at Site Boundary"]
["Dilution Factor",null,null,null,null,null,null,null,null,null,"Dilution Factor"]
[]
[null,12.83921468512464,"for all species and timeslices",null,null,null,null,null,null,null,null,12.83921468512464,"for all species and timeslices"]
[]
[]
["Pollutant Linkage: Infill, Geo Barrier, Sst Unsaturated, Sst Saturated, Principal Aquifer",null,null,null,null,null,null,null,null,null,"Pollutant Linkage: Infill, Geo Barrier, Sst Unsaturated, Sst Saturated, Principal Aquifer at Site Boundary"]
["Attenuation Factor",null,null,null,null,null,null,null,null,null,"Attenuation Factor"]
[]
[null,"Species1",null,"Species2",null,"Species3",null,"Species4",null,null,null,"Species1",null,"Species2",null,"Species3",null,"Species4"]
["Time(years)","Hg","Time(years)","Pb","Time(years)","Benzene","Time(years)","BaP",null,null,"Time(years)","Hg","Time(years)","Pb","Time(years)","Benzene","Time(years)","BaP"]
[1,1E+40,1,3.8943191796558557E-2,1,1E+40,1,7.7886383593117108,null,null,1,1E+40,1,3.8943191796558557E-2,1,1E+40,1,7.7886383593117108]
[2,1E+40,2,1.9471595898279279E-2,2,1E+40,2,3.8943191796558554,null,null,2,1E+40,2,1.9471595898279279E-2,2,1E+40,2,3.8943191796558554]
[5,1E+40,5,7.7886383593117111E-3,5,1E+40,5,1.5577276718623423,null,null,5,1E+40,5,7.7886383593117111E-3,5,1E+40,5,1.5577276718623423]
[10,1E+40,10,3.8943191796558555E-3,10,1E+40,10,0.77886383593117114,null,null,10,1E+40,10,3.8943191796558555E-3,10,1E+40,10,0.77886383593117114]
[15,1.0293959943558061E+21,15,2.596212786437237E-3,15,3.5441783707092884E+16,15,0.51924255728744739,null,null,15,1E+40,15,2.596212786437237E-3,15,4.6897825324068719E+38,15,0.51924255728744739]
[20,4.3914633056092856E+19,20,1.9471595898279278E-3,20,2073725871459.0876,20,0.38943191796558557,null,null,20,1E+40,20,1.9471595898279278E-3,20,7.488422940534475E+32,20,0.38943191796558557]
[30,6938249171484350,30,1.2981063932186185E-3,30,143527466.3633936,30,0.2596212786437237,null,null,30,1E+40,30,1.2981063932186185E-3,30,1E+40,30,0.2596212786437237]
[40,315041856889.9566,40,9.7357979491396389E-4,40,1322134.4360941884,40,0.19471595898279279,null,null,40,1.6728007840594679E+33,40,9.7357979491396389E-4,40,1E+40,40,0.19471595898279279]
[50,906033754.98641658,50,7.7886383593117115E-4,50,85819.514204645238,50,0.15577276718623423,null,null,50,3.8373749798323795E+27,50,7.7886383593117115E-4,50,1E+40,50,0.15577276718623423]
[60,19244869.833680172,60,6.4905319660930926E-4,60,14805.745035358801,60,0.12981063932186185,null,null,60,1E+40,60,6.4905319660930926E-4,60,2.7673729351087606E+18,60,0.12981063932186185]
[70,1277660.1052385455,70,5.563313113794079E-4,70,4470.4027347482479,70,0.11126626227588159,null,null,70,5.245083397830472E+22,70,5.563313113794079E-4,70,1E+40,70,0.11126626227588159]
[80,172749.81538056038,80,4.8678989745698194E-4,80,1915.8418629930716,80,9.7357979491396393E-2,null,null,80,1E+40,80,4.8678989745698194E-4,80,6.7503304194611736E+16,80,9.7357979491396393E-2]
[90,37511.960748266654,90,4.327021310728728E-4,90,1036.8393676214737,90,8.6540426214574556E-2,null,null,90,9.1164003191646339E+19,90,4.327021310728728E-4,90,1E+40,90,8.6540426214574556E-2]
[100,11345.293236421503,100,3.8943191796558558E-4,100,660.38657047730828,100,7.7886383593117114E-2,null,null,100,1E+40,100,3.8943191796558558E-4,100,306950603597245.94,100,7.7886383593117114E-2]
[120,2010.8401917512126,120,3.2452659830465463E-4,120,370.15126739130659,120,6.4905319660930924E-2,null,null,120,3.6563572852152307E+17,120,3.2452659830465463E-4,120,701748945733.40234,120,6.4905319660930924E-2]
[140,626.93514596135469,140,2.7816565568970395E-4,140,272.57326688500723,140,5.5633131137940793E-2,null,null,140,1E+40,140,2.7816565568970395E-4,140,9092347881.0452251,140,5.5633131137940793E-2]
[160,277.45630692589896,160,2.4339494872849097E-4,160,236.967580908663,160,4.8678989745698197E-2,null,null,160,1.0109637619939928E+16,160,2.4339494872849097E-4,160,368760335.61455053,160,4.8678989745698197E-2]
[180,154.69454169208311,180,2.163510655364364E-4,180,229.267742586868,180,4.3270213107287278E-2,null,null,180,1E+40,180,2.163510655364364E-4,180,31984675.4965671,180,4.3270213107287278E-2]
[200,101.15860433401569,200,1.9471595898279279E-4,200,238.37012987241053,200,3.8943191796558557E-2,null,null,200,64155094782835.992,200,1.9471595898279279E-4,200,4722405.9658796974,200,3.8943191796558557E-2]
[250,54.105393181637154,250,1.5577276718623423E-4,250,317.58348681245019,250,3.1154553437246844E-2,null,null,250,41166357656.770355,250,1.5577276718623423E-4,250,174962.79140256153,250,3.1154553437246844E-2]
[]
[]
["Saved  21/07/2022: 12:13:10  Level Number: 5"]
[]
["BREAKTHROUGH RESULTS"]
[]
["Advanced"]
["Pollutant Linkage: Infill, Geo Barrier, Sst Unsaturated, Sst Saturated, Principal Aquifer",null,null,null,null,null,null,null,null,null,"Pollutant Linkage: Infill, Geo Barrier, Sst Unsaturated, Sst Saturated, Principal Aquifer at Site Boundary"]
["Concentrations in mg/L in Principal Aquifer",null,null,null,null,null,null,null,null,null,"Concentrations in mg/L in Principal Aquifer at Site Boundary"]
[]
["Compared with MRV target concentration in mg/L",null,null,null,null,null,null,null,null,null,"Compared with MRV target concentration in mg/L"]
[null,1.0000000000000001E-5,null,2.0000000000000001E-4,null,1E-3,null,4.9999999999999998E-8,null,null,null,1.0000000000000001E-5,null,2.0000000000000001E-4,null,1E-3,null,4.9999999999999998E-8]
[]
[null,"Species1",null,"Species2",null,"Species3",null,"Species4",null,null,null,"Species1",null,"Species2",null,"Species3",null,"Species4"]
["Time(years)","Hg","Time(years)","Pb","Time(years)","Benzene","Time(years)","BaP",null,null,"Time(years)","Hg","Time(years)","Pb","Time(years)","Benzene","Time(years)","BaP"]
[1,0,1,0,1,1.8260552079646556E-2,1,0,null,null,1,0,1,0,1,1.3044226250235357E-3,1,0]
[2,0,2,0,2,5.4654492197134016E-2,2,0,null,null,2,0,2,0,2,2.4976841308145453E-2,2,0]
[5,0,5,0,5,4.6140351060694813E-2,5,0,null,null,5,0,5,0,5,2.6717919717637914E-2,5,0]
[10,0,10,2.849236306830494E-27,10,2.8816964963283686E-2,10,0,null,null,10,0,10,0,10,1.6688837711182888E-2,10,0]
[15,4.5580342664971618E-33,15,0,15,1.7996789559963051E-2,15,0,null,null,15,0,15,0,15,1.0422523689881232E-2,15,0]
[20,1.8338110975790748E-29,20,0,20,1.1239366631208824E-2,20,0,null,null,20,0,20,0,20,6.5090812284102325E-3,20,0]
[30,0,30,2.3370443117652761E-17,30,4.3836455807903475E-3,30,0,null,null,30,0,30,1.8837763925522064E-31,30,2.5387111613194152E-3,30,0]
[40,0,40,3.0222040518631478E-13,40,1.7097358369576733E-3,40,0,null,null,40,0,40,0,40,9.9016343794835365E-4,40,0]
[50,3.0806807840964772E-21,50,8.4189601306589406E-11,50,6.6684139696541588E-4,50,0,null,null,50,5.1530566669105415E-38,50,0,50,3.8618948944866112E-4,50,0]
[60,2.4534918778499769E-19,60,3.4503669108103244E-9,60,2.6008539882020534E-4,60,0,null,null,60,1.0461380540577377E-33,60,6.8555250000990911E-22,60,1.5062391208667817E-4,60,0]
[70,5.9057695142819594E-17,70,4.7290308560792887E-8,70,1.0143996032691593E-4,70,0,null,null,70,7.4541642103385884E-31,70,0,70,5.8747195212974581E-5,70,0]
[80,3.5129349936411922E-15,80,3.2667955559477466E-7,80,3.9564102622046951E-5,80,0,null,null,80,0,80,1.4912653508707733E-19,80,2.2912877138144104E-5,80,0]
[90,8.2643038052860481E-14,90,1.4286657124495216E-6,90,1.543090352138407E-5,90,0,null,null,90,3.3144352558162267E-27,90,0,90,8.9365559786546255E-6,90,0]
[100,1.0160202867261765E-12,100,4.536226774436165E-6,100,6.0183255326269369E-6,100,0,null,null,100,0,100,4.1316574999179177E-18,100,3.4854239203250723E-6,100,0]
[120,4.1985036313113245E-11,120,2.4113856019459412E-5,120,9.1532907262638166E-7,120,0,null,null,120,6.9701282241544536E-24,120,0,120,5.3010866743187447E-7,120,0]
[140,5.7142122267598908E-10,140,7.4170049476843171E-5,140,1.3906100047282647E-7,140,0,null,null,140,0,140,6.5295482260855776E-15,140,8.0543380253157618E-8,140,0]
[160,3.8889499144811142E-9,160,1.6243561696042518E-4,160,2.0978334885888878E-8,160,0,null,null,160,1.64296105027042E-21,160,5.26108419215957E-13,160,1.2155604180690341E-8,160,0]
[180,1.66940790107946E-8,180,2.8432713576749655E-4,180,3.0201955132684545E-9,180,0,null,null,180,0,180,1.5680005345375853E-11,180,1.7538665360134046E-9,180,0]
[200,5.1965704296689769E-8,200,4.2634039131843879E-4,200,2.9360825803531994E-10,200,0,null,null,200,4.6514287525049526E-20,200,2.2901147375872357E-10,200,1.7364995068609051E-10,200,0]
[250,3.6366517161134124E-7,250,7.6873427939279338E-4,250,0,250,0,null,null,250,7.0446119028230304E-19,250,2.5440112665209848E-8,250,0,250,0]
[]
[]
["Pollutant Linkage: Infill, Geo Barrier, Sst Unsaturated, Sst Saturated, Principal Aquifer",null,null,null,null,null,null,null,null,null,"Pollutant Linkage: Infill, Geo Barrier, Sst Unsaturated, Sst Saturated, Principal Aquifer at Site Boundary"]
["Remedial Target Concentrations in mg/L in Infill",null,null,null,null,null,null,null,null,null,"Remedial Target Concentrations in mg/L in Infill"]
[]
[null,"Species1",null,"Species2",null,"Species3",null,"Species4",null,null,null,"Species1",null,"Species2",null,"Species3",null,"Species4"]
["Time(years)","Hg","Time(years)","Pb","Time(years)","Benzene","Time(years)","BaP",null,null,"Time(years)","Hg","Time(years)","Pb","Time(years)","Benzene","Time(years)","BaP"]
[1,1E+40,1,1E+40,1,0.32857714125125914,1,1E+40,null,null,1,1E+40,1,1E+40,1,4.599736224210111,1,1E+40]
[2,1E+40,2,1E+40,2,0.10978054609598274,2,1E+40,null,null,2,1E+40,2,1E+40,2,0.24022252958156398,2,1E+40]
[5,1E+40,5,1E+40,5,0.13003802229652234,5,1E+40,null,null,5,1E+40,5,1E+40,5,0.2245683819477563,5,1E+40]
[10,1E+40,10,3.5097124011886734E+22,10,0.20821068449244148,10,1E+40,null,null,10,1E+40,10,1E+40,10,0.3595217416476828,10,1E+40]
[15,2.1939282189041061E+25,15,1E+40,15,0.33339279653233433,15,1E+40,null,null,15,1E+40,15,1E+40,15,0.57567631204572223,15,1E+40]
[20,5.453124377533546E+21,20,1E+40,20,0.53383791070037234,20,1E+40,null,null,20,1E+40,20,1E+40,20,0.92178908043300456,20,1E+40]
[30,1E+40,30,4278909026096.5332,30,1.3687237915156072,30,1E+40,null,null,30,1E+40,30,5.3084856777781624E+26,30,2.3634039552895372,30,1E+40]
[40,1E+40,40,330884342.30094874,40,3.5093140532612805,40,1E+40,null,null,40,1E+40,40,1E+40,40,6.0596056873521489,40,1E+40]
[50,32460357631415.125,50,1187795.1486649117,50,8.9976417590511044,50,1E+40,null,null,50,1.9405957757486474E+30,50,1E+40,50,15.536414542420172,50,1E+40]
[60,407582355999.60968,60,28982.424937675642,60,23.069345788795108,60,1E+40,null,null,60,9.5589678257207238E+25,60,1.458677490032559E+17,60,39.834312606003984,60,1E+40]
[70,1693259443.2981067,70,2114.5981712394091,70,59.148288117064347,70,1E+40,null,null,70,1.3415320239565495E+23,70,1E+40,70,102.13253548953897,70,1E+40]
[80,28466225.586585369,80,306.1103711186741,80,151.6526245348611,80,1E+40,null,null,80,1E+40,80,670571471010229.25,80,261.86148355902145,80,1E+40]
[90,1210023.2803159729,90,69.995380394861442,90,388.83011559791231,90,1E+40,null,null,90,3.0171052466485301E+19,90,1E+40,90,671.39958775296384,90,1E+40]
[100,98423.231609105263,100,22.044753265764498,100,996.95504463366274,100,1E+40,null,null,100,1E+40,100,24203361484340.527,100,1721.4548752624623,100,1E+40]
[120,2381.8009648539205,120,4.1469933269611445,120,6555.0195874190003,120,1E+40,null,null,120,1.4346938360969824E+16,120,1E+40,120,11318.434065730635,120,1E+40]
[140,175.0022505844216,140,1.3482531116717305,140,43146.532669829627,140,1E+40,null,null,140,1E+40,140,15314995239.716511,140,74494.017772053674,140,1E+40]
[160,25.713882204456876,160,0.61562852945215452,160,286009.35358486976,160,1E+40,null,null,160,60865715583178.742,160,190074890.17002785,160,493599.48800662969,160,1E+40]
[180,5.9901477604927322,180,0.35170754887698524,180,1986626.3537047647,180,1E+40,null,null,180,1E+40,180,6377548.8462757906,180,3421012.8745817766,180,1E+40]
[200,1.9243460923586488,200,0.23455436556399084,200,20435392.519777913,200,1E+40,null,null,200,2149877066184.1614,200,436659.34443684516,200,34552270.106003575,200,1E+40]
[250,0.27497821569471792,250,0.13008396097411951,250,1E+40,250,1E+40,null,null,250,141952461511.65033,250,3930.8002018699053,250,1E+40,250,1E+40]
[]
["Compared with source concentrations in mg/L",null,null,null,null,null,null,null,null,null,"Compared with source concentrations in mg/L"]
[null,0.01,null,0.5,null,6,null,100,null,null,null,0.01,null,0.5,null,6,null,100]
[]
[]
["Pollutant Linkage: Infill, Geo Barrier, Sst Unsaturated, Sst Saturated, Principal Aquifer",null,null,null,null,null,null,null,null,null,"Pollutant Linkage: Infill, Geo Barrier, Sst Unsaturated, Sst Saturated, Principal Aquifer at Site Boundary"]
["Dilution Factor",null,null,null,null,null,null,null,null,null,"Dilution Factor"]
[]
[null,12.83921468512464,"for all species and timeslices",null,null,null,null,null,null,null,null,12.83921468512464,"for all species and timeslices"]
[]
[]
["Pollutant Linkage: Infill, Geo Barrier, Sst Unsaturated, Sst Saturated, Principal Aquifer",null,null,null,null,null,null,null,null,null,"Pollutant Linkage: Infill, Geo Barrier, Sst Unsaturated, Sst Saturated, Principal Aquifer at Site Boundary"]
["Attenuation Factor",null,null,null,null,null,null,null,null,null,"Attenuation Factor"]
[]
[null,"Species1",null,"Species2",null,"Species3",null,"Species4",null,null,null,"Species1",null,"Species2",null,"Species3",null,"Species4"]
["Time(years)","Hg","Time(years)","Pb","Time(years)","Benzene","Time(years)","BaP",null,null,"Time(years)","Hg","Time(years)","Pb","Time(years)","Benzene","Time(years)","BaP"]
[1,1E+40,1,3.8943191796558557E-2,1,1E+40,1,7.7886383593117108,null,null,1,1E+40,1,3.8943191796558557E-2,1,1E+40,1,7.7886383593117108]
[2,1E+40,2,1.9471595898279279E-2,2,1E+40,2,3.8943191796558554,null,null,2,1E+40,2,1.9471595898279279E-2,2,1E+40,2,3.8943191796558554]
[5,1E+40,5,7.7886383593117111E-3,5,1E+40,5,1.5577276718623423,null,null,5,1E+40,5,7.7886383593117111E-3,5,1E+40,5,1.5577276718623423]
[10,1E+40,10,3.8943191796558555E-3,10,1.6401528382830067E+26,10,0.77886383593117114,null,null,10,1E+40,10,3.8943191796558555E-3,10,1E+40,10,0.77886383593117114]
[15,1.7087713483332939E+29,15,2.596212786437237E-3,15,1E+40,15,0.51924255728744739,null,null,15,1E+40,15,2.596212786437237E-3,15,1E+40,15,0.51924255728744739]
[20,4.2472413704955566E+25,20,1.9471595898279278E-3,20,1E+40,20,0.38943191796558557,null,null,20,1E+40,20,1.9471595898279278E-3,20,1E+40,20,0.38943191796558557]
[30,1E+40,30,1.2981063932186185E-3,30,1.9996124985996344E+16,30,0.2596212786437237,null,null,30,1E+40,30,1.2981063932186185E-3,30,2.4807525107879891E+30,30,0.2596212786437237]
[40,1E+40,40,9.7357979491396389E-4,40,1546283088564.4778,40,0.19471595898279279,null,null,40,1E+40,40,9.7357979491396389E-4,40,1E+40,40,0.19471595898279279]
[50,2.5282198660501645E+17,50,7.7886383593117115E-4,50,5550784114.7375326,50,0.15577276718623423,null,null,50,1.511459869891418E+34,50,7.7886383593117115E-4,50,1E+40,50,0.15577276718623423]
[60,3174511572517201.5,60,6.4905319660930926E-4,60,135440175.96927166,60,0.12981063932186185,null,null,60,7.4451343482834878E+29,60,6.4905319660930926E-4,60,6.8166668716392684E+20,60,0.12981063932186185]
[70,13188185452338.426,70,5.563313113794079E-4,70,9881904.2586273924,70,0.11126626227588159,null,null,70,1.0448707782033059E+27,70,5.563313113794079E-4,70,1E+40,70,0.11126626227588159]
[80,221713136548.49927,80,4.8678989745698194E-4,80,1430509.7872068293,80,9.7357979491396393E-2,null,null,80,1E+40,80,4.8678989745698194E-4,80,3.1337032090622111E+18,80,9.7357979491396393E-2]
[90,9424433736.7291718,90,4.327021310728728E-4,90,327101.22283081966,90,8.6540426214574556E-2,null,null,90,2.3499141658127361E+23,90,4.327021310728728E-4,90,1E+40,90,8.6540426214574556E-2]
[100,766582957.1580981,100,3.8943191796558558E-4,100,103019.16654437728,100,7.7886383593117114E-2,null,null,100,1E+40,100,3.8943191796558558E-4,100,1.1310673780873334E+17,100,7.7886383593117114E-2]
[120,18550986.359106887,120,3.2452659830465463E-4,120,19379.658781307557,120,6.4905319660930924E-2,null,null,120,1.1174311445693025E+20,120,3.2452659830465463E-4,120,1E+40,120,6.4905319660930924E-2]
[140,1363029.2418677062,140,2.7816565568970395E-4,140,6300.6335421766889,140,5.5633131137940793E-2,null,null,140,1E+40,140,2.7816565568970395E-4,140,71569775638039.359,140,5.5633131137940793E-2]
[160,200276.12930445556,160,2.4339494872849097E-4,160,2876.9447877466259,160,4.8678989745698197E-2,null,null,160,4.7406104715810246E+17,160,2.4339494872849097E-4,160,888254748432.14368,160,4.8678989745698197E-2]
[180,46655.09462531883,180,2.163510655364364E-4,180,1643.5937438656713,180,4.3270213107287278E-2,null,null,180,1E+40,180,2.163510655364364E-4,180,29803452949.492661,180,4.3270213107287278E-2]
[200,14988.035791536169,200,1.9471595898279279E-4,200,1096.1154773854325,200,3.8943191796558557E-2,null,null,200,1.674461498548648E+16,200,1.9471595898279279E-4,200,2040589032.01963,200,3.8943191796558557E-2]
[250,2141.7058787349697,250,1.5577276718623423E-4,250,607.90615702454079,250,3.1154553437246844E-2,null,null,250,1105616386928359,250,1.5577276718623423E-4,250,18369348.741044495,250,3.1154553437246844E-2]
[]
[]
["Saved  21/07/2022: 12:14:32  Level Number: 5"]
[]
["BREAKTHROUGH RESULTS"]
[]
["Advanced"]
["Pollutant Linkage: Infill, Geo Barrier, Sst Unsaturated, Sst Saturated, Principal Aquifer",null,null,null,null,null,null,null,null,null,"Pollutant Linkage: Infill, Geo Barrier, Sst Unsaturated, Sst Saturated, Principal Aquifer at Site Boundary"]
["Concentrations in mg/L in Principal Aquifer",null,null,null,null,null,null,null,null,null,"Concentrations in mg/L in Principal Aquifer at Site Boundary"]
[]
["Compared with MRV target concentration in mg/L",null,null,null,null,null,null,null,null,null,"Compared with MRV target concentration in mg/L"]
[null,1.0000000000000001E-5,null,2.0000000000000001E-4,null,1E-3,null,4.9999999999999998E-8,null,null,null,1.0000000000000001E-5,null,2.0000000000000001E-4,null,1E-3,null,4.9999999999999998E-8]
[]
[null,"Species1",null,"Species2",null,"Species3",null,"Species4",null,null,null,"Species1",null,"Species2",null,"Species3",null,"Species4"]
["Time(years)","Hg","Time(years)","Pb","Time(years)","Benzene","Time(years)","BaP",null,null,"Time(years)","Hg","Time(years)","Pb","Time(years)","Benzene","Time(years)","BaP"]
[1,0,1,0,1,2.7836048487186331E-10,1,0,null,null,1,0,1,0,1,1.1732576947911402E-13,1,0]
[2,0,2,0,2,7.487316030680088E-6,2,0,null,null,2,0,2,0,2,5.0832047951963198E-7,2,0]
[5,0,5,0,5,3.5062563374513186E-4,5,0,null,null,5,0,5,0,5,1.8020703890505614E-4,5,0]
[10,0,10,0,10,2.6318772765544942E-4,10,0,null,null,10,0,10,0,10,1.5237956866211456E-4,10,0]
[15,0,15,0,15,1.6441501915407555E-4,15,0,null,null,15,0,15,0,15,9.5218040933423841E-5,15,0]
[20,0,20,0,20,1.0268059779619805E-4,20,0,null,null,20,0,20,0,20,5.9465659748541118E-5,20,0]
[30,0,30,4.9610699822486082E-35,30,4.0048106469643743E-5,30,0,null,null,30,0,30,0,30,2.3193155494339657E-5,30,0]
[40,0,40,0,40,1.561980435611278E-5,40,0,null,null,40,0,40,0,40,9.0459345308591317E-6,40,0]
[50,6.2857842301889559E-40,50,1.271000153623861E-26,50,6.0921306113514499E-6,50,0,null,null,50,0,50,6.8203114015527617E-39,50,3.5281501093902557E-6,50,0]
[60,1.349694205446234E-36,60,0,60,2.3760897498880611E-6,60,0,null,null,60,0,60,0,60,1.376070541416005E-6,60,0]
[70,2.5347786039572372E-33,70,0,70,9.2673695776961898E-7,70,0,null,null,70,0,70,8.6593306093825102E-33,70,5.367034435718117E-7,70,0]
[80,0,80,4.028952382518973E-23,80,3.614515145243804E-7,80,0,null,null,80,0,80,6.5941596486394009E-30,80,2.0932836604035459E-7,80,0]
[90,0,90,1.0138066568553575E-21,90,1.4097535176333077E-7,90,0,null,null,90,0,90,0,90,8.1643498678233156E-8,90,0]
[100,2.0929498774866515E-28,100,0,100,5.4983801030075729E-8,100,0,null,null,100,1.1555985526173147E-40,100,0,100,3.1843015630813478E-8,100,0]
[120,6.1317745882212732E-27,120,8.7107407413562271E-21,120,8.3635791299823288E-9,120,0,null,null,120,0,120,0,120,4.8437370906553968E-9,120,0]
[140,0,140,5.7739988358683905E-18,140,1.2715082229488832E-9,140,0,null,null,140,1.2465473867640187E-34,140,1.0908992222751939E-22,140,7.3647961545739197E-10,140,0]
[160,6.3608427030025508E-24,160,6.7092896430009315E-16,160,1.9253018948244625E-10,160,0,null,null,160,8.4860191988928337E-32,160,0,160,1.1159590398139549E-10,160,0]
[180,0,180,2.7296402897481466E-14,180,2.8309225124034562E-11,180,0,null,null,180,0,180,1.5413171548018265E-20,180,1.6478042289151757E-11,180,0]
[200,0,200,5.2014971521408934E-13,200,3.2745759386212846E-12,200,0,null,null,200,0,200,0,200,1.9685729163000104E-12,200,0]
[250,0,250,9.8420504866322064E-11,250,0,250,0,null,null,250,0,250,2.1149318236993271E-18,250,0,250,0]
[]
[]
["Pollutant Linkage: Infill, Geo Barrier, Sst Unsaturated, Sst Saturated, Principal Aquifer",null,null,null,null,null,null,null,null,null,"Pollutant Linkage: Infill, Geo Barrier, Sst Unsaturated, Sst Saturated, Principal Aquifer at Site Boundary"]
["Remedial Target Concentrations in mg/L in Infill",null,null,null,null,null,null,null,null,null,"Remedial Target Concentrations in mg/L in Infill"]
[]
[null,"Species1",null,"Species2",null,"Species3",null,"Species4",null,null,null,"Species1",null,"Species2",null,"Species3",null,"Species4"]
["Time(years)","Hg","Time(years)","Pb","Time(years)","Benzene","Time(years)","BaP",null,null,"Time(years)","Hg","Time(years)","Pb","Time(years)","Benzene","Time(years)","BaP"]
[1,1E+40,1,1E+40,1,21554783.548972327,1,1E+40,null,null,1,1E+40,1,1E+40,1,51139660337.519478,1,1E+40]
[2,1E+40,2,1E+40,2,801.35524871854625,2,1E+40,null,null,2,1E+40,2,1E+40,2,11803.577156029718,2,1E+40]
[5,1E+40,5,1E+40,5,17.112268535281629,5,1E+40,null,null,5,1E+40,5,1E+40,5,33.295036844599387,5,1E+40]
[10,1E+40,10,1E+40,10,22.797415568916126,10,1E+40,null,null,10,1E+40,10,1E+40,10,39.375357554032455,10,1E+40]
[15,1E+40,15,1E+40,15,36.493016458413202,15,1E+40,null,null,15,1E+40,15,1E+40,15,63.013268716536409,15,1E+40]
[20,1E+40,20,1E+40,20,58.433629417593451,20,1E+40,null,null,20,1E+40,20,1E+40,20,100.89856944952501,20,1E+40]
[30,1E+40,30,2.0156942022147195E+30,30,149.8198174375103,30,1E+40,null,null,30,1E+40,30,1E+40,30,258.697010911875,30,1E+40]
[40,1E+40,40,1E+40,40,384.12773061731161,40,1E+40,null,null,40,1E+40,40,1E+40,40,663.28138674138222,40,1E+40]
[50,1.5908913882173446E+32,50,7.8678196627184634E+21,50,984.87711160036804,50,1E+40,null,null,50,1E+40,50,1.466208712658388E+34,50,1700.6079146209956,50,1E+40]
[60,7.4090856726274636E+28,60,1E+40,60,2525.1571411739237,60,1E+40,null,null,60,1E+40,60,1E+40,60,4360.2415860351721,60,1E+40]
[70,3.9451177252278496E+25,70,1E+40,70,6474.3290420188059,70,1E+40,null,null,70,1E+40,70,1.1548236753040537E+28,70,11179.358120136956,70,1E+40]
[80,1E+40,80,2.4820347947988956E+18,80,16599.736780450789,80,1E+40,null,null,80,1E+40,80,1.5164934628271154E+25,80,28663.100531933222,80,1E+40]
[90,1E+40,90,9.8638137088369184E+16,90,42560.631521408024,90,1E+40,null,null,90,1E+40,90,1E+40,90,73490.236174796009,90,1E+40]
[100,4.7779452855357637E+20,100,1E+40,100,109123.04874517578,100,1E+40,null,null,100,8.6535241649022541E+32,100,1E+40,100,188424.36500247766,100,1E+40]
[120,1.630849251896723E+19,120,1.148007993456024E+16,120,717396.21360080049,120,1E+40,null,null,120,1E+40,120,1E+40,120,1238712.9787814622,120,1E+40]
[140,1E+40,140,17319019771669.27,140,4718805.503345306,140,1E+40,null,null,140,8.022157926911671E+26,140,9.166749591354432E+17,140,8146864.9967639493,140,1E+40]
[160,1.572118737550236E+16,160,149047075504.2139,160,31163943.774890661,160,1E+40,null,null,160,1.1784088352409921E+24,160,1E+40,160,53765414.194774382,160,1E+40]
[180,1E+40,180,3663486371.2839842,180,211945045.25332251,180,1E+40,null,null,180,1E+40,180,6487957373890218,180,364120924.96874291,180,1E+40]
[200,1E+40,200,192252340.19178656,200,1832298322.7337272,200,1E+40,null,null,200,1E+40,200,1E+40,200,3047893197.3102493,200,1E+40]
[250,1E+40,250,1016048.4355960505,250,1E+40,250,1E+40,null,null,250,1E+40,250,47282848023481.57,250,1E+40,250,1E+40]
[]
["Compared with source concentrations in mg/L",null,null,null,null,null,null,null,null,null,"Compared with source concentrations in mg/L"]
[null,0.01,null,0.5,null,6,null,100,null,null,null,0.01,null,0.5,null,6,null,100]
[]
[]
["Pollutant Linkage: Infill, Geo Barrier, Sst Unsaturated, Sst Saturated, Principal Aquifer",null,null,null,null,null,null,null,null,null,"Pollutant Linkage: Infill, Geo Barrier, Sst Unsaturated, Sst Saturated, Principal Aquifer at Site Boundary"]
["Dilution Factor",null,null,null,null,null,null,null,null,null,"Dilution Factor"]
[]
[null,12.83921468512464,"for all species and timeslices",null,null,null,null,null,null,null,null,12.83921468512464,"for all species and timeslices"]
[]
[]
["Pollutant Linkage: Infill, Geo Barrier, Sst Unsaturated, Sst Saturated, Principal Aquifer",null,null,null,null,null,null,null,null,null,"Pollutant Linkage: Infill, Geo Barrier, Sst Unsaturated, Sst Saturated, Principal Aquifer at Site Boundary"]
["Attenuation Factor",null,null,null,null,null,null,null,null,null,"Attenuation Factor"]
[]
[null,"Species1",null,"Species2",null,"Species3",null,"Species4",null,null,null,"Species1",null,"Species2",null,"Species3",null,"Species4"]
["Time(years)","Hg","Time(years)","Pb","Time(years)","Benzene","Time(years)","BaP",null,null,"Time(years)","Hg","Time(years)","Pb","Time(years)","Benzene","Time(years)","BaP"]
[1,1E+40,1,3.8943191796558557E-2,1,1E+40,1,7.7886383593117108,null,null,1,1E+40,1,3.8943191796558557E-2,1,1E+40,1,7.7886383593117108]
[2,1E+40,2,1.9471595898279279E-2,2,1E+40,2,3.8943191796558554,null,null,2,1E+40,2,1.9471595898279279E-2,2,1E+40,2,3.8943191796558554]
[5,1E+40,5,7.7886383593117111E-3,5,1E+40,5,1.5577276718623423,null,null,5,1E+40,5,7.7886383593117111E-3,5,1E+40,5,1.5577276718623423]
[10,1E+40,10,3.8943191796558555E-3,10,1E+40,10,0.77886383593117114,null,null,10,1E+40,10,3.8943191796558555E-3,10,1E+40,10,0.77886383593117114]
[15,1E+40,15,2.596212786437237E-3,15,1E+40,15,0.51924255728744739,null,null,15,1E+40,15,2.596212786437237E-3,15,1E+40,15,0.51924255728744739]
[20,1E+40,20,1.9471595898279278E-3,20,1E+40,20,0.38943191796558557,null,null,20,1E+40,20,1.9471595898279278E-3,20,1E+40,20,0.38943191796558557]
[30,1E+40,30,1.2981063932186185E-3,30,9.4197079104070685E+33,30,0.2596212786437237,null,null,30,1E+40,30,1.2981063932186185E-3,30,1E+40,30,0.2596212786437237]
[40,1E+40,40,9.7357979491396389E-4,40,1E+40,40,0.19471595898279279,null,null,40,1E+40,40,9.7357979491396389E-4,40,1E+40,40,0.19471595898279279]
[50,1.2390877691768267E+36,50,7.7886383593117115E-4,50,3.6767761217517565E+25,50,0.15577276718623423,null,null,50,1E+40,50,7.7886383593117115E-4,50,6.8518616533008968E+37,50,0.15577276718623423]
[60,5.7706688877253064E+32,60,6.4905319660930926E-4,60,1E+40,60,0.12981063932186185,null,null,60,1E+40,60,6.4905319660930926E-4,60,1E+40,60,0.12981063932186185]
[70,3.0727095246710188E+29,70,5.563313113794079E-4,70,1E+40,70,0.11126626227588159,null,null,70,1E+40,70,5.563313113794079E-4,70,5.3967023854286904E+31,70,0.11126626227588159]
[80,1E+40,80,4.8678989745698194E-4,80,1.1599002847150229E+22,80,9.7357979491396393E-2,null,null,80,1E+40,80,4.8678989745698194E-4,80,7.0868514937324324E+28,80,9.7357979491396393E-2]
[90,1E+40,90,4.327021310728728E-4,90,4.6095406693051164E+20,90,8.6540426214574556E-2,null,null,90,1E+40,90,4.327021310728728E-4,90,1E+40,90,8.6540426214574556E-2]
[100,3.7213687929616393E+24,100,3.8943191796558558E-4,100,1E+40,100,7.7886383593117114E-2,null,null,100,6.7399170253988524E+36,100,3.8943191796558558E-4,100,1E+40,100,7.7886383593117114E-2]
[120,1.2702095041577624E+23,120,3.2452659830465463E-4,120,5.3648514567768334E+19,120,6.4905319660930924E-2,null,null,120,1E+40,120,3.2452659830465463E-4,120,1E+40,120,6.4905319660930924E-2]
[140,1E+40,140,2.7816565568970395E-4,140,8.0934949043580736E+16,140,5.5633131137940793E-2,null,null,140,6.2481686954000753E+30,140,2.7816565568970395E-4,140,4.2837898498456845E+21,140,5.5633131137940793E-2]
[160,1.2244664304676468E+20,160,2.4339494872849097E-4,160,696524261769209.5,160,4.8678989745698197E-2,null,null,160,9.1782002571098244E+27,160,2.4339494872849097E-4,160,1E+40,160,4.8678989745698197E-2]
[180,1E+40,180,2.163510655364364E-4,180,17120142288118.861,180,4.3270213107287278E-2,null,null,180,1E+40,180,2.163510655364364E-4,180,3.031941220551637E+19,180,4.3270213107287278E-2]
[200,1E+40,200,1.9471595898279279E-4,200,898430370891.11597,200,3.8943191796558557E-2,null,null,200,1E+40,200,1.9471595898279279E-4,200,1E+40,200,3.8943191796558557E-2]
[250,1E+40,250,1.5577276718623423E-4,250,4748180292.2412319,250,3.1154553437246844E-2,null,null,250,1E+40,250,1.5577276718623423E-4,250,2.2096140231191667E+17,250,3.1154553437246844E-2]
[]
[]
["Saved  21/07/2022: 12:21:53  Level Number: 5"]
[]
["BREAKTHROUGH RESULTS"]
[]
["Advanced"]
["Pollutant Linkage: Infill, Geo Barrier, Sst Unsaturated, Sst Saturated, Principal Aquifer",null,null,null,null,null,null,null,null,null,"Pollutant Linkage: Infill, Geo Barrier, Sst Unsaturated, Sst Saturated, Principal Aquifer at Site Boundary"]
["Concentrations in mg/L in Principal Aquifer",null,null,null,null,null,null,null,null,null,"Concentrations in mg/L in Principal Aquifer at Site Boundary"]
[]
["Compared with MRV target concentration in mg/L",null,null,null,null,null,null,null,null,null,"Compared with MRV target concentration in mg/L"]
[null,1.0000000000000001E-5,null,2.0000000000000001E-4,null,1E-3,null,4.9999999999999998E-8,null,null,null,1.0000000000000001E-5,null,2.0000000000000001E-4,null,1E-3,null,4.9999999999999998E-8]
[]
[null,"Species1",null,"Species2",null,"Species3",null,"Species4",null,null,null,"Species1",null,"Species2",null,"Species3",null,"Species4"]
["Time(years)","Hg","Time(years)","Pb","Time(years)","Benzene","Time(years)","BaP",null,null,"Time(years)","Hg","Time(years)","Pb","Time(years)","Benzene","Time(years)","BaP"]
[1,0,1,0,1,2.1397345961176163E-4,1,0,null,null,1,0,1,0,1,2.8216384447872065E-6,1,0]
[2,0,2,0,2,6.4937606097939795E-3,2,0,null,null,2,0,2,0,2,1.7233999912242537E-3,2,0]
[5,0,5,0,5,1.0894409728956184E-2,5,0,null,null,5,0,5,0,5,6.2686285831441571E-3,5,0]
[10,0,10,0,10,6.8362405259606443E-3,10,0,null,null,10,0,10,0,10,3.9590860832093714E-3,10,0]
[15,0,15,6.1602067075060139E-31,15,4.2693749358497929E-3,15,0,null,null,15,0,15,0,15,2.4725332992915896E-3,15,0]
[20,0,20,6.2818210679300562E-27,20,2.6663127897074337E-3,20,0,null,null,20,0,20,0,20,1.5441480896373572E-3,20,0]
[30,8.2270112019330992E-33,30,0,30,1.0399314141071299E-3,30,0,null,null,30,0,30,1.4282902568230982E-38,30,6.022579616442572E-4,30,0]
[40,8.8800525862993614E-29,40,0,40,4.0560032827726062E-4,40,0,null,null,40,0,40,5.5700342762101815E-33,40,2.3489628915314957E-4,40,0]
[50,0,50,7.8634642338051658E-20,50,1.5819468284598428E-4,50,0,null,null,50,0,50,6.5161263364311956E-29,50,9.1615669340984964E-5,50,0]
[60,0,60,3.631032859700012E-17,60,6.1700034129523272E-5,60,0,null,null,60,2.4600169658400294E-40,60,0,60,3.573249392314389E-5,60,0]
[70,2.9462262507328415E-23,70,7.115478618812271E-15,70,2.4064604650609647E-5,70,0,null,null,70,8.4201996924642825E-38,70,0,70,1.3936597843432688E-5,70,0]
[80,0,80,3.7184956210692505E-13,80,9.385803999108154E-6,80,0,null,null,80,5.2514248945934591E-35,80,2.0608281002807008E-23,80,5.435628609087014E-6,80,0]
[90,8.9502384963641476E-22,90,7.9300504951349473E-12,90,3.6606872199884649E-6,90,0,null,null,90,2.2537162668733867E-32,90,3.2722834326132814E-22,90,2.1200275723564494E-6,90,0]
[100,6.8645884798030705E-23,100,9.0305310761116673E-11,100,1.4277408044656414E-6,100,0,null,null,100,6.816654243845136E-31,100,0,100,8.2685545772784839E-7,100,0]
[120,4.8451987076502443E-19,120,3.3371511693337898E-9,120,2.1715421527171411E-7,120,0,null,null,120,0,120,0,120,1.2576462797237946E-7,120,0]
[140,9.2855587405014059E-17,140,4.202728888980364E-8,140,3.2997615060137263E-8,140,0,null,null,140,0,140,2.7882084290004266E-18,140,1.9112809994935503E-8,140,0]
[160,4.8205948700239581E-15,160,2.7015117769540278E-7,160,4.9829590571054352E-9,160,0,null,null,160,1.922970691922089E-25,160,0,160,2.8880234421445726E-9,160,0]
[180,1.0148140360535393E-13,180,1.1099360129318465E-6,180,7.213342483446583E-10,180,0,null,null,180,2.7750144602364899E-24,180,1.680443384425936E-16,180,4.1953879881372406E-10,180,0]
[200,1.1370263512308532E-12,200,3.3369777530509275E-6,200,7.3506093147646117E-11,200,0,null,null,200,0,200,7.0380717456264045E-15,200,4.4010900857619283E-11,200,0]
[250,8.1953946603326141E-11,250,2.1945996425607831E-5,250,0,250,0,null,null,250,0,250,7.22221544524388E-12,250,0,250,0]
[]
[]
["Pollutant Linkage: Infill, Geo Barrier, Sst Unsaturated, Sst Saturated, Principal Aquifer",null,null,null,null,null,null,null,null,null,"Pollutant Linkage: Infill, Geo Barrier, Sst Unsaturated, Sst Saturated, Principal Aquifer at Site Boundary"]
["Remedial Target Concentrations in mg/L in Infill",null,null,null,null,null,null,null,null,null,"Remedial Target Concentrations in mg/L in Infill"]
[]
[null,"Species1",null,"Species2",null,"Species3",null,"Species4",null,null,null,"Species1",null,"Species2",null,"Species3",null,"Species4"]
["Time(years)","Hg","Time(years)","Pb","Time(years)","Benzene","Time(years)","BaP",null,null,"Time(years)","Hg","Time(years)","Pb","Time(years)","Benzene","Time(years)","BaP"]
[1,1E+40,1,1E+40,1,28.0408608193116,1,1E+40,null,null,1,1E+40,1,1E+40,1,2126.4241033732051,1,1E+40]
[2,1E+40,2,1E+40,2,0.9239638416837721,2,1E+40,null,null,2,1E+40,2,1E+40,2,3.481490095481417,2,1E+40]
[5,1E+40,5,1E+40,5,0.55074117361793706,5,1E+40,null,null,5,1E+40,5,1E+40,5,0.95714715274941031,5,1E+40]
[10,1E+40,10,1E+40,10,0.87767537979610022,10,1E+40,null,null,10,1E+40,10,1E+40,10,1.5155012732474344,10,1E+40]
[15,1E+40,15,1.6233221505075992E+26,15,1.4053579482134981,15,1E+40,null,null,15,1E+40,15,1E+40,15,2.4266609479917105,15,1E+40]
[20,1E+40,20,1.5918950718052105E+22,20,2.250298623312819,20,1E+40,null,null,20,1E+40,20,1E+40,20,3.8856376796147178,20,1E+40]
[30,1.2155082513623298E+25,30,1E+40,30,5.7696112634038599,30,1E+40,null,null,30,1E+40,30,7.0013780127876048E+33,30,9.9625083969318968,30,1E+40]
[40,1.1261194573812048E+21,40,1E+40,40,14.792887435481845,40,1E+40,null,null,40,1E+40,40,1.7953210885452471E+28,40,25.543187683514539,40,1E+40]
[50,1E+40,50,1271704137345704.5,50,37.92794986568228,50,1E+40,null,null,50,1E+40,50,1.5346541002574975E+24,50,65.490980343859746,50,1E+40]
[60,1E+40,60,2754037318413.6313,60,97.244678785826139,60,1E+40,null,null,60,4.0650126153033544E+32,60,1E+40,60,167.91439223092704,60,1E+40]
[70,3394172459604082,70,14053868384.287577,70,249.32884155435306,70,1E+40,null,null,70,1.1876202899260895E+30,70,1E+40,70,430.52114062596468,70,1E+40]
[80,1E+40,80,268925958.74899828,80,639.26329599149142,80,1E+40,null,null,80,1.9042450764735071E+27,80,4.852418306329345E+18,80,1103.8281736116955,80,1E+40]
[90,111728866264986.09,90,12610260.181993745,90,1639.0365085654346,90,1E+40,null,null,90,4.437115774947636E+24,90,3.055969999522288E+17,90,2830.1518707753835,90,1E+40]
[100,1456751563392606.8,100,1107354.5858729011,100,4202.4434555861926,100,1E+40,null,null,100,1.4669953385165689E+23,100,1E+40,100,7256.4073247912729,100,1E+40]
[120,206389884159.1506,120,29965.67878582601,120,27630.133693202792,120,1E+40,null,null,120,1E+40,120,1E+40,120,47708.168001878279,120,1E+40]
[140,1076941116.7884138,140,2379.4063962156097,140,181831.32293243502,140,1E+40,null,null,140,1E+40,140,35865324471402.602,140,313925.58193116949,140,1E+40]
[160,20744327.763744023,160,370.16310960802349,160,1204103.8128628246,160,1E+40,null,null,160,5.2002872649112429E+17,160,1E+40,160,2077545.4632544648,160,1E+40]
[180,985402.21604428254,180,90.095283723477408,180,8317919.2084238324,180,1E+40,null,null,180,3.6035848256977336E+16,180,595081041865.39709,180,14301418.645821147,180,1E+40]
[200,87948.709272874868,200,29.96723604422359,200,81625886.27786617,200,1E+40,null,null,200,1E+40,200,14208437142.196222,200,136329861.08170664,200,1E+40]
[250,1220.1974907202512,250,4.5566397652063015,250,1E+40,250,1E+40,null,null,250,1E+40,250,13846166.838716233,250,1E+40,250,1E+40]
[]
["Compared with source concentrations in mg/L",null,null,null,null,null,null,null,null,null,"Compared with source concentrations in mg/L"]
[null,0.01,null,0.5,null,6,null,100,null,null,null,0.01,null,0.5,null,6,null,100]
[]
[]
["Pollutant Linkage: Infill, Geo Barrier, Sst Unsaturated, Sst Saturated, Principal Aquifer",null,null,null,null,null,null,null,null,null,"Pollutant Linkage: Infill, Geo Barrier, Sst Unsaturated, Sst Saturated, Principal Aquifer at Site Boundary"]
["Dilution Factor",null,null,null,null,null,null,null,null,null,"Dilution Factor"]
[]
[null,12.83921468512464,"for all species and timeslices",null,null,null,null,null,null,null,null,12.83921468512464,"for all species and timeslices"]
[]
[]
["Pollutant Linkage: Infill, Geo Barrier, Sst Unsaturated, Sst Saturated, Principal Aquifer",null,null,null,null,null,null,null,null,null,"Pollutant Linkage: Infill, Geo Barrier, Sst Unsaturated, Sst Saturated, Principal Aquifer at Site Boundary"]
["Attenuation Factor",null,null,null,null,null,null,null,null,null,"Attenuation Factor"]
[]
[null,"Species1",null,"Species2",null,"Species3",null,"Species4",null,null,null,"Species1",null,"Species2",null,"Species3",null,"Species4"]
["Time(years)","Hg","Time(years)","Pb","Time(years)","Benzene","Time(years)","BaP",null,null,"Time(years)","Hg","Time(years)","Pb","Time(years)","Benzene","Time(years)","BaP"]
[1,1E+40,1,3.8943191796558557E-2,1,1E+40,1,7.7886383593117108,null,null,1,1E+40,1,3.8943191796558557E-2,1,1E+40,1,7.7886383593117108]
[2,1E+40,2,1.9471595898279279E-2,2,1E+40,2,3.8943191796558554,null,null,2,1E+40,2,1.9471595898279279E-2,2,1E+40,2,3.8943191796558554]
[5,1E+40,5,7.7886383593117111E-3,5,1E+40,5,1.5577276718623423,null,null,5,1E+40,5,7.7886383593117111E-3,5,1E+40,5,1.5577276718623423]
[10,1E+40,10,3.8943191796558555E-3,10,1E+40,10,0.77886383593117114,null,null,10,1E+40,10,3.8943191796558555E-3,10,1E+40,10,0.77886383593117114]
[15,1E+40,15,2.596212786437237E-3,15,7.5860815025783186E+29,15,0.51924255728744739,null,null,15,1E+40,15,2.596212786437237E-3,15,1E+40,15,0.51924255728744739]
[20,1E+40,20,1.9471595898279278E-3,20,7.439217012156799E+25,20,0.38943191796558557,null,null,20,1E+40,20,1.9471595898279278E-3,20,1E+40,20,0.38943191796558557]
[30,9.4671541926205422E+28,30,1.2981063932186185E-3,30,1E+40,30,0.2596212786437237,null,null,30,1E+40,30,1.2981063932186185E-3,30,3.2718720815063476E+37,30,0.2596212786437237]
[40,8.77093720292654E+24,40,9.7357979491396389E-4,40,1E+40,40,0.19471595898279279,null,null,40,1E+40,40,9.7357979491396389E-4,40,8.3898640185148598E+31,40,0.19471595898279279]
[50,1E+40,50,7.7886383593117115E-4,50,5.9429061754956984E+18,50,0.15577276718623423,null,null,50,1E+40,50,7.7886383593117115E-4,50,7.1717194761243271E+27,50,0.15577276718623423]
[60,1E+40,60,6.4905319660930926E-4,60,1.2870120420703422E+16,60,0.12981063932186185,null,null,60,3.166091318663772E+36,60,6.4905319660930926E-4,60,1E+40,60,0.12981063932186185]
[70,2.6435981816991728E+19,70,5.563313113794079E-4,70,65676299036748.18,70,0.11126626227588159,null,null,70,9.2499449464152355E+33,70,5.563313113794079E-4,70,1E+40,70,0.11126626227588159]
[80,1E+40,80,4.8678989745698194E-4,80,1256740222876.2761,80,9.7357979491396393E-2,null,null,80,1.4831476248152021E+31,80,4.8678989745698194E-4,80,2.267623881366186E+22,80,9.7357979491396393E-2]
[90,8.7021573363387878E+17,90,4.327021310728728E-4,90,58930053704.626534,90,8.6540426214574556E-2,null,null,90,3.4559090129464268E+28,90,4.327021310728728E-4,90,1.428110709791105E+21,90,8.6540426214574556E-2]
[100,1.1346111106626961E+19,100,3.8943191796558558E-4,100,5174870642.9336472,100,7.7886383593117114E-2,null,null,100,1.1425896166501616E+27,100,3.8943191796558558E-4,100,1E+40,100,7.7886383593117114E-2]
[120,1607496168735860.8,120,3.2452659830465463E-4,120,140035101.15245858,120,6.4905319660930924E-2,null,null,120,1E+40,120,3.2452659830465463E-4,120,1E+40,120,6.4905319660930924E-2]
[140,8387904892938.2324,140,2.7816565568970395E-4,140,11119401.557973919,140,5.5633131137940793E-2,null,null,140,1E+40,140,2.7816565568970395E-4,140,1.6760522516827638E+17,140,5.5633131137940793E-2]
[160,161570066958.83163,160,2.4339494872849097E-4,160,1729839.956817094,160,4.8678989745698197E-2,null,null,160,4.0503156870927892E+21,160,2.4339494872849097E-4,160,1E+40,160,4.8678989745698197E-2]
[180,7674941499.2332649,180,2.163510655364364E-4,180,421031.74968104891,180,4.3270213107287278E-2,null,null,180,2.806701900446297E+20,180,2.163510655364364E-4,180,2780922617743206,180,4.3270213107287278E-2]
[200,685000690.69466674,200,1.9471595898279279E-4,200,140042.37850595303,200,3.8943191796558557E-2,null,null,200,1E+40,200,1.9471595898279279E-4,200,66398627130947.25,200,3.8943191796558557E-2]
[250,9503676.9821596444,250,1.5577276718623423E-4,250,21294.011558910544,250,3.1154553437246844E-2,null,null,250,1E+40,250,1.5577276718623423E-4,250,64705671701.673012,250,3.1154553437246844E-2]
[]
[]
["Saved  21/07/2022: 12:24:27  Level Number: 5"]
[]
["BREAKTHROUGH RESULTS"]
[]
["Advanced"]
["Pollutant Linkage: Infill, Geo Barrier, Sst Unsaturated, Sst Saturated, Principal Aquifer",null,null,null,null,null,null,null,null,null,"Pollutant Linkage: Infill, Geo Barrier, Sst Unsaturated, Sst Saturated, Principal Aquifer at Site Boundary"]
["Concentrations in mg/L in Principal Aquifer",null,null,null,null,null,null,null,null,null,"Concentrations in mg/L in Principal Aquifer at Site Boundary"]
[]
["Compared with MRV target concentration in mg/L",null,null,null,null,null,null,null,null,null,"Compared with MRV target concentration in mg/L"]
[null,1.0000000000000001E-5,null,2.0000000000000001E-4,null,1E-3,null,4.9999999999999998E-8,null,null,null,1.0000000000000001E-5,null,2.0000000000000001E-4,null,1E-3,null,4.9999999999999998E-8]
[]
[null,"Species1",null,"Species2",null,"Species3",null,"Species4",null,null,null,"Species1",null,"Species2",null,"Species3",null,"Species4"]
["Time(years)","Hg","Time(years)","Pb","Time(years)","Benzene","Time(years)","BaP",null,null,"Time(years)","Hg","Time(years)","Pb","Time(years)","Benzene","Time(years)","BaP"]
[1,0,1,0,1,2.7836048487186331E-10,1,0,null,null,1,0,1,0,1,1.1732576947911402E-13,1,0]
[2,0,2,0,2,7.487316030680088E-6,2,0,null,null,2,0,2,0,2,5.0832047951963198E-7,2,0]
[5,0,5,0,5,3.5062563374513186E-4,5,0,null,null,5,0,5,0,5,1.8020703890505614E-4,5,0]
[10,0,10,0,10,2.6318772765544942E-4,10,0,null,null,10,0,10,0,10,1.5237956866211456E-4,10,0]
[15,0,15,0,15,1.6441501915407555E-4,15,0,null,null,15,0,15,0,15,9.5218040933423841E-5,15,0]
[20,0,20,0,20,1.0268059779619805E-4,20,0,null,null,20,0,20,0,20,5.9465659748541118E-5,20,0]
[30,0,30,4.9610699822486082E-35,30,4.0048106469643743E-5,30,0,null,null,30,0,30,0,30,2.3193155494339657E-5,30,0]
[40,0,40,0,40,1.561980435611278E-5,40,0,null,null,40,0,40,0,40,9.0459345308591317E-6,40,0]
[50,6.2857842301889559E-40,50,1.271000153623861E-26,50,6.0921306113514499E-6,50,0,null,null,50,0,50,6.8203114015527617E-39,50,3.5281501093902557E-6,50,0]
[60,1.349694205446234E-36,60,0,60,2.3760897498880611E-6,60,0,null,null,60,0,60,0,60,1.376070541416005E-6,60,0]
[70,2.5347786039572372E-33,70,0,70,9.2673695776961898E-7,70,0,null,null,70,0,70,8.6593306093825102E-33,70,5.367034435718117E-7,70,0]
[80,0,80,4.028952382518973E-23,80,3.614515145243804E-7,80,0,null,null,80,0,80,6.5941596486394009E-30,80,2.0932836604035459E-7,80,0]
[90,0,90,1.0138066568553575E-21,90,1.4097535176333077E-7,90,0,null,null,90,0,90,0,90,8.1643498678233156E-8,90,0]
[100,2.0929498774866515E-28,100,0,100,5.4983801030075729E-8,100,0,null,null,100,1.1555985526173147E-40,100,0,100,3.1843015630813478E-8,100,0]
[120,6.1317745882212732E-27,120,8.7107407413562271E-21,120,8.3635791299823288E-9,120,0,null,null,120,0,120,0,120,4.8437370906553968E-9,120,0]
[140,0,140,5.7739988358683905E-18,140,1.2715082229488832E-9,140,0,null,null,140,1.2465473867640187E-34,140,1.0908992222751939E-22,140,7.3647961545739197E-10,140,0]
[160,6.3608427030025508E-24,160,6.7092896430009315E-16,160,1.9253018948244625E-10,160,0,null,null,160,8.4860191988928337E-32,160,0,160,1.1159590398139549E-10,160,0]
[180,0,180,2.7296402897481466E-14,180,2.8309225124034562E-11,180,0,null,null,180,0,180,1.5413171548018265E-20,180,1.6478042289151757E-11,180,0]
[200,0,200,5.2014971521408934E-13,200,3.2745759386212846E-12,200,0,null,null,200,0,200,0,200,1.9685729163000104E-12,200,0]
[250,0,250,9.8420504866322064E-11,250,0,250,0,null,null,250,0,250,2.1149318236993271E-18,250,0,250,0]
[]
[]
["Pollutant Linkage: Infill, Geo Barrier, Sst Unsaturated, Sst Saturated, Principal Aquifer",null,null,null,null,null,null,null,null,null,"Pollutant Linkage: Infill, Geo Barrier, Sst Unsaturated, Sst Saturated, Principal Aquifer at Site Boundary"]
["Remedial Target Concentrations in mg/L in Infill",null,null,null,null,null,null,null,null,null,"Remedial Target Concentrations in mg/L in Infill"]
[]
[null,"Species1",null,"Species2",null,"Species3",null,"Species4",null,null,null,"Species1",null,"Species2",null,"Species3",null,"Species4"]
["Time(years)","Hg","Time(years)","Pb","Time(years)","Benzene","Time(years)","BaP",null,null,"Time(years)","Hg","Time(years)","Pb","Time(years)","Benzene","Time(years)","BaP"]
[1,1E+40,1,1E+40,1,21554783.548972327,1,1E+40,null,null,1,1E+40,1,1E+40,1,51139660337.519478,1,1E+40]
[2,1E+40,2,1E+40,2,801.35524871854625,2,1E+40,null,null,2,1E+40,2,1E+40,2,11803.577156029718,2,1E+40]
[5,1E+40,5,1E+40,5,17.112268535281629,5,1E+40,null,null,5,1E+40,5,1E+40,5,33.295036844599387,5,1E+40]
[10,1E+40,10,1E+40,10,22.797415568916126,10,1E+40,null,null,10,1E+40,10,1E+40,10,39.375357554032455,10,1E+40]
[15,1E+40,15,1E+40,15,36.493016458413202,15,1E+40,null,null,15,1E+40,15,1E+40,15,63.013268716536409,15,1E+40]
[20,1E+40,20,1E+40,20,58.433629417593451,20,1E+40,null,null,20,1E+40,20,1E+40,20,100.89856944952501,20,1E+40]
[30,1E+40,30,2.0156942022147195E+30,30,149.8198174375103,30,1E+40,null,null,30,1E+40,30,1E+40,30,258.697010911875,30,1E+40]
[40,1E+40,40,1E+40,40,384.12773061731161,40,1E+40,null,null,40,1E+40,40,1E+40,40,663.28138674138222,40,1E+40]
[50,1.5908913882173446E+32,50,7.8678196627184634E+21,50,984.87711160036804,50,1E+40,null,null,50,1E+40,50,1.466208712658388E+34,50,1700.6079146209956,50,1E+40]
[60,7.4090856726274636E+28,60,1E+40,60,2525.1571411739237,60,1E+40,null,null,60,1E+40,60,1E+40,60,4360.2415860351721,60,1E+40]
[70,3.9451177252278496E+25,70,1E+40,70,6474.3290420188059,70,1E+40,null,null,70,1E+40,70,1.1548236753040537E+28,70,11179.358120136956,70,1E+40]
[80,1E+40,80,2.4820347947988956E+18,80,16599.736780450789,80,1E+40,null,null,80,1E+40,80,1.5164934628271154E+25,80,28663.100531933222,80,1E+40]
[90,1E+40,90,9.8638137088369184E+16,90,42560.631521408024,90,1E+40,null,null,90,1E+40,90,1E+40,90,73490.236174796009,90,1E+40]
[100,4.7779452855357637E+20,100,1E+40,100,109123.04874517578,100,1E+40,null,null,100,8.6535241649022541E+32,100,1E+40,100,188424.36500247766,100,1E+40]
[120,1.630849251896723E+19,120,1.148007993456024E+16,120,717396.21360080049,120,1E+40,null,null,120,1E+40,120,1E+40,120,1238712.9787814622,120,1E+40]
[140,1E+40,140,17319019771669.27,140,4718805.503345306,140,1E+40,null,null,140,8.022157926911671E+26,140,9.166749591354432E+17,140,8146864.9967639493,140,1E+40]
[160,1.572118737550236E+16,160,149047075504.2139,160,31163943.774890661,160,1E+40,null,null,160,1.1784088352409921E+24,160,1E+40,160,53765414.194774382,160,1E+40]
[180,1E+40,180,3663486371.2839842,180,211945045.25332251,180,1E+40,null,null,180,1E+40,180,6487957373890218,180,364120924.96874291,180,1E+40]
[200,1E+40,200,192252340.19178656,200,1832298322.7337272,200,1E+40,null,null,200,1E+40,200,1E+40,200,3047893197.3102493,200,1E+40]
[250,1E+40,250,1016048.4355960505,250,1E+40,250,1E+40,null,null,250,1E+40,250,47282848023481.57,250,1E+40,250,1E+40]
[]
["Compared with source concentrations in mg/L",null,null,null,null,null,null,null,null,null,"Compared with source concentrations in mg/L"]
[null,0.01,null,0.5,null,6,null,100,null,null,null,0.01,null,0.5,null,6,null,100]
[]
[]
["Pollutant Linkage: Infill, Geo Barrier, Sst Unsaturated, Sst Saturated, Principal Aquifer",null,null,null,null,null,null,null,null,null,"Pollutant Linkage: Infill, Geo Barrier, Sst Unsaturated, Sst Saturated, Principal Aquifer at Site Boundary"]
["Dilution Factor",null,null,null,null,null,null,null,null,null,"Dilution Factor"]
[]
[null,12.83921468512464,"for all species and timeslices",null,null,null,null,null,null,null,null,12.83921468512464,"for all species and timeslices"]
[]
[]
["Pollutant Linkage: Infill, Geo Barrier, Sst Unsaturated, Sst Saturated, Principal Aquifer",null,null,null,null,null,null,null,null,null,"Pollutant Linkage: Infill, Geo Barrier, Sst Unsaturated, Sst Saturated, Principal Aquifer at Site Boundary"]
["Attenuation Factor",null,null,null,null,null,null,null,null,null,"Attenuation Factor"]
[]
[null,"Species1",null,"Species2",null,"Species3",null,"Species4",null,null,null,"Species1",null,"Species2",null,"Species3",null,"Species4"]
["Time(years)","Hg","Time(years)","Pb","Time(years)","Benzene","Time(years)","BaP",null,null,"Time(years)","Hg","Time(years)","Pb","Time(years)","Benzene","Time(years)","BaP"]
[1,1E+40,1,3.8943191796558557E-2,1,1E+40,1,7.7886383593117108,null,null,1,1E+40,1,3.8943191796558557E-2,1,1E+40,1,7.7886383593117108]
[2,1E+40,2,1.9471595898279279E-2,2,1E+40,2,3.8943191796558554,null,null,2,1E+40,2,1.9471595898279279E-2,2,1E+40,2,3.8943191796558554]
[5,1E+40,5,7.7886383593117111E-3,5,1E+40,5,1.5577276718623423,null,null,5,1E+40,5,7.7886383593117111E-3,5,1E+40,5,1.5577276718623423]
[10,1E+40,10,3.8943191796558555E-3,10,1E+40,10,0.77886383593117114,null,null,10,1E+40,10,3.8943191796558555E-3,10,1E+40,10,0.77886383593117114]
[15,1E+40,15,2.596212786437237E-3,15,1E+40,15,0.51924255728744739,null,null,15,1E+40,15,2.596212786437237E-3,15,1E+40,15,0.51924255728744739]
[20,1E+40,20,1.9471595898279278E-3,20,1E+40,20,0.38943191796558557,null,null,20,1E+40,20,1.9471595898279278E-3,20,1E+40,20,0.38943191796558557]
[30,1E+40,30,1.2981063932186185E-3,30,9.4197079104070685E+33,30,0.2596212786437237,null,null,30,1E+40,30,1.2981063932186185E-3,30,1E+40,30,0.2596212786437237]
[40,1E+40,40,9.7357979491396389E-4,40,1E+40,40,0.19471595898279279,null,null,40,1E+40,40,9.7357979491396389E-4,40,1E+40,40,0.19471595898279279]
[50,1.2390877691768267E+36,50,7.7886383593117115E-4,50,3.6767761217517565E+25,50,0.15577276718623423,null,null,50,1E+40,50,7.7886383593117115E-4,50,6.8518616533008968E+37,50,0.15577276718623423]
[60,5.7706688877253064E+32,60,6.4905319660930926E-4,60,1E+40,60,0.12981063932186185,null,null,60,1E+40,60,6.4905319660930926E-4,60,1E+40,60,0.12981063932186185]
[70,3.0727095246710188E+29,70,5.563313113794079E-4,70,1E+40,70,0.11126626227588159,null,null,70,1E+40,70,5.563313113794079E-4,70,5.3967023854286904E+31,70,0.11126626227588159]
[80,1E+40,80,4.8678989745698194E-4,80,1.1599002847150229E+22,80,9.7357979491396393E-2,null,null,80,1E+40,80,4.8678989745698194E-4,80,7.0868514937324324E+28,80,9.7357979491396393E-2]
[90,1E+40,90,4.327021310728728E-4,90,4.6095406693051164E+20,90,8.6540426214574556E-2,null,null,90,1E+40,90,4.327021310728728E-4,90,1E+40,90,8.6540426214574556E-2]
[100,3.7213687929616393E+24,100,3.8943191796558558E-4,100,1E+40,100,7.7886383593117114E-2,null,null,100,6.7399170253988524E+36,100,3.8943191796558558E-4,100,1E+40,100,7.7886383593117114E-2]
[120,1.2702095041577624E+23,120,3.2452659830465463E-4,120,5.3648514567768334E+19,120,6.4905319660930924E-2,null,null,120,1E+40,120,3.2452659830465463E-4,120,1E+40,120,6.4905319660930924E-2]
[140,1E+40,140,2.7816565568970395E-4,140,8.0934949043580736E+16,140,5.5633131137940793E-2,null,null,140,6.2481686954000753E+30,140,2.7816565568970395E-4,140,4.2837898498456845E+21,140,5.5633131137940793E-2]
[160,1.2244664304676468E+20,160,2.4339494872849097E-4,160,696524261769209.5,160,4.8678989745698197E-2,null,null,160,9.1782002571098244E+27,160,2.4339494872849097E-4,160,1E+40,160,4.8678989745698197E-2]
[180,1E+40,180,2.163510655364364E-4,180,17120142288118.861,180,4.3270213107287278E-2,null,null,180,1E+40,180,2.163510655364364E-4,180,3.031941220551637E+19,180,4.3270213107287278E-2]
[200,1E+40,200,1.9471595898279279E-4,200,898430370891.11597,200,3.8943191796558557E-2,null,null,200,1E+40,200,1.9471595898279279E-4,200,1E+40,200,3.8943191796558557E-2]
[250,1E+40,250,1.5577276718623423E-4,250,4748180292.2412319,250,3.1154553437246844E-2,null,null,250,1E+40,250,1.5577276718623423E-4,250,2.2096140231191667E+17,250,3.1154553437246844E-2]
[]
[]
["Saved  21/07/2022: 12:30:42  Level Number: 5"]
[]
["BREAKTHROUGH RESULTS"]
[]
["Advanced"]
["Pollutant Linkage: Infill, Geo Barrier, Sst Unsaturated, Sst Saturated, Principal Aquifer",null,null,null,null,null,null,null,null,null,"Pollutant Linkage: Infill, Geo Barrier, Sst Unsaturated, Sst Saturated, Principal Aquifer at Site Boundary"]
["Concentrations in mg/L in Principal Aquifer",null,null,null,null,null,null,null,null,null,"Concentrations in mg/L in Principal Aquifer at Site Boundary"]
[]
["Compared with MRV target concentration in mg/L",null,null,null,null,null,null,null,null,null,"Compared with MRV target concentration in mg/L"]
[null,1.0000000000000001E-5,null,2.0000000000000001E-4,null,1E-3,null,4.9999999999999998E-8,null,null,null,1.0000000000000001E-5,null,2.0000000000000001E-4,null,1E-3,null,4.9999999999999998E-8]
[]
[null,"Species1",null,"Species2",null,"Species3",null,"Species4",null,null,null,"Species1",null,"Species2",null,"Species3",null,"Species4"]
["Time(years)","Hg","Time(years)","Pb","Time(years)","Benzene","Time(years)","BaP",null,null,"Time(years)","Hg","Time(years)","Pb","Time(years)","Benzene","Time(years)","BaP"]
[1,0,1,0,1,2.9294573049280291E-5,1,0,null,null,1,0,1,0,1,2.1811397224293442E-7,1,0]
[2,0,2,0,2,2.3362054099879477E-3,2,0,null,null,2,0,2,0,2,4.9824854588528637E-4,2,0]
[5,0,5,0,5,5.9461517757013454E-3,5,0,null,null,5,0,5,0,5,3.3926279908875531E-3,5,0]
[10,0,10,0,10,3.7633336021408743E-3,10,0,null,null,10,0,10,0,10,2.1794609859786419E-3,10,0]
[15,0,15,2.2156346995723199E-34,15,2.350285746701257E-3,15,0,null,null,15,0,15,0,15,1.3611265951109775E-3,15,0]
[20,0,20,0,20,1.4678019705694934E-3,20,0,null,null,20,0,20,0,20,8.500516589667245E-4,20,0]
[30,5.3647716598688425E-35,30,4.5686083180112379E-25,30,5.7248098726632034E-4,30,0,null,null,30,0,30,0,30,3.3154227992707983E-4,30,0]
[40,0,40,4.8532473795992992E-22,40,2.2328249254515179E-4,40,0,null,null,40,0,40,0,40,1.2931012347106187E-4,40,0]
[50,0,50,0,50,8.70859849509792E-5,50,0,null,null,50,0,50,3.4631013316863366E-30,50,5.0434316217224699E-5,50,0]
[60,1.2513928965520281E-25,60,0,60,3.3965798025518989E-5,60,0,null,null,60,0,60,0,60,1.9670696264684193E-5,60,0]
[70,0,70,2.084245478128227E-17,70,1.3247539634719985E-5,70,0,null,null,70,3.7970734498077121E-40,70,2.8225004600290184E-25,70,7.6720820719991487E-6,70,0]
[80,2.5711656554896475E-23,80,2.1663966368010263E-15,80,5.1668774633564532E-6,80,0,null,null,80,5.820158369946481E-37,80,0,80,2.992308865512045E-6,80,0]
[90,0,90,8.0403770550677223E-14,90,2.0152072841639686E-6,90,0,null,null,90,5.9190916180298463E-34,90,1.4115963576424214E-22,90,1.1670744445981432E-6,90,0]
[100,5.2906437616717399E-22,100,1.4297713199573885E-12,100,7.8597265209931078E-7,100,0,null,null,100,8.0429115125820085E-32,100,0,100,4.5518464655785409E-7,100,0]
[120,0,120,1.0364691532869003E-10,120,1.195456058626886E-7,120,0,null,null,120,0,120,5.9321784293760631E-20,120,6.923473605444244E-8,120,0]
[140,1.6144556674785536E-18,140,2.1250487633871033E-9,140,1.8167114369570298E-8,140,0,null,null,140,5.5685299879039413E-27,140,0,140,1.0522783194555224E-8,140,0]
[160,1.3067273458529965E-16,160,1.9785769104925917E-8,160,2.7446979514432068E-9,160,0,null,null,160,0,160,3.6237317313838138E-18,160,1.5908499316862201E-9,160,0]
[180,3.9465488434188281E-15,180,1.0888911633067685E-7,180,3.9837446402312733E-10,180,0,null,null,180,3.2767559311454114E-24,180,0,180,2.3177777010725949E-10,180,0]
[200,5.9113074777153441E-14,200,4.1503961505162133E-7,200,4.1488191025072064E-11,200,0,null,null,200,0,200,2.1573083350420022E-16,200,2.4899888873992659E-11,200,0]
[250,7.2350259593340185E-12,250,4.2301854123120086E-6,250,0,250,0,null,null,250,0,250,3.8233084105625244E-13,250,0,250,0]
[]
[]
["Pollutant Linkage: Infill, Geo Barrier, Sst Unsaturated, Sst Saturated, Principal Aquifer",null,null,null,null,null,null,null,null,null,"Pollutant Linkage: Infill, Geo Barrier, Sst Unsaturated, Sst Saturated, Principal Aquifer at Site Boundary"]
["Remedial Target Concentrations in mg/L in Infill",null,null,null,null,null,null,null,null,null,"Remedial Target Concentrations in mg/L in Infill"]
[]
[null,"Species1",null,"Species2",null,"Species3",null,"Species4",null,null,null,"Species1",null,"Species2",null,"Species3",null,"Species4"]
["Time(years)","Hg","Time(years)","Pb","Time(years)","Benzene","Time(years)","BaP",null,null,"Time(years)","Hg","Time(years)","Pb","Time(years)","Benzene","Time(years)","BaP"]
[1,1E+40,1,1E+40,1,204.816093066337,1,1E+40,null,null,1,1E+40,1,1E+40,1,27508.554075193428,1,1E+40]
[2,1E+40,2,1E+40,2,2.5682673168841577,2,1E+40,null,null,2,1E+40,2,1E+40,2,12.042182660742581,2,1E+40]
[5,1E+40,5,1E+40,5,1.0090559787792002,5,1E+40,null,null,5,1E+40,5,1E+40,5,1.768540499021918,5,1E+40]
[10,1E+40,10,1E+40,10,1.5943311527276609,10,1E+40,null,null,10,1E+40,10,1E+40,10,2.7529742622604569,10,1E+40]
[15,1E+40,15,4.5133793950466125E+29,15,2.5528810734700231,15,1E+40,null,null,15,1E+40,15,1E+40,15,4.408113118611718,15,1E+40]
[20,1E+40,20,1E+40,20,4.0877448867792818,20,1E+40,null,null,20,1E+40,20,1E+40,20,7.0583945536830859,20,1E+40]
[30,1.8640122327675135E+27,30,2.1888503684100247E+20,30,10.480697409098021,30,1E+40,null,null,30,1E+40,30,1E+40,30,18.097239366634184,30,1E+40]
[40,1E+40,40,2.0604760519801971E+17,40,26.871788878775128,40,1E+40,null,null,40,1E+40,40,1E+40,40,46.400079428759739,40,1E+40]
[50,1E+40,50,1E+40,50,68.897423659816297,50,1E+40,null,null,50,1E+40,50,2.8875851562595082E+25,50,118.96661737531073,50,1E+40]
[60,7.9910953846334541E+17,60,1E+40,60,176.64828588723617,60,1E+40,null,null,60,1E+40,60,1E+40,60,305.02224828574612,60,1E+40]
[70,1E+40,70,4797899338124.3076,70,452.91428940320532,70,1E+40,null,null,70,2.633607206230475E+32,70,3.5429577927853336E+20,70,782.0562845512618,70,1E+40]
[80,3889286549331891,80,46159598986.297981,80,1161.2429446124977,80,1E+40,null,null,80,1.7181663048271924E+29,80,1E+40,80,2005.1406020124457,80,1E+40]
[90,1E+40,90,1243722767.1676366,90,2977.361211002752,90,1E+40,null,null,90,1.6894484230552379E+26,90,7.0841780979808614E+17,90,5141.0602192270353,90,1E+40]
[100,189012915071798.31,100,69941254.663704053,100,7633.8533967742633,100,1E+40,null,null,100,1.2433308490782723E+24,100,1E+40,100,13181.46392979755,100,1E+40]
[120,1E+40,120,964814.04856936878,120,50190.05053930352,120,1E+40,null,null,120,1E+40,120,1685721378588368.8,120,86661.701075626625,120,1E+40]
[140,61940381525.730812,140,47057.743672954857,140,330267.09019072005,140,1E+40,null,null,140,1.7958060783945093E+19,140,1E+40,140,570191.35423264862,140,1E+40]
[160,765270584.69663155,160,5054.1376213221729,160,2186032.8918324518,160,1E+40,null,null,160,1E+40,160,27595861783568.75,160,3771568.8202219708,160,1E+40]
[180,25338594.292772446,180,918.36542870196342,180,15061206.331868889,180,1E+40,null,null,180,3.0517988553710912E+16,180,1E+40,180,25886865.669746447,180,1E+40]
[200,1691673.1260720838,200,240.94085570015363,200,144619465.24431714,200,1E+40,null,null,200,1E+40,200,463540599995.19275,200,240964930.82211533,200,1E+40]
[250,13821.650476732357,250,23.639625749960921,250,1E+40,250,1E+40,null,null,250,1E+40,250,261553579.41758871,250,1E+40,250,1E+40]
[]
["Compared with source concentrations in mg/L",null,null,null,null,null,null,null,null,null,"Compared with source concentrations in mg/L"]
[null,0.01,null,0.5,null,6,null,100,null,null,null,0.01,null,0.5,null,6,null,100]
[]
[]
["Pollutant Linkage: Infill, Geo Barrier, Sst Unsaturated, Sst Saturated, Principal Aquifer",null,null,null,null,null,null,null,null,null,"Pollutant Linkage: Infill, Geo Barrier, Sst Unsaturated, Sst Saturated, Principal Aquifer at Site Boundary"]
["Dilution Factor",null,null,null,null,null,null,null,null,null,"Dilution Factor"]
[]
[null,12.83921468512464,"for all species and timeslices",null,null,null,null,null,null,null,null,12.83921468512464,"for all species and timeslices"]
[]
[]
["Pollutant Linkage: Infill, Geo Barrier, Sst Unsaturated, Sst Saturated, Principal Aquifer",null,null,null,null,null,null,null,null,null,"Pollutant Linkage: Infill, Geo Barrier, Sst Unsaturated, Sst Saturated, Principal Aquifer at Site Boundary"]
["Attenuation Factor",null,null,null,null,null,null,null,null,null,"Attenuation Factor"]
[]
[null,"Species1",null,"Species2",null,"Species3",null,"Species4",null,null,null,"Species1",null,"Species2",null,"Species3",null,"Species4"]
["Time(years)","Hg","Time(years)","Pb","Time(years)","Benzene","Time(years)","BaP",null,null,"Time(years)","Hg","Time(years)","Pb","Time(years)","Benzene","Time(years)","BaP"]
[1,1E+40,1,3.8943191796558557E-2,1,1E+40,1,7.7886383593117108,null,null,1,1E+40,1,3.8943191796558557E-2,1,1E+40,1,7.7886383593117108]
[2,1E+40,2,1.9471595898279279E-2,2,1E+40,2,3.8943191796558554,null,null,2,1E+40,2,1.9471595898279279E-2,2,1E+40,2,3.8943191796558554]
[5,1E+40,5,7.7886383593117111E-3,5,1E+40,5,1.5577276718623423,null,null,5,1E+40,5,7.7886383593117111E-3,5,1E+40,5,1.5577276718623423]
[10,1E+40,10,3.8943191796558555E-3,10,1E+40,10,0.77886383593117114,null,null,10,1E+40,10,3.8943191796558555E-3,10,1E+40,10,0.77886383593117114]
[15,1E+40,15,2.596212786437237E-3,15,2.1091847931832279E+33,15,0.51924255728744739,null,null,15,1E+40,15,2.596212786437237E-3,15,1E+40,15,0.51924255728744739]
[20,1E+40,20,1.9471595898279278E-3,20,1E+40,20,0.38943191796558557,null,null,20,1E+40,20,1.9471595898279278E-3,20,1E+40,20,0.38943191796558557]
[30,1.4518117178359324E+31,30,1.2981063932186185E-3,30,1.0228898365315133E+24,30,0.2596212786437237,null,null,30,1E+40,30,1.2981063932186185E-3,30,1E+40,30,0.2596212786437237]
[40,1E+40,40,9.7357979491396389E-4,40,9.6289816901376685E+20,40,0.19471595898279279,null,null,40,1E+40,40,9.7357979491396389E-4,40,1E+40,40,0.19471595898279279]
[50,1E+40,50,7.7886383593117115E-4,50,1E+40,50,0.15577276718623423,null,null,50,1E+40,50,7.7886383593117115E-4,50,1.3494213908293142E+29,50,0.15577276718623423]
[60,6.2239752045674889E+21,60,6.4905319660930926E-4,60,1E+40,60,0.12981063932186185,null,null,60,1E+40,60,6.4905319660930926E-4,60,1E+40,60,0.12981063932186185]
[70,1E+40,70,5.563313113794079E-4,70,2.2421461697418748E+16,70,0.11126626227588159,null,null,70,2.0512214109806427E+36,70,5.563313113794079E-4,70,1.6556890182186124E+24,70,0.11126626227588159]
[80,3.0292246408481444E+19,80,4.8678989745698194E-4,80,215712253989075.84,80,9.7357979491396393E-2,null,null,80,1.3382175989453928E+33,80,4.8678989745698194E-4,80,1E+40,80,9.7357979491396393E-2]
[90,1E+40,90,4.327021310728728E-4,90,5812144111626.6963,90,8.6540426214574556E-2,null,null,90,1.3158502793886706E+30,90,4.327021310728728E-4,90,3.3105660766877762E+21,90,8.6540426214574556E-2]
[100,1.472153240733535E+18,100,3.8943191796558558E-4,100,326848283383.26868,100,7.7886383593117114E-2,null,null,100,9.6838543444466308E+27,100,3.8943191796558558E-4,100,1E+40,100,7.7886383593117114E-2]
[120,1E+40,120,3.2452659830465463E-4,120,4508752624.9741306,120,6.4905319660930924E-2,null,null,120,1E+40,120,3.2452659830465463E-4,120,7.8776845154311117E+18,120,6.4905319660930924E-2]
[140,482431231541709.38,140,2.7816565568970395E-4,140,219909448.48430049,140,5.5633131137940793E-2,null,null,140,1.3986884108068608E+23,140,2.7816565568970395E-4,140,1E+40,140,5.5633131137940793E-2]
[160,5960415831221.085,160,2.4339494872849097E-4,160,23618910.09040219,160,4.8678989745698197E-2,null,null,160,1E+40,160,2.4339494872849097E-4,160,1.2896051258746059E+17,160,4.8678989745698197E-2]
[180,197353147479.72424,180,2.163510655364364E-4,180,4291689.7235123133,180,4.3270213107287278E-2,null,null,180,2.3769357629846851E+20,180,2.163510655364364E-4,180,1E+40,180,4.3270213107287278E-2]
[200,13175830201.141787,200,1.9471595898279279E-4,200,1125960.7146189625,200,3.8943191796558557E-2,null,null,200,1E+40,200,1.9471595898279279E-4,200,2166210058932554.5,200,3.8943191796558557E-2]
[250,107651837.09207663,250,1.5577276718623423E-4,250,110472.29754955108,250,3.1154553437246844E-2,null,null,250,1E+40,250,1.5577276718623423E-4,250,1222287745000.2678,250,3.1154553437246844E-2]
[]
[]
["Saved  21/07/2022: 12:32:30  Level Number: 5"]
[]
["BREAKTHROUGH RESULTS"]
[]
["Advanced"]
["Pollutant Linkage: Infill, Geo Barrier, Sst Unsaturated, Sst Saturated, Principal Aquifer",null,null,null,null,null,null,null,null,null,"Pollutant Linkage: Infill, Geo Barrier, Sst Unsaturated, Sst Saturated, Principal Aquifer at Site Boundary"]
["Concentrations in mg/L in Principal Aquifer",null,null,null,null,null,null,null,null,null,"Concentrations in mg/L in Principal Aquifer at Site Boundary"]
[]
["Compared with MRV target concentration in mg/L",null,null,null,null,null,null,null,null,null,"Compared with MRV target concentration in mg/L"]
[null,1.0000000000000001E-5,null,2.0000000000000001E-4,null,1E-3,null,4.9999999999999998E-8,null,null,null,1.0000000000000001E-5,null,2.0000000000000001E-4,null,1E-3,null,4.9999999999999998E-8]
[]
[null,"Species1",null,"Species2",null,"Species3",null,"Species4",null,null,null,"Species1",null,"Species2",null,"Species3",null,"Species4"]
["Time(years)","Hg","Time(years)","Pb","Time(years)","Benzene","Time(years)","BaP",null,null,"Time(years)","Hg","Time(years)","Pb","Time(years)","Benzene","Time(years)","BaP"]
[1,0,1,0,1,9.2141426912621515E-8,1,0,null,null,1,0,1,0,1,1.4652726261687637E-10,1,0]
[2,0,2,0,2,1.3539580399626343E-4,2,0,null,null,2,0,2,0,2,1.583102034276706E-5,2,0]
[5,0,5,0,5,1.3658805079872648E-3,5,0,null,null,5,0,5,0,5,7.4776048089437715E-4,5,0]
[10,0,10,0,10,9.1417694512623535E-4,10,0,null,null,10,0,10,0,10,5.2940244742432664E-4,10,0]
[15,0,15,0,15,5.7095040526908834E-4,15,0,null,null,15,0,15,0,15,3.3065586372886513E-4,15,0]
[20,0,20,0,20,3.5657032259755095E-4,20,0,null,null,20,0,20,0,20,2.065014222545249E-4,20,0]
[30,0,30,0,30,1.3907170962573558E-4,30,0,null,null,30,0,30,0,30,8.0540931025048937E-5,30,0]
[40,0,40,0,40,5.4241588431523605E-5,40,0,null,null,40,0,40,0,40,3.1413060427183608E-5,40,0]
[50,9.8106934518258038E-34,50,1.5161846028887559E-23,50,2.1155632423326917E-5,50,0,null,null,50,0,50,0,50,1.2251911957590326E-5,50,0]
[60,0,60,1.2935064694182259E-22,60,8.2512476859371657E-6,60,0,null,null,60,0,60,9.6117449976819188E-32,60,4.7785650344370397E-6,60,0]
[70,7.0932375507512127E-29,70,0,70,3.2182011252803638E-6,70,0,null,null,70,0,70,3.7279116723156092E-29,70,1.863764908456699E-6,70,0]
[80,0,80,2.5014088643407461E-20,80,1.2551814173088575E-6,80,0,null,null,80,0,80,0,80,7.2691669107974187E-7,80,0]
[90,2.8250754818579891E-26,90,8.9903319061390125E-21,90,4.8955219157489719E-7,90,0,null,null,90,0,90,2.2540327293302733E-25,90,2.8351603770980642E-7,90,0]
[100,4.3092819460194996E-27,100,8.6011736429606958E-19,100,1.9093649309054676E-7,100,0,null,null,100,0,100,0,100,1.1057801238161479E-7,100,0]
[120,1.2681306885629785E-23,120,1.0238345261148432E-15,120,2.9042408196625723E-8,120,0,null,null,120,2.1412093241987813E-33,120,3.7145340201885147E-22,120,1.6819861042140838E-8,120,0]
[140,0,140,1.1543183277579133E-13,140,4.414492224076342E-9,140,0,null,null,140,3.6712675582274872E-31,140,0,140,2.5569737529691231E-9,140,0]
[160,8.6892581326833576E-22,160,3.8909072287199395E-12,160,6.6774809707153176E-10,160,0,null,null,160,0,160,6.2090080965834005E-20,160,3.8705209678621133E-10,160,0]
[180,0,180,5.8611212215265101E-11,180,9.7585531028482563E-11,180,0,null,null,180,3.6036132197777955E-27,180,0,180,5.6800713890447391E-11,180,0]
[200,5.5990772105301151E-20,200,5.0248411820019256E-10,200,1.0753151389825945E-11,200,0,null,null,200,0,200,2.3531585014800777E-18,200,6.4689072493834013E-12,200,0]
[250,1.1675451214880728E-16,250,2.2362488090216611E-8,250,0,250,0,null,null,250,0,250,5.4894913131389397E-17,250,0,250,0]
[]
[]
["Pollutant Linkage: Infill, Geo Barrier, Sst Unsaturated, Sst Saturated, Principal Aquifer",null,null,null,null,null,null,null,null,null,"Pollutant Linkage: Infill, Geo Barrier, Sst Unsaturated, Sst Saturated, Principal Aquifer at Site Boundary"]
["Remedial Target Concentrations in mg/L in Infill",null,null,null,null,null,null,null,null,null,"Remedial Target Concentrations in mg/L in Infill"]
[]
[null,"Species1",null,"Species2",null,"Species3",null,"Species4",null,null,null,"Species1",null,"Species2",null,"Species3",null,"Species4"]
["Time(years)","Hg","Time(years)","Pb","Time(years)","Benzene","Time(years)","BaP",null,null,"Time(years)","Hg","Time(years)","Pb","Time(years)","Benzene","Time(years)","BaP"]
[1,1E+40,1,1E+40,1,65117.289812429866,1,1E+40,null,null,1,1E+40,1,1E+40,1,40948011.263188273,1,1E+40]
[2,1E+40,2,1E+40,2,44.314519526510466,2,1E+40,null,null,2,1E+40,2,1E+40,2,379.00273451049566,2,1E+40]
[5,1E+40,5,1E+40,5,4.3927707913787311,5,1E+40,null,null,5,1E+40,5,1E+40,5,8.0239597482118263,5,1E+40]
[10,1E+40,10,1E+40,10,6.5632808090248673,10,1E+40,null,null,10,1E+40,10,1E+40,10,11.333532795685926,10,1E+40]
[15,1E+40,15,1E+40,15,10.508793661635472,15,1E+40,null,null,15,1E+40,15,1E+40,15,18.145754115281459,15,1E+40]
[20,1E+40,20,1E+40,20,16.826975268976607,20,1E+40,null,null,20,1E+40,20,1E+40,20,29.055489954953696,20,1E+40]
[30,1E+40,30,1E+40,30,43.143210190965284,30,1E+40,null,null,30,1E+40,30,1E+40,30,74.496283115152309,30,1E+40]
[40,1E+40,40,1E+40,40,110.61622960350066,40,1E+40,null,null,40,1E+40,40,1E+40,40,191.00335715165912,40,1E+40]
[50,1.0192959395891599E+26,50,6.5955029360852255E+18,50,283.6124148850401,50,1E+40,null,null,50,1E+40,50,1E+40,50,489.71948384618207,50,1E+40]
[60,1E+40,60,7.7309238387479053E+17,60,727.16275506139141,60,1E+40,null,null,60,1E+40,60,1.0403938101158237E+27,60,1255.607061274799,60,1E+40]
[70,1.4097934727902839E+21,70,1E+40,70,1864.3955944416903,70,1E+40,null,null,70,1E+40,70,2.6824669892965718E+24,70,3219.2901437168562,70,1E+40]
[80,1E+40,80,3997747086674505.5,80,4780.1854913245606,80,1E+40,null,null,80,1E+40,80,1E+40,80,8254.0407637191092,80,1E+40]
[90,3.5397284299898506E+18,90,1.1123059865199794E+16,90,12256.098743420807,90,1E+40,null,null,90,1E+40,90,4.4364928112517861E+20,90,21162.82397449881,90,1E+40]
[100,2.3205722264789471E+19,100,116263203315097.83,100,31424.060968558028,100,1E+40,null,null,100,1E+40,100,1E+40,100,54260.335041051869,100,1E+40]
[120,7885622586211371,120,97672033369.95401,120,206594.43801554677,120,1E+40,null,null,120,4.6702580112021034E+25,120,2.6921277192912867E+17,120,356721.13966741296,120,1E+40]
[140,1E+40,140,866312156.66682434,140,1359159.7165527681,140,1E+40,null,null,140,2.7238548652193764E+23,140,1E+40,140,2346523.8909992259,140,1E+40]
[160,115084623420110.88,160,25700946.879912831,160,8985424.333387889,160,1E+40,null,null,160,1E+40,160,1610563208236537.8,160,15501789.164351452,160,1E+40]
[180,1E+40,180,1706158.1943182421,180,61484524.772927284,180,1E+40,null,null,180,2.7749925949646217E+19,180,1E+40,180,105632475.17579292,180,1E+40]
[200,1786008591057.313,200,199011.26498919399,200,557975962.81187654,200,1E+40,null,null,200,1E+40,200,42496074929547.891,200,927513684.87651515,200,1E+40]
[250,856497947.35596061,250,4471.7743212012756,250,1E+40,250,1E+40,null,null,250,1E+40,250,1821662414523.7808,250,1E+40,250,1E+40]
[]
["Compared with source concentrations in mg/L",null,null,null,null,null,null,null,null,null,"Compared with source concentrations in mg/L"]
[null,0.01,null,0.5,null,6,null,100,null,null,null,0.01,null,0.5,null,6,null,100]
[]
[]
["Pollutant Linkage: Infill, Geo Barrier, Sst Unsaturated, Sst Saturated, Principal Aquifer",null,null,null,null,null,null,null,null,null,"Pollutant Linkage: Infill, Geo Barrier, Sst Unsaturated, Sst Saturated, Principal Aquifer at Site Boundary"]
["Dilution Factor",null,null,null,null,null,null,null,null,null,"Dilution Factor"]
[]
[null,12.83921468512464,"for all species and timeslices",null,null,null,null,null,null,null,null,12.83921468512464,"for all species and timeslices"]
[]
[]
["Pollutant Linkage: Infill, Geo Barrier, Sst Unsaturated, Sst Saturated, Principal Aquifer",null,null,null,null,null,null,null,null,null,"Pollutant Linkage: Infill, Geo Barrier, Sst Unsaturated, Sst Saturated, Principal Aquifer at Site Boundary"]
["Attenuation Factor",null,null,null,null,null,null,null,null,null,"Attenuation Factor"]
[]
[null,"Species1",null,"Species2",null,"Species3",null,"Species4",null,null,null,"Species1",null,"Species2",null,"Species3",null,"Species4"]
["Time(years)","Hg","Time(years)","Pb","Time(years)","Benzene","Time(years)","BaP",null,null,"Time(years)","Hg","Time(years)","Pb","Time(years)","Benzene","Time(years)","BaP"]
[1,1E+40,1,3.8943191796558557E-2,1,1E+40,1,7.7886383593117108,null,null,1,1E+40,1,3.8943191796558557E-2,1,1E+40,1,7.7886383593117108]
[2,1E+40,2,1.9471595898279279E-2,2,1E+40,2,3.8943191796558554,null,null,2,1E+40,2,1.9471595898279279E-2,2,1E+40,2,3.8943191796558554]
[5,1E+40,5,7.7886383593117111E-3,5,1E+40,5,1.5577276718623423,null,null,5,1E+40,5,7.7886383593117111E-3,5,1E+40,5,1.5577276718623423]
[10,1E+40,10,3.8943191796558555E-3,10,1E+40,10,0.77886383593117114,null,null,10,1E+40,10,3.8943191796558555E-3,10,1E+40,10,0.77886383593117114]
[15,1E+40,15,2.596212786437237E-3,15,1E+40,15,0.51924255728744739,null,null,15,1E+40,15,2.596212786437237E-3,15,1E+40,15,0.51924255728744739]
[20,1E+40,20,1.9471595898279278E-3,20,1E+40,20,0.38943191796558557,null,null,20,1E+40,20,1.9471595898279278E-3,20,1E+40,20,0.38943191796558557]
[30,1E+40,30,1.2981063932186185E-3,30,1E+40,30,0.2596212786437237,null,null,30,1E+40,30,1.2981063932186185E-3,30,1E+40,30,0.2596212786437237]
[40,1E+40,40,9.7357979491396389E-4,40,1E+40,40,0.19471595898279279,null,null,40,1E+40,40,9.7357979491396389E-4,40,1E+40,40,0.19471595898279279]
[50,7.938927454574803E+29,50,7.7886383593117115E-4,50,3.0821992300167838E+22,50,0.15577276718623423,null,null,50,1E+40,50,7.7886383593117115E-4,50,1E+40,50,0.15577276718623423]
[60,1E+40,60,6.4905319660930926E-4,60,3.6128021978033564E+21,60,0.12981063932186185,null,null,60,1E+40,60,6.4905319660930926E-4,60,4.8619506829551407E+30,60,0.12981063932186185]
[70,1.0980371520881676E+25,70,5.563313113794079E-4,70,1E+40,70,0.11126626227588159,null,null,70,1E+40,70,5.563313113794079E-4,70,1.2535659174253605E+28,70,0.11126626227588159]
[80,1E+40,80,4.8678989745698194E-4,80,1.8682203786059813E+19,80,9.7357979491396393E-2,null,null,80,1E+40,80,4.8678989745698194E-4,80,1E+40,80,9.7357979491396393E-2]
[90,2.7569664631365167E+22,90,4.327021310728728E-4,90,5.1980094443409392E+19,90,8.6540426214574556E-2,null,null,90,1E+40,90,4.327021310728728E-4,90,2.0732542854315784E+24,90,8.6540426214574556E-2]
[100,1.8074097858707311E+23,100,3.8943191796558558E-4,100,5.4331922706985645E+17,100,7.7886383593117114E-2,null,null,100,1E+40,100,3.8943191796558558E-4,100,1E+40,100,7.7886383593117114E-2]
[120,6.1418262562020696E+19,120,3.2452659830465463E-4,120,456439287442318.31,120,6.4905319660930924E-2,null,null,120,3.6374950693931524E+29,120,3.2452659830465463E-4,120,1.2580805533583079E+21,120,6.4905319660930924E-2]
[140,1E+40,140,2.7816565568970395E-4,140,4048435256731.9707,140,5.5633131137940793E-2,null,null,140,2.1215120488445462E+27,140,2.7816565568970395E-4,140,1E+40,140,5.5633131137940793E-2]
[160,8.9635251253681843E+17,160,2.4339494872849097E-4,160,120105228443.71301,160,4.8678989745698197E-2,null,null,160,1E+40,160,2.4339494872849097E-4,160,7.5264566302603397E+18,160,4.8678989745698197E-2]
[180,1E+40,180,2.163510655364364E-4,180,7973189495.592638,180,4.3270213107287278E-2,null,null,180,2.1613413771947397E+23,180,2.163510655364364E-4,180,1E+40,180,4.3270213107287278E-2]
[200,1.3910575022369248E+16,200,1.9471595898279279E-4,200,930016063.45799041,200,3.8943191796558557E-2,null,null,200,1E+40,200,1.9471595898279279E-4,200,1.9859193558987683E+17,200,3.8943191796558557E-2]
[250,6670952767448.377,250,1.5577276718623423E-4,250,20897419.807376005,250,3.1154553437246844E-2,null,null,250,1E+40,250,1.5577276718623423E-4,250,8512961855685785,250,3.1154553437246844E-2]
[]
[]
["Saved  21/07/2022: 12:35:30  Level Number: 5"]
[]
["BREAKTHROUGH RESULTS"]
[]
["Advanced"]
["Pollutant Linkage: Infill, Geo Barrier, Sst Unsaturated, Sst Saturated, Principal Aquifer",null,null,null,null,null,null,null,null,null,"Pollutant Linkage: Infill, Geo Barrier, Sst Unsaturated, Sst Saturated, Principal Aquifer at Site Boundary"]
["Concentrations in mg/L in Principal Aquifer",null,null,null,null,null,null,null,null,null,"Concentrations in mg/L in Principal Aquifer at Site Boundary"]
[]
["Compared with MRV target concentration in mg/L",null,null,null,null,null,null,null,null,null,"Compared with MRV target concentration in mg/L"]
[null,1.0000000000000001E-5,null,2.0000000000000001E-4,null,1E-3,null,4.9999999999999998E-8,null,null,null,1.0000000000000001E-5,null,2.0000000000000001E-4,null,1E-3,null,4.9999999999999998E-8]
[]
[null,"Species1",null,"Species2",null,"Species3",null,"Species4",null,null,null,"Species1",null,"Species2",null,"Species3",null,"Species4"]
["Time(years)","Hg","Time(years)","Pb","Time(years)","Benzene","Time(years)","BaP",null,null,"Time(years)","Hg","Time(years)","Pb","Time(years)","Benzene","Time(years)","BaP"]
[1,0,1,0,1,1.5747210032985321E-3,1,0,null,null,1,0,1,0,1,7.8716914605407478E-5,1,0]
[2,0,2,0,2,1.6509838457062477E-2,2,0,null,null,2,0,2,0,2,6.8497462025473351E-3,2,0]
[5,0,5,0,5,1.9389588001753156E-2,5,0,null,null,5,0,5,0,5,1.2285658025661676E-2,5,0]
[10,0,10,0,10,1.2125365020660975E-2,10,0,null,null,10,0,10,0,10,7.695518944860015E-3,10,0]
[15,0,15,2.2156346995723199E-34,15,7.5725411135687693E-3,15,0,null,null,15,0,15,0,15,4.8060109318241277E-3,15,0]
[20,0,20,0,20,4.7292082659544672E-3,20,0,null,null,20,0,20,0,20,3.0014530476587344E-3,20,0]
[30,5.3647716598688425E-35,30,4.5686083180112379E-25,30,1.8445143594989128E-3,30,0,null,null,30,0,30,0,30,1.1706448426392422E-3,30,0]
[40,0,40,4.8532473795992992E-22,40,7.1940861568242772E-4,40,0,null,null,40,0,40,0,40,4.5658197041946848E-4,40,0]
[50,0,50,0,50,2.8058807010374222E-4,50,0,null,null,50,0,50,3.4631013316863366E-30,50,1.7807885100240263E-4,50,0]
[60,1.2513928965520281E-25,60,0,60,1.0943662341919439E-4,60,0,null,null,60,0,60,0,60,6.9455376852895723E-5,60,0]
[70,0,70,2.084245478128227E-17,70,4.2683096673351003E-5,70,0,null,null,70,3.7970734498077121E-40,70,2.8225004600290184E-25,70,2.7089388805807016E-5,70,0]
[80,2.5711656554896475E-23,80,2.1663966368010263E-15,80,1.6647478622787499E-5,80,0,null,null,80,5.820158369946481E-37,80,0,80,1.056554664208018E-5,80,0]
[90,0,90,8.0403770550677223E-14,90,6.4929064794965007E-6,90,0,null,null,90,5.9190916180298463E-34,90,1.4115963576424214E-22,90,4.1208152064474527E-6,90,0]
[100,5.2906437616717399E-22,100,1.4297713199573885E-12,100,2.5323566699950578E-6,100,0,null,null,100,8.0429115125820085E-32,100,0,100,1.6072000780657114E-6,100,0]
[120,0,120,1.0364691532869003E-10,120,3.8515569983007604E-7,120,0,null,null,120,0,120,5.9321784293760631E-20,120,2.4444950253670092E-7,120,0]
[140,1.6144556674785536E-18,140,2.1250487633871033E-9,140,5.8521190328267181E-8,140,0,null,null,140,5.5685299879039413E-27,140,0,140,3.7145389513227838E-8,140,0]
[160,1.3067273458529965E-16,160,1.9785769104925917E-8,160,8.8332753645935568E-9,160,0,null,null,160,0,160,3.6237317313838138E-18,160,5.6093737677889525E-9,160,0]
[180,3.9465488434188281E-15,180,1.0888911633067685E-7,180,1.2755479351818861E-9,180,0,null,null,180,3.2767559311454114E-24,180,0,180,8.120539737708907E-10,180,0]
[200,5.9113074777153441E-14,200,4.1503961505162133E-7,200,1.2718808926784742E-10,200,0,null,null,200,0,200,2.1573083350420022E-16,200,8.2703820465136212E-11,200,0]
[250,7.2350259593340185E-12,250,4.2301854123120086E-6,250,0,250,0,null,null,250,0,250,3.8233084105625244E-13,250,0,250,0]
[]
[]
["Pollutant Linkage: Infill, Geo Barrier, Sst Unsaturated, Sst Saturated, Principal Aquifer",null,null,null,null,null,null,null,null,null,"Pollutant Linkage: Infill, Geo Barrier, Sst Unsaturated, Sst Saturated, Principal Aquifer at Site Boundary"]
["Remedial Target Concentrations in mg/L in Infill",null,null,null,null,null,null,null,null,null,"Remedial Target Concentrations in mg/L in Infill"]
[]
[null,"Species1",null,"Species2",null,"Species3",null,"Species4",null,null,null,"Species1",null,"Species2",null,"Species3",null,"Species4"]
["Time(years)","Hg","Time(years)","Pb","Time(years)","Benzene","Time(years)","BaP",null,null,"Time(years)","Hg","Time(years)","Pb","Time(years)","Benzene","Time(years)","BaP"]
[1,1E+40,1,1E+40,1,3.8101987510371282,1,1E+40,null,null,1,1E+40,1,1E+40,1,76.222499701326313,1,1E+40]
[2,1E+40,2,1E+40,2,0.36341966734588838,2,1E+40,null,null,2,1E+40,2,1E+40,2,0.87594486314962661,2,1E+40]
[5,1E+40,5,1E+40,5,0.30944442963189811,5,1E+40,null,null,5,1E+40,5,1E+40,5,0.48837432943904968,5,1E+40]
[10,1E+40,10,1E+40,10,0.49483046405418063,10,1E+40,null,null,10,1E+40,10,1E+40,10,0.77967451486913897,10,1E+40]
[15,1E+40,15,4.5133793950466125E+29,15,0.79233640465140165,15,1E+40,null,null,15,1E+40,15,1E+40,15,1.2484366109676517,15,1E+40]
[20,1E+40,20,1E+40,20,1.2687113069631448,20,1E+40,null,null,20,1E+40,20,1E+40,20,1.9990317705220357,20,1E+40]
[30,1.8640122327675135E+27,30,2.1888503684100247E+20,30,3.2528887449973447,30,1E+40,null,null,30,1E+40,30,1E+40,30,5.1253802873917591,30,1E+40]
[40,1E+40,40,2.0604760519801971E+17,40,8.3401836858854228,40,1E+40,null,null,40,1E+40,40,1E+40,40,13.141123366057826,40,1E+40]
[50,1E+40,50,1E+40,50,21.383660387918887,50,1E+40,null,null,50,1E+40,50,2.8875851562595082E+25,50,33.692939763627791,50,1E+40]
[60,7.9910953846334541E+17,60,1E+40,60,54.826252972162187,60,1E+40,null,null,60,1E+40,60,1E+40,60,86.386400475629259,60,1E+40]
[70,1E+40,70,4797899338124.3076,70,140.57086921123209,70,1E+40,null,null,70,2.633607206230475E+32,70,3.5429577927853336E+20,70,221.48893956270473,70,1E+40]
[80,3889286549331891,80,46159598986.297981,80,360.4149394603844,80,1E+40,null,null,80,1.7181663048271924E+29,80,1E+40,80,567.88353724201636,80,1E+40]
[90,1E+40,90,1243722767.1676366,90,924.08538748355363,90,1E+40,null,null,90,1.6894484230552379E+26,90,7.0841780979808614E+17,90,1456.022582767692,90,1E+40]
[100,189012915071798.31,100,69941254.663704053,100,2369.3344903155803,100,1E+40,null,null,100,1.2433308490782723E+24,100,1E+40,100,3733.2004159812432,100,1E+40]
[120,1E+40,120,964814.04856936878,120,15578.115558583439,120,1E+40,null,null,120,1E+40,120,1685721378588368.8,120,24544.946656617467,120,1E+40]
[140,61940381525.730812,140,47057.743672954857,140,102526.9644438837,140,1E+40,null,null,140,1.7958060783945093E+19,140,1E+40,140,161527.44872585981,140,1E+40]
[160,765270584.69663155,160,5054.1376213221729,160,679249.7405945044,160,1E+40,null,null,160,1E+40,160,27595861783568.75,160,1069638.1179756934,160,1E+40]
[180,25338594.292772446,180,918.36542870196342,180,4703860.8542331522,180,1E+40,null,null,180,3.0517988553710912E+16,180,1E+40,180,7388671.4353950238,180,1E+40]
[200,1691673.1260720838,200,240.94085570015363,200,47174228.61321947,200,1E+40,null,null,200,1E+40,200,463540599995.19275,200,72548039.090035751,200,1E+40]
[250,13821.650476732357,250,23.639625749960921,250,1E+40,250,1E+40,null,null,250,1E+40,250,261553579.41758871,250,1E+40,250,1E+40]
[]
["Compared with source concentrations in mg/L",null,null,null,null,null,null,null,null,null,"Compared with source concentrations in mg/L"]
[null,0.01,null,0.5,null,6,null,100,null,null,null,0.01,null,0.5,null,6,null,100]
[]
[]
["Pollutant Linkage: Infill, Geo Barrier, Sst Unsaturated, Sst Saturated, Principal Aquifer",null,null,null,null,null,null,null,null,null,"Pollutant Linkage: Infill, Geo Barrier, Sst Unsaturated, Sst Saturated, Principal Aquifer at Site Boundary"]
["Dilution Factor",null,null,null,null,null,null,null,null,null,"Dilution Factor"]
[]
[null,12.83921468512464,"for all species and timeslices",null,null,null,null,null,null,null,null,12.83921468512464,"for all species and timeslices"]
[]
[]
["Pollutant Linkage: Infill, Geo Barrier, Sst Unsaturated, Sst Saturated, Principal Aquifer",null,null,null,null,null,null,null,null,null,"Pollutant Linkage: Infill, Geo Barrier, Sst Unsaturated, Sst Saturated, Principal Aquifer at Site Boundary"]
["Attenuation Factor",null,null,null,null,null,null,null,null,null,"Attenuation Factor"]
[]
[null,"Species1",null,"Species2",null,"Species3",null,"Species4",null,null,null,"Species1",null,"Species2",null,"Species3",null,"Species4"]
["Time(years)","Hg","Time(years)","Pb","Time(years)","Benzene","Time(years)","BaP",null,null,"Time(years)","Hg","Time(years)","Pb","Time(years)","Benzene","Time(years)","BaP"]
[1,1E+40,1,3.8943191796558557E-2,1,1E+40,1,7.7886383593117108,null,null,1,1E+40,1,3.8943191796558557E-2,1,1E+40,1,7.7886383593117108]
[2,1E+40,2,1.9471595898279279E-2,2,1E+40,2,3.8943191796558554,null,null,2,1E+40,2,1.9471595898279279E-2,2,1E+40,2,3.8943191796558554]
[5,1E+40,5,7.7886383593117111E-3,5,1E+40,5,1.5577276718623423,null,null,5,1E+40,5,7.7886383593117111E-3,5,1E+40,5,1.5577276718623423]
[10,1E+40,10,3.8943191796558555E-3,10,1E+40,10,0.77886383593117114,null,null,10,1E+40,10,3.8943191796558555E-3,10,1E+40,10,0.77886383593117114]
[15,1E+40,15,2.596212786437237E-3,15,2.1091847931832279E+33,15,0.51924255728744739,null,null,15,1E+40,15,2.596212786437237E-3,15,1E+40,15,0.51924255728744739]
[20,1E+40,20,1.9471595898279278E-3,20,1E+40,20,0.38943191796558557,null,null,20,1E+40,20,1.9471595898279278E-3,20,1E+40,20,0.38943191796558557]
[30,1.4518117178359324E+31,30,1.2981063932186185E-3,30,1.0228898365315133E+24,30,0.2596212786437237,null,null,30,1E+40,30,1.2981063932186185E-3,30,1E+40,30,0.2596212786437237]
[40,1E+40,40,9.7357979491396389E-4,40,9.6289816901376685E+20,40,0.19471595898279279,null,null,40,1E+40,40,9.7357979491396389E-4,40,1E+40,40,0.19471595898279279]
[50,1E+40,50,7.7886383593117115E-4,50,1E+40,50,0.15577276718623423,null,null,50,1E+40,50,7.7886383593117115E-4,50,1.3494213908293142E+29,50,0.15577276718623423]
[60,6.2239752045674889E+21,60,6.4905319660930926E-4,60,1E+40,60,0.12981063932186185,null,null,60,1E+40,60,6.4905319660930926E-4,60,1E+40,60,0.12981063932186185]
[70,1E+40,70,5.563313113794079E-4,70,2.2421461697418748E+16,70,0.11126626227588159,null,null,70,2.0512214109806427E+36,70,5.563313113794079E-4,70,1.6556890182186124E+24,70,0.11126626227588159]
[80,3.0292246408481444E+19,80,4.8678989745698194E-4,80,215712253989075.84,80,9.7357979491396393E-2,null,null,80,1.3382175989453928E+33,80,4.8678989745698194E-4,80,1E+40,80,9.7357979491396393E-2]
[90,1E+40,90,4.327021310728728E-4,90,5812144111626.6963,90,8.6540426214574556E-2,null,null,90,1.3158502793886706E+30,90,4.327021310728728E-4,90,3.3105660766877762E+21,90,8.6540426214574556E-2]
[100,1.472153240733535E+18,100,3.8943191796558558E-4,100,326848283383.26868,100,7.7886383593117114E-2,null,null,100,9.6838543444466308E+27,100,3.8943191796558558E-4,100,1E+40,100,7.7886383593117114E-2]
[120,1E+40,120,3.2452659830465463E-4,120,4508752624.9741306,120,6.4905319660930924E-2,null,null,120,1E+40,120,3.2452659830465463E-4,120,7.8776845154311117E+18,120,6.4905319660930924E-2]
[140,482431231541709.38,140,2.7816565568970395E-4,140,219909448.48430049,140,5.5633131137940793E-2,null,null,140,1.3986884108068608E+23,140,2.7816565568970395E-4,140,1E+40,140,5.5633131137940793E-2]
[160,5960415831221.085,160,2.4339494872849097E-4,160,23618910.09040219,160,4.8678989745698197E-2,null,null,160,1E+40,160,2.4339494872849097E-4,160,1.2896051258746059E+17,160,4.8678989745698197E-2]
[180,197353147479.72424,180,2.163510655364364E-4,180,4291689.7235123133,180,4.3270213107287278E-2,null,null,180,2.3769357629846851E+20,180,2.163510655364364E-4,180,1E+40,180,4.3270213107287278E-2]
[200,13175830201.141787,200,1.9471595898279279E-4,200,1125960.7146189625,200,3.8943191796558557E-2,null,null,200,1E+40,200,1.9471595898279279E-4,200,2166210058932554.5,200,3.8943191796558557E-2]
[250,107651837.09207663,250,1.5577276718623423E-4,250,110472.29754955108,250,3.1154553437246844E-2,null,null,250,1E+40,250,1.5577276718623423E-4,250,1222287745000.2678,250,3.1154553437246844E-2]
[]
[]
["Saved  21/07/2022: 12:37:23  Level Number: 5"]
[]
["BREAKTHROUGH RESULTS"]
[]
["Advanced"]
["Pollutant Linkage: Infill, Geo Barrier, Sst Unsaturated, Sst Saturated, Principal Aquifer",null,null,null,null,null,null,null,null,null,"Pollutant Linkage: Infill, Geo Barrier, Sst Unsaturated, Sst Saturated, Principal Aquifer at Site Boundary"]
["Concentrations in mg/L in Principal Aquifer",null,null,null,null,null,null,null,null,null,"Concentrations in mg/L in Principal Aquifer at Site Boundary"]
[]
["Compared with MRV target concentration in mg/L",null,null,null,null,null,null,null,null,null,"Compared with MRV target concentration in mg/L"]
[null,1.0000000000000001E-5,null,2.0000000000000001E-4,null,1E-3,null,4.9999999999999998E-8,null,null,null,1.0000000000000001E-5,null,2.0000000000000001E-4,null,1E-3,null,4.9999999999999998E-8]
[]
[null,"Species1",null,"Species2",null,"Species3",null,"Species4",null,null,null,"Species1",null,"Species2",null,"Species3",null,"Species4"]
["Time(years)","Hg","Time(years)","Pb","Time(years)","Benzene","Time(years)","BaP",null,null,"Time(years)","Hg","Time(years)","Pb","Time(years)","Benzene","Time(years)","BaP"]
[1,0,1,0,1,5.2462641207467497E-7,1,0,null,null,1,0,1,0,1,5.5803555014235654E-10,1,0]
[2,0,2,0,2,3.1528643862031814E-4,2,0,null,null,2,0,2,0,2,3.1364288560182103E-5,2,0]
[5,0,5,0,5,2.0535066501096181E-3,5,0,null,null,5,0,5,0,5,1.0329576656022826E-3,5,0]
[10,0,10,0,10,1.3444732612297664E-3,10,0,null,null,10,0,10,0,10,7.1153403511772871E-4,10,0]
[15,0,15,2.2156346995723199E-34,15,8.3967260163362038E-4,15,0,null,null,15,0,15,0,15,4.4439429947052675E-4,15,0]
[20,0,20,0,20,5.2439287898423136E-4,20,0,null,null,20,0,20,0,20,2.7753342029113729E-4,20,0]
[30,5.3647716598688425E-35,30,4.5686083180112379E-25,30,2.0452687638041842E-4,30,0,null,null,30,0,30,0,30,1.0824525966514123E-4,30,0]
[40,0,40,4.8532473795992992E-22,40,7.9770808084173039E-5,40,0,null,null,40,0,40,0,40,4.2218470110033599E-5,40,0]
[50,0,50,0,50,3.1112692868318224E-5,50,0,null,null,50,0,50,3.4631013316863366E-30,50,1.6466303237232448E-5,50,0]
[60,1.2513928965520281E-25,60,0,60,1.2134760262055863E-5,60,0,null,null,60,0,60,0,60,6.4222874273760993E-6,60,0]
[70,0,70,2.084245478128227E-17,70,4.732871588646591E-6,70,0,null,null,70,3.7970734498077121E-40,70,2.8225004600290184E-25,70,2.5048593792498286E-6,70,0]
[80,2.5711656554896475E-23,80,2.1663966368010263E-15,80,1.8459415387642025E-6,80,0,null,null,80,5.820158369946481E-37,80,0,80,9.7696006163841804E-7,80,0]
[90,0,90,8.0403770550677223E-14,90,7.199630307566823E-7,90,0,null,null,90,5.9190916180298463E-34,90,1.4115963576424214E-22,90,3.8103920298389107E-7,90,0]
[100,5.2906437616717399E-22,100,1.4297713199573885E-12,100,2.8080157936231939E-7,100,0,null,null,100,8.0429115125820085E-32,100,0,100,1.486142507706226E-7,100,0]
[120,0,120,1.0364691532869003E-10,120,4.2710879378938528E-8,120,0,null,null,120,0,120,5.9321784293760631E-20,120,2.2605340978964756E-8,120,0]
[140,1.6144556674785536E-18,140,2.1250487633871033E-9,140,6.4917229831934805E-9,140,0,null,null,140,5.5685299879039413E-27,140,0,140,3.4363478072356894E-9,140,0]
[160,1.3067273458529965E-16,160,1.9785769104925917E-8,160,9.8161421087613525E-10,160,0,null,null,160,0,160,3.6237317313838138E-18,160,5.2003958055882098E-10,160,0]
[180,3.9465488434188281E-15,180,1.0888911633067685E-7,180,1.4318500417172115E-10,180,0,null,null,180,3.2767559311454114E-24,180,0,180,7.621927986180859E-11,180,0]
[200,5.9113074777153441E-14,200,4.1503961505162133E-7,200,1.5533661834708118E-11,200,0,null,null,200,0,200,2.1573083350420022E-16,200,8.5884729301108058E-12,200,0]
[250,7.2350259593340185E-12,250,4.2301854123120086E-6,250,0,250,0,null,null,250,0,250,3.8233084105625244E-13,250,0,250,0]
[]
[]
["Pollutant Linkage: Infill, Geo Barrier, Sst Unsaturated, Sst Saturated, Principal Aquifer",null,null,null,null,null,null,null,null,null,"Pollutant Linkage: Infill, Geo Barrier, Sst Unsaturated, Sst Saturated, Principal Aquifer at Site Boundary"]
["Remedial Target Concentrations in mg/L in Infill",null,null,null,null,null,null,null,null,null,"Remedial Target Concentrations in mg/L in Infill"]
[]
[null,"Species1",null,"Species2",null,"Species3",null,"Species4",null,null,null,"Species1",null,"Species2",null,"Species3",null,"Species4"]
["Time(years)","Hg","Time(years)","Pb","Time(years)","Benzene","Time(years)","BaP",null,null,"Time(years)","Hg","Time(years)","Pb","Time(years)","Benzene","Time(years)","BaP"]
[1,1E+40,1,1E+40,1,11436.709746031551,1,1E+40,null,null,1,1E+40,1,1E+40,1,10752003.162646864,1,1E+40]
[2,1E+40,2,1E+40,2,19.030314231895858,2,1E+40,null,null,2,1E+40,2,1E+40,2,191.30036979755309,2,1E+40]
[5,1E+40,5,1E+40,5,2.9218312975415563,5,1E+40,null,null,5,1E+40,5,1E+40,5,5.8085633127100165,5,1E+40]
[10,1E+40,10,1E+40,10,4.4627142636603301,10,1E+40,null,null,10,1E+40,10,1E+40,10,8.4324848902094391,10,1E+40]
[15,1E+40,15,4.5133793950466125E+29,15,7.1456422280859631,15,1E+40,null,null,15,1E+40,15,1E+40,15,13.501523325453759,15,1E+40]
[20,1E+40,20,1E+40,20,11.441802969602152,20,1E+40,null,null,20,1E+40,20,1E+40,20,21.619017968019484,20,1E+40]
[30,1.8640122327675135E+27,30,2.1888503684100247E+20,30,29.335997821821941,30,1E+40,null,null,30,1E+40,30,1E+40,30,55.429679032237665,30,1E+40]
[40,1E+40,40,2.0604760519801971E+17,40,75.215484763159026,40,1E+40,null,null,40,1E+40,40,1E+40,40,142.11789258024407,40,1E+40]
[50,1E+40,50,1E+40,50,192.84733807499339,50,1E+40,null,null,50,1E+40,50,2.8875851562595082E+25,50,364.38051173703769,50,1E+40]
[60,7.9910953846334541E+17,60,1E+40,60,494.44734551216294,60,1E+40,null,null,60,1E+40,60,1E+40,60,934.24656990965138,60,1E+40]
[70,1E+40,70,4797899338124.3076,70,1267.7293029443372,70,1E+40,null,null,70,2.633607206230475E+32,70,3.5429577927853336E+20,70,2395.3440459387857,70,1E+40]
[80,3889286549331891,80,46159598986.297981,80,3250.3737924532561,80,1E+40,null,null,80,1.7181663048271924E+29,80,1E+40,80,6141.4997762934709,80,1E+40]
[90,1E+40,90,1243722767.1676366,90,8333.761240065327,90,1E+40,null,null,90,1.6894484230552379E+26,90,7.0841780979808614E+17,90,15746.411269534536,90,1E+40]
[100,189012915071798.31,100,69941254.663704053,100,21367.401186366464,100,1E+40,null,null,100,1.2433308490782723E+24,100,1E+40,100,40372.978828663268,100,1E+40]
[120,1E+40,120,964814.04856936878,120,140479.43023525533,120,1E+40,null,null,120,1E+40,120,1685721378588368.8,120,265423.99893827119,120,1E+40]
[140,61940381525.730812,140,47057.743672954857,140,924253.85610776837,140,1E+40,null,null,140,1.7958060783945093E+19,140,1E+40,140,1746039.7889195613,140,1E+40]
[160,765270584.69663155,160,5054.1376213221729,160,6112380.9471388236,160,1E+40,null,null,160,1E+40,160,27595861783568.75,160,11537583.338469269,160,1E+40]
[180,25338594.292772446,180,918.36542870196342,180,41903829.487648204,180,1E+40,null,null,180,3.0517988553710912E+16,180,1E+40,180,78720239.956064418,180,1E+40]
[200,1691673.1260720838,200,240.94085570015363,200,386257925.77727646,200,1E+40,null,null,200,1E+40,200,463540599995.19275,200,698610806.46412301,200,1E+40]
[250,13821.650476732357,250,23.639625749960921,250,1E+40,250,1E+40,null,null,250,1E+40,250,261553579.41758871,250,1E+40,250,1E+40]
[]
["Compared with source concentrations in mg/L",null,null,null,null,null,null,null,null,null,"Compared with source concentrations in mg/L"]
[null,0.01,null,0.5,null,6,null,100,null,null,null,0.01,null,0.5,null,6,null,100]
[]
[]
["Pollutant Linkage: Infill, Geo Barrier, Sst Unsaturated, Sst Saturated, Principal Aquifer",null,null,null,null,null,null,null,null,null,"Pollutant Linkage: Infill, Geo Barrier, Sst Unsaturated, Sst Saturated, Principal Aquifer at Site Boundary"]
["Dilution Factor",null,null,null,null,null,null,null,null,null,"Dilution Factor"]
[]
[null,12.83921468512464,"for all species and timeslices",null,null,null,null,null,null,null,null,12.83921468512464,"for all species and timeslices"]
[]
[]
["Pollutant Linkage: Infill, Geo Barrier, Sst Unsaturated, Sst Saturated, Principal Aquifer",null,null,null,null,null,null,null,null,null,"Pollutant Linkage: Infill, Geo Barrier, Sst Unsaturated, Sst Saturated, Principal Aquifer at Site Boundary"]
["Attenuation Factor",null,null,null,null,null,null,null,null,null,"Attenuation Factor"]
[]
[null,"Species1",null,"Species2",null,"Species3",null,"Species4",null,null,null,"Species1",null,"Species2",null,"Species3",null,"Species4"]
["Time(years)","Hg","Time(years)","Pb","Time(years)","Benzene","Time(years)","BaP",null,null,"Time(years)","Hg","Time(years)","Pb","Time(years)","Benzene","Time(years)","BaP"]
[1,1E+40,1,3.8943191796558557E-2,1,1E+40,1,7.7886383593117108,null,null,1,1E+40,1,3.8943191796558557E-2,1,1E+40,1,7.7886383593117108]
[2,1E+40,2,1.9471595898279279E-2,2,1E+40,2,3.8943191796558554,null,null,2,1E+40,2,1.9471595898279279E-2,2,1E+40,2,3.8943191796558554]
[5,1E+40,5,7.7886383593117111E-3,5,1E+40,5,1.5577276718623423,null,null,5,1E+40,5,7.7886383593117111E-3,5,1E+40,5,1.5577276718623423]
[10,1E+40,10,3.8943191796558555E-3,10,1E+40,10,0.77886383593117114,null,null,10,1E+40,10,3.8943191796558555E-3,10,1E+40,10,0.77886383593117114]
[15,1E+40,15,2.596212786437237E-3,15,2.1091847931832279E+33,15,0.51924255728744739,null,null,15,1E+40,15,2.596212786437237E-3,15,1E+40,15,0.51924255728744739]
[20,1E+40,20,1.9471595898279278E-3,20,1E+40,20,0.38943191796558557,null,null,20,1E+40,20,1.9471595898279278E-3,20,1E+40,20,0.38943191796558557]
[30,1.4518117178359324E+31,30,1.2981063932186185E-3,30,1.0228898365315133E+24,30,0.2596212786437237,null,null,30,1E+40,30,1.2981063932186185E-3,30,1E+40,30,0.2596212786437237]
[40,1E+40,40,9.7357979491396389E-4,40,9.6289816901376685E+20,40,0.19471595898279279,null,null,40,1E+40,40,9.7357979491396389E-4,40,1E+40,40,0.19471595898279279]
[50,1E+40,50,7.7886383593117115E-4,50,1E+40,50,0.15577276718623423,null,null,50,1E+40,50,7.7886383593117115E-4,50,1.3494213908293142E+29,50,0.15577276718623423]
[60,6.2239752045674889E+21,60,6.4905319660930926E-4,60,1E+40,60,0.12981063932186185,null,null,60,1E+40,60,6.4905319660930926E-4,60,1E+40,60,0.12981063932186185]
[70,1E+40,70,5.563313113794079E-4,70,2.2421461697418748E+16,70,0.11126626227588159,null,null,70,2.0512214109806427E+36,70,5.563313113794079E-4,70,1.6556890182186124E+24,70,0.11126626227588159]
[80,3.0292246408481444E+19,80,4.8678989745698194E-4,80,215712253989075.84,80,9.7357979491396393E-2,null,null,80,1.3382175989453928E+33,80,4.8678989745698194E-4,80,1E+40,80,9.7357979491396393E-2]
[90,1E+40,90,4.327021310728728E-4,90,5812144111626.6963,90,8.6540426214574556E-2,null,null,90,1.3158502793886706E+30,90,4.327021310728728E-4,90,3.3105660766877762E+21,90,8.6540426214574556E-2]
[100,1.472153240733535E+18,100,3.8943191796558558E-4,100,326848283383.26868,100,7.7886383593117114E-2,null,null,100,9.6838543444466308E+27,100,3.8943191796558558E-4,100,1E+40,100,7.7886383593117114E-2]
[120,1E+40,120,3.2452659830465463E-4,120,4508752624.9741306,120,6.4905319660930924E-2,null,null,120,1E+40,120,3.2452659830465463E-4,120,7.8776845154311117E+18,120,6.4905319660930924E-2]
[140,482431231541709.38,140,2.7816565568970395E-4,140,219909448.48430049,140,5.5633131137940793E-2,null,null,140,1.3986884108068608E+23,140,2.7816565568970395E-4,140,1E+40,140,5.5633131137940793E-2]
[160,5960415831221.085,160,2.4339494872849097E-4,160,23618910.09040219,160,4.8678989745698197E-2,null,null,160,1E+40,160,2.4339494872849097E-4,160,1.2896051258746059E+17,160,4.8678989745698197E-2]
[180,197353147479.72424,180,2.163510655364364E-4,180,4291689.7235123133,180,4.3270213107287278E-2,null,null,180,2.3769357629846851E+20,180,2.163510655364364E-4,180,1E+40,180,4.3270213107287278E-2]
[200,13175830201.141787,200,1.9471595898279279E-4,200,1125960.7146189625,200,3.8943191796558557E-2,null,null,200,1E+40,200,1.9471595898279279E-4,200,2166210058932554.5,200,3.8943191796558557E-2]
[250,107651837.09207663,250,1.5577276718623423E-4,250,110472.29754955108,250,3.1154553437246844E-2,null,null,250,1E+40,250,1.5577276718623423E-4,250,1222287745000.2678,250,3.1154553437246844E-2]
[]
[]
["Saved  21/07/2022: 12:39:50  Level Number: 5"]
[]
["BREAKTHROUGH RESULTS"]
[]
["Advanced"]
["Pollutant Linkage: Infill, Geo Barrier, Sst Unsaturated, Sst Saturated, Principal Aquifer",null,null,null,null,null,null,null,null,null,"Pollutant Linkage: Infill, Geo Barrier, Sst Unsaturated, Sst Saturated, Principal Aquifer at Site Boundary"]
["Concentrations in mg/L in Principal Aquifer",null,null,null,null,null,null,null,null,null,"Concentrations in mg/L in Principal Aquifer at Site Boundary"]
[]
["Compared with MRV target concentration in mg/L",null,null,null,null,null,null,null,null,null,"Compared with MRV target concentration in mg/L"]
[null,1.0000000000000001E-5,null,2.0000000000000001E-4,null,1E-3,null,4.9999999999999998E-8,null,null,null,1.0000000000000001E-5,null,2.0000000000000001E-4,null,1E-3,null,4.9999999999999998E-8]
[]
[null,"Species1",null,"Species2",null,"Species3",null,"Species4",null,null,null,"Species1",null,"Species2",null,"Species3",null,"Species4"]
["Time(years)","Hg","Time(years)","Pb","Time(years)","Benzene","Time(years)","BaP",null,null,"Time(years)","Hg","Time(years)","Pb","Time(years)","Benzene","Time(years)","BaP"]
[1,0,1,0,1,1.5747210032985321E-3,1,0,null,null,1,0,1,0,1,7.8716914605407478E-5,1,0]
[2,0,2,0,2,1.6509838457062477E-2,2,0,null,null,2,0,2,0,2,6.8497462025473351E-3,2,0]
[5,0,5,0,5,1.9389588001753156E-2,5,0,null,null,5,0,5,0,5,1.2285658025661676E-2,5,0]
[10,0,10,0,10,1.2125365020660975E-2,10,0,null,null,10,0,10,0,10,7.695518944860015E-3,10,0]
[15,0,15,2.2156346995723199E-34,15,7.5725411135687693E-3,15,0,null,null,15,0,15,0,15,4.8060109318241277E-3,15,0]
[20,0,20,0,20,4.7292082659544672E-3,20,0,null,null,20,0,20,0,20,3.0014530476587344E-3,20,0]
[30,5.3647716598688425E-35,30,4.5686083180112379E-25,30,1.8445143594989128E-3,30,0,null,null,30,0,30,0,30,1.1706448426392422E-3,30,0]
[40,0,40,4.8532473795992992E-22,40,7.1940861568242772E-4,40,0,null,null,40,0,40,0,40,4.5658197041946848E-4,40,0]
[50,0,50,0,50,2.8058807010374222E-4,50,0,null,null,50,0,50,3.4631013316863366E-30,50,1.7807885100240263E-4,50,0]
[60,1.2513928965520281E-25,60,0,60,1.0943662341919439E-4,60,0,null,null,60,0,60,0,60,6.9455376852895723E-5,60,0]
[70,0,70,2.084245478128227E-17,70,4.2683096673351003E-5,70,0,null,null,70,3.7970734498077121E-40,70,2.8225004600290184E-25,70,2.7089388805807016E-5,70,0]
[80,2.5711656554896475E-23,80,2.1663966368010263E-15,80,1.6647478622787499E-5,80,0,null,null,80,5.820158369946481E-37,80,0,80,1.056554664208018E-5,80,0]
[90,0,90,8.0403770550677223E-14,90,6.4929064794965007E-6,90,0,null,null,90,5.9190916180298463E-34,90,1.4115963576424214E-22,90,4.1208152064474527E-6,90,0]
[100,5.2906437616717399E-22,100,1.4297713199573885E-12,100,2.5323566699950578E-6,100,0,null,null,100,8.0429115125820085E-32,100,0,100,1.6072000780657114E-6,100,0]
[120,0,120,1.0364691532869003E-10,120,3.8515569983007604E-7,120,0,null,null,120,0,120,5.9321784293760631E-20,120,2.4444950253670092E-7,120,0]
[140,1.6144556674785536E-18,140,2.1250487633871033E-9,140,5.8521190328267181E-8,140,0,null,null,140,5.5685299879039413E-27,140,0,140,3.7145389513227838E-8,140,0]
[160,1.3067273458529965E-16,160,1.9785769104925917E-8,160,8.8332753645935568E-9,160,0,null,null,160,0,160,3.6237317313838138E-18,160,5.6093737677889525E-9,160,0]
[180,3.9465488434188281E-15,180,1.0888911633067685E-7,180,1.2755479351818861E-9,180,0,null,null,180,3.2767559311454114E-24,180,0,180,8.120539737708907E-10,180,0]
[200,5.9113074777153441E-14,200,4.1503961505162133E-7,200,1.2718808926784742E-10,200,0,null,null,200,0,200,2.1573083350420022E-16,200,8.2703820465136212E-11,200,0]
[250,7.2350259593340185E-12,250,4.2301854123120086E-6,250,0,250,0,null,null,250,0,250,3.8233084105625244E-13,250,0,250,0]
[]
[]
["Pollutant Linkage: Infill, Geo Barrier, Sst Unsaturated, Sst Saturated, Principal Aquifer",null,null,null,null,null,null,null,null,null,"Pollutant Linkage: Infill, Geo Barrier, Sst Unsaturated, Sst Saturated, Principal Aquifer at Site Boundary"]
["Remedial Target Concentrations in mg/L in Infill",null,null,null,null,null,null,null,null,null,"Remedial Target Concentrations in mg/L in Infill"]
[]
[null,"Species1",null,"Species2",null,"Species3",null,"Species4",null,null,null,"Species1",null,"Species2",null,"Species3",null,"Species4"]
["Time(years)","Hg","Time(years)","Pb","Time(years)","Benzene","Time(years)","BaP",null,null,"Time(years)","Hg","Time(years)","Pb","Time(years)","Benzene","Time(years)","BaP"]
[1,1E+40,1,1E+40,1,3.8101987510371282,1,1E+40,null,null,1,1E+40,1,1E+40,1,76.222499701326313,1,1E+40]
[2,1E+40,2,1E+40,2,0.36341966734588838,2,1E+40,null,null,2,1E+40,2,1E+40,2,0.87594486314962661,2,1E+40]
[5,1E+40,5,1E+40,5,0.30944442963189811,5,1E+40,null,null,5,1E+40,5,1E+40,5,0.48837432943904968,5,1E+40]
[10,1E+40,10,1E+40,10,0.49483046405418063,10,1E+40,null,null,10,1E+40,10,1E+40,10,0.77967451486913897,10,1E+40]
[15,1E+40,15,4.5133793950466125E+29,15,0.79233640465140165,15,1E+40,null,null,15,1E+40,15,1E+40,15,1.2484366109676517,15,1E+40]
[20,1E+40,20,1E+40,20,1.2687113069631448,20,1E+40,null,null,20,1E+40,20,1E+40,20,1.9990317705220357,20,1E+40]
[30,1.8640122327675135E+27,30,2.1888503684100247E+20,30,3.2528887449973447,30,1E+40,null,null,30,1E+40,30,1E+40,30,5.1253802873917591,30,1E+40]
[40,1E+40,40,2.0604760519801971E+17,40,8.3401836858854228,40,1E+40,null,null,40,1E+40,40,1E+40,40,13.141123366057826,40,1E+40]
[50,1E+40,50,1E+40,50,21.383660387918887,50,1E+40,null,null,50,1E+40,50,2.8875851562595082E+25,50,33.692939763627791,50,1E+40]
[60,7.9910953846334541E+17,60,1E+40,60,54.826252972162187,60,1E+40,null,null,60,1E+40,60,1E+40,60,86.386400475629259,60,1E+40]
[70,1E+40,70,4797899338124.3076,70,140.57086921123209,70,1E+40,null,null,70,2.633607206230475E+32,70,3.5429577927853336E+20,70,221.48893956270473,70,1E+40]
[80,3889286549331891,80,46159598986.297981,80,360.4149394603844,80,1E+40,null,null,80,1.7181663048271924E+29,80,1E+40,80,567.88353724201636,80,1E+40]
[90,1E+40,90,1243722767.1676366,90,924.08538748355363,90,1E+40,null,null,90,1.6894484230552379E+26,90,7.0841780979808614E+17,90,1456.022582767692,90,1E+40]
[100,189012915071798.31,100,69941254.663704053,100,2369.3344903155803,100,1E+40,null,null,100,1.2433308490782723E+24,100,1E+40,100,3733.2004159812432,100,1E+40]
[120,1E+40,120,964814.04856936878,120,15578.115558583439,120,1E+40,null,null,120,1E+40,120,1685721378588368.8,120,24544.946656617467,120,1E+40]
[140,61940381525.730812,140,47057.743672954857,140,102526.9644438837,140,1E+40,null,null,140,1.7958060783945093E+19,140,1E+40,140,161527.44872585981,140,1E+40]
[160,765270584.69663155,160,5054.1376213221729,160,679249.7405945044,160,1E+40,null,null,160,1E+40,160,27595861783568.75,160,1069638.1179756934,160,1E+40]
[180,25338594.292772446,180,918.36542870196342,180,4703860.8542331522,180,1E+40,null,null,180,3.0517988553710912E+16,180,1E+40,180,7388671.4353950238,180,1E+40]
[200,1691673.1260720838,200,240.94085570015363,200,47174228.61321947,200,1E+40,null,null,200,1E+40,200,463540599995.19275,200,72548039.090035751,200,1E+40]
[250,13821.650476732357,250,23.639625749960921,250,1E+40,250,1E+40,null,null,250,1E+40,250,261553579.41758871,250,1E+40,250,1E+40]
[]
["Compared with source concentrations in mg/L",null,null,null,null,null,null,null,null,null,"Compared with source concentrations in mg/L"]
[null,0.01,null,0.5,null,6,null,100,null,null,null,0.01,null,0.5,null,6,null,100]
[]
[]
["Pollutant Linkage: Infill, Geo Barrier, Sst Unsaturated, Sst Saturated, Principal Aquifer",null,null,null,null,null,null,null,null,null,"Pollutant Linkage: Infill, Geo Barrier, Sst Unsaturated, Sst Saturated, Principal Aquifer at Site Boundary"]
["Dilution Factor",null,null,null,null,null,null,null,null,null,"Dilution Factor"]
[]
[null,12.83921468512464,"for all species and timeslices",null,null,null,null,null,null,null,null,12.83921468512464,"for all species and timeslices"]
[]
[]
["Pollutant Linkage: Infill, Geo Barrier, Sst Unsaturated, Sst Saturated, Principal Aquifer",null,null,null,null,null,null,null,null,null,"Pollutant Linkage: Infill, Geo Barrier, Sst Unsaturated, Sst Saturated, Principal Aquifer at Site Boundary"]
["Attenuation Factor",null,null,null,null,null,null,null,null,null,"Attenuation Factor"]
[]
[null,"Species1",null,"Species2",null,"Species3",null,"Species4",null,null,null,"Species1",null,"Species2",null,"Species3",null,"Species4"]
["Time(years)","Hg","Time(years)","Pb","Time(years)","Benzene","Time(years)","BaP",null,null,"Time(years)","Hg","Time(years)","Pb","Time(years)","Benzene","Time(years)","BaP"]
[1,1E+40,1,3.8943191796558557E-2,1,1E+40,1,7.7886383593117108,null,null,1,1E+40,1,3.8943191796558557E-2,1,1E+40,1,7.7886383593117108]
[2,1E+40,2,1.9471595898279279E-2,2,1E+40,2,3.8943191796558554,null,null,2,1E+40,2,1.9471595898279279E-2,2,1E+40,2,3.8943191796558554]
[5,1E+40,5,7.7886383593117111E-3,5,1E+40,5,1.5577276718623423,null,null,5,1E+40,5,7.7886383593117111E-3,5,1E+40,5,1.5577276718623423]
[10,1E+40,10,3.8943191796558555E-3,10,1E+40,10,0.77886383593117114,null,null,10,1E+40,10,3.8943191796558555E-3,10,1E+40,10,0.77886383593117114]
[15,1E+40,15,2.596212786437237E-3,15,2.1091847931832279E+33,15,0.51924255728744739,null,null,15,1E+40,15,2.596212786437237E-3,15,1E+40,15,0.51924255728744739]
[20,1E+40,20,1.9471595898279278E-3,20,1E+40,20,0.38943191796558557,null,null,20,1E+40,20,1.9471595898279278E-3,20,1E+40,20,0.38943191796558557]
[30,1.4518117178359324E+31,30,1.2981063932186185E-3,30,1.0228898365315133E+24,30,0.2596212786437237,null,null,30,1E+40,30,1.2981063932186185E-3,30,1E+40,30,0.2596212786437237]
[40,1E+40,40,9.7357979491396389E-4,40,9.6289816901376685E+20,40,0.19471595898279279,null,null,40,1E+40,40,9.7357979491396389E-4,40,1E+40,40,0.19471595898279279]
[50,1E+40,50,7.7886383593117115E-4,50,1E+40,50,0.15577276718623423,null,null,50,1E+40,50,7.7886383593117115E-4,50,1.3494213908293142E+29,50,0.15577276718623423]
[60,6.2239752045674889E+21,60,6.4905319660930926E-4,60,1E+40,60,0.12981063932186185,null,null,60,1E+40,60,6.4905319660930926E-4,60,1E+40,60,0.12981063932186185]
[70,1E+40,70,5.563313113794079E-4,70,2.2421461697418748E+16,70,0.11126626227588159,null,null,70,2.0512214109806427E+36,70,5.563313113794079E-4,70,1.6556890182186124E+24,70,0.11126626227588159]
[80,3.0292246408481444E+19,80,4.8678989745698194E-4,80,215712253989075.84,80,9.7357979491396393E-2,null,null,80,1.3382175989453928E+33,80,4.8678989745698194E-4,80,1E+40,80,9.7357979491396393E-2]
[90,1E+40,90,4.327021310728728E-4,90,5812144111626.6963,90,8.6540426214574556E-2,null,null,90,1.3158502793886706E+30,90,4.327021310728728E-4,90,3.3105660766877762E+21,90,8.6540426214574556E-2]
[100,1.472153240733535E+18,100,3.8943191796558558E-4,100,326848283383.26868,100,7.7886383593117114E-2,null,null,100,9.6838543444466308E+27,100,3.8943191796558558E-4,100,1E+40,100,7.7886383593117114E-2]
[120,1E+40,120,3.2452659830465463E-4,120,4508752624.9741306,120,6.4905319660930924E-2,null,null,120,1E+40,120,3.2452659830465463E-4,120,7.8776845154311117E+18,120,6.4905319660930924E-2]
[140,482431231541709.38,140,2.7816565568970395E-4,140,219909448.48430049,140,5.5633131137940793E-2,null,null,140,1.3986884108068608E+23,140,2.7816565568970395E-4,140,1E+40,140,5.5633131137940793E-2]
[160,5960415831221.085,160,2.4339494872849097E-4,160,23618910.09040219,160,4.8678989745698197E-2,null,null,160,1E+40,160,2.4339494872849097E-4,160,1.2896051258746059E+17,160,4.8678989745698197E-2]
[180,197353147479.72424,180,2.163510655364364E-4,180,4291689.7235123133,180,4.3270213107287278E-2,null,null,180,2.3769357629846851E+20,180,2.163510655364364E-4,180,1E+40,180,4.3270213107287278E-2]
[200,13175830201.141787,200,1.9471595898279279E-4,200,1125960.7146189625,200,3.8943191796558557E-2,null,null,200,1E+40,200,1.9471595898279279E-4,200,2166210058932554.5,200,3.8943191796558557E-2]
[250,107651837.09207663,250,1.5577276718623423E-4,250,110472.29754955108,250,3.1154553437246844E-2,null,null,250,1E+40,250,1.5577276718623423E-4,250,1222287745000.2678,250,3.1154553437246844E-2]
[]
[]
["Saved  21/07/2022: 13:40:38  Level Number: 5"]
[]
["BREAKTHROUGH RESULTS"]
[]
["Advanced"]
["Pollutant Linkage: Infill, Geo Barrier, Sst Unsaturated, Sst Saturated, Principal Aquifer",null,null,null,null,null,null,null,null,null,"Pollutant Linkage: Infill, Geo Barrier, Sst Unsaturated, Sst Saturated, Principal Aquifer at Site Boundary"]
["Concentrations in mg/L in Principal Aquifer",null,null,null,null,null,null,null,null,null,"Concentrations in mg/L in Principal Aquifer at Site Boundary"]
[]
["Compared with MRV target concentration in mg/L",null,null,null,null,null,null,null,null,null,"Compared with MRV target concentration in mg/L"]
[null,1.0000000000000001E-5,null,2.0000000000000001E-4,null,1E-3,null,4.9999999999999998E-8,null,null,null,1.0000000000000001E-5,null,2.0000000000000001E-4,null,1E-3,null,4.9999999999999998E-8]
[]
[null,"Species1",null,"Species2",null,"Species3",null,"Species4",null,null,null,"Species1",null,"Species2",null,"Species3",null,"Species4"]
["Time(years)","Hg","Time(years)","Pb","Time(years)","Benzene","Time(years)","BaP",null,null,"Time(years)","Hg","Time(years)","Pb","Time(years)","Benzene","Time(years)","BaP"]
[1,0,1,0,1,0,1,0,null,null,1,0,1,0,1,1.6969198437994826E-24,1,0]
[2,0,2,0,2,3.6834310370669256E-18,2,0,null,null,2,0,2,0,2,2.3541661816998249E-20,2,0]
[5,0,5,0,5,1.041400136902739E-9,5,0,null,null,5,0,5,0,5,2.3397057857741718E-10,5,0]
[10,0,10,0,10,1.9816338106286692E-8,10,0,null,null,10,0,10,0,10,1.088379082527405E-8,10,0]
[15,0,15,0,15,1.4037736301395953E-8,15,0,null,null,15,0,15,0,15,8.1234673022973447E-9,15,0]
[20,0,20,0,20,8.7783133897456735E-9,20,0,null,null,20,0,20,0,20,5.0837848685932362E-9,20,0]
[30,0,30,0,30,3.4237916299948461E-9,30,0,null,null,30,0,30,0,30,1.9828286207415665E-9,30,0]
[40,0,40,0,40,1.335367875618313E-9,40,0,null,null,40,0,40,0,40,7.7335478624157891E-10,40,0]
[50,0,50,0,50,5.2082823536064697E-10,50,0,null,null,50,0,50,0,50,3.0162849998340263E-10,50,0]
[60,0,60,0,60,2.031365693842806E-10,60,0,null,null,60,0,60,0,60,1.1764296600114788E-10,60,0]
[70,0,70,0,70,7.9228553450792088E-11,70,0,null,null,70,0,70,0,70,4.5883819655821678E-11,70,0]
[80,0,80,0,80,3.0901206922011186E-11,80,0,null,null,80,0,80,0,80,1.7895887442536786E-11,80,0]
[90,0,90,3.9540348757572243E-35,90,1.2052287688799057E-11,90,0,null,null,90,0,90,0,90,6.9798679970328243E-12,90,0]
[100,0,100,7.2433953895651403E-33,100,4.7007205161887692E-12,100,0,null,null,100,0,100,0,100,2.7223379878060075E-12,100,0]
[120,1.8819015920404346E-38,120,0,120,7.150932296079464E-13,120,0,null,null,120,0,120,5.3597034880140713E-38,120,4.14133983981756E-13,120,0]
[140,3.418780850104055E-35,140,5.1831593475645798E-28,140,1.0879064357452393E-13,140,0,null,null,140,0,140,6.9600507169308375E-35,140,6.3006080439593358E-14,140,0]
[160,0,160,0,160,1.6549413522299174E-14,160,0,null,null,160,0,160,4.2283872508044283E-32,160,9.5872270049021102E-15,160,0]
[180,0,180,2.4277415612698774E-25,180,2.507200503592376E-15,180,0,null,null,180,0,180,1.9552925905652289E-30,180,1.4555008063116181E-15,180,0]
[200,4.8276272372511469E-30,200,0,200,3.6163772394490151E-16,200,0,null,null,200,0,200,0,200,2.1317829277369643E-16,200,0]
[250,7.5411443886224117E-28,250,8.6764587714386428E-23,250,0,250,0,null,null,250,4.1660500763324466E-34,250,0,250,0,250,0]
[]
[]
["Pollutant Linkage: Infill, Geo Barrier, Sst Unsaturated, Sst Saturated, Principal Aquifer",null,null,null,null,null,null,null,null,null,"Pollutant Linkage: Infill, Geo Barrier, Sst Unsaturated, Sst Saturated, Principal Aquifer at Site Boundary"]
["Remedial Target Concentrations in mg/L in Infill",null,null,null,null,null,null,null,null,null,"Remedial Target Concentrations in mg/L in Infill"]
[]
[null,"Species1",null,"Species2",null,"Species3",null,"Species4",null,null,null,"Species1",null,"Species2",null,"Species3",null,"Species4"]
["Time(years)","Hg","Time(years)","Pb","Time(years)","Benzene","Time(years)","BaP",null,null,"Time(years)","Hg","Time(years)","Pb","Time(years)","Benzene","Time(years)","BaP"]
[1,1E+40,1,1E+40,1,1E+40,1,1E+40,null,null,1,1E+40,1,1E+40,1,3.5358181601352016E+21,1,1E+40]
[2,1E+40,2,1E+40,2,1628916067552531.8,2,1E+40,null,null,2,1E+40,2,1E+40,2,2.5486730914075498E+17,2,1E+40]
[5,1E+40,5,1E+40,5,5761474.1801789943,5,1E+40,null,null,5,1E+40,5,1E+40,5,25644249.958610479,5,1E+40]
[10,1E+40,10,1E+40,10,302780.46164828568,10,1E+40,null,null,10,1E+40,10,1E+40,10,551278.51098230958,10,1E+40]
[15,1E+40,15,1E+40,15,427419.34106593404,15,1E+40,null,null,15,1E+40,15,1E+40,15,738600.86792042351,15,1E+40]
[20,1E+40,20,1E+40,20,683502.59709443257,20,1E+40,null,null,20,1E+40,20,1E+40,20,1180223.0336431004,20,1E+40]
[30,1E+40,30,1E+40,30,1752443.0947945954,30,1E+40,null,null,30,1E+40,30,1E+40,30,3025980.1261876253,30,1E+40]
[40,1E+40,40,1E+40,40,4493143.881585313,40,1E+40,null,null,40,1E+40,40,1E+40,40,7758405.4650509823,40,1E+40]
[50,1E+40,50,1E+40,50,11520112.760102775,50,1E+40,null,null,50,1E+40,50,1E+40,50,19892019.488643002,50,1E+40]
[60,1E+40,60,1E+40,60,29536779.213050451,60,1E+40,null,null,60,1E+40,60,1E+40,60,51001774.300228506,60,1E+40]
[70,1E+40,70,1E+40,70,75730273.2243689,70,1E+40,null,null,70,1E+40,70,1E+40,70,130765050.6214717,70,1E+40]
[80,1E+40,80,1E+40,80,194167173.31277278,80,1E+40,null,null,80,1E+40,80,1E+40,80,335272560.20501018,80,1E+40]
[90,1E+40,90,2.5290621641481938E+30,90,497830798.17918503,90,1E+40,null,null,90,1E+40,90,1E+40,90,859615110.56521833,90,1E+40]
[100,1E+40,100,1.3805680157134642E+28,100,1276400070.8692751,100,1E+40,null,null,100,1E+40,100,1E+40,100,2203987905.5706573,100,1E+40]
[120,5.3137741326620554E+30,120,1E+40,120,8390514343.5486469,120,1E+40,null,null,120,1E+40,120,1.8657748553372487E+33,120,14488064810.117878,120,1E+40]
[140,2.9250193090603158E+27,140,1.9293252106360028E+23,140,55151801688.624733,140,1E+40,null,null,140,1E+40,140,1.4367711395657307E+30,140,95228904228.576141,140,1E+40]
[160,1E+40,160,1E+40,160,362550611954.64246,160,1E+40,null,null,160,1E+40,160,2.3649678723483885E+27,160,625832683103.47705,160,1E+40]
[180,1E+40,180,4.1190545812336411E+20,180,2393107368717.8423,180,1E+40,null,null,180,1E+40,180,5.1143240905491474E+25,180,4122292460424.3877,180,1E+40]
[200,2.071410966206663E+22,200,1E+40,200,16591189476997.564,200,1E+40,null,null,200,1E+40,200,1E+40,200,28145454783097.531,200,1E+40]
[250,1.3260586834920374E+20,250,1.1525439425723107E+18,250,1E+40,250,1E+40,null,null,250,2.4003552085968759E+26,250,1E+40,250,1E+40,250,1E+40]
[]
["Compared with source concentrations in mg/L",null,null,null,null,null,null,null,null,null,"Compared with source concentrations in mg/L"]
[null,0.01,null,0.5,null,6,null,100,null,null,null,0.01,null,0.5,null,6,null,100]
[]
[]
["Pollutant Linkage: Infill, Geo Barrier, Sst Unsaturated, Sst Saturated, Principal Aquifer",null,null,null,null,null,null,null,null,null,"Pollutant Linkage: Infill, Geo Barrier, Sst Unsaturated, Sst Saturated, Principal Aquifer at Site Boundary"]
["Dilution Factor",null,null,null,null,null,null,null,null,null,"Dilution Factor"]
[]
[null,12.83921468512464,"for all species and timeslices",null,null,null,null,null,null,null,null,12.83921468512464,"for all species and timeslices"]
[]
[]
["Pollutant Linkage: Infill, Geo Barrier, Sst Unsaturated, Sst Saturated, Principal Aquifer",null,null,null,null,null,null,null,null,null,"Pollutant Linkage: Infill, Geo Barrier, Sst Unsaturated, Sst Saturated, Principal Aquifer at Site Boundary"]
["Attenuation Factor",null,null,null,null,null,null,null,null,null,"Attenuation Factor"]
[]
[null,"Species1",null,"Species2",null,"Species3",null,"Species4",null,null,null,"Species1",null,"Species2",null,"Species3",null,"Species4"]
["Time(years)","Hg","Time(years)","Pb","Time(years)","Benzene","Time(years)","BaP",null,null,"Time(years)","Hg","Time(years)","Pb","Time(years)","Benzene","Time(years)","BaP"]
[1,1E+40,1,3.8943191796558557E-2,1,1E+40,1,7.7886383593117108,null,null,1,1E+40,1,3.8943191796558557E-2,1,1E+40,1,7.7886383593117108]
[2,1E+40,2,1.9471595898279279E-2,2,1E+40,2,3.8943191796558554,null,null,2,1E+40,2,1.9471595898279279E-2,2,1E+40,2,3.8943191796558554]
[5,1E+40,5,7.7886383593117111E-3,5,1E+40,5,1.5577276718623423,null,null,5,1E+40,5,7.7886383593117111E-3,5,1E+40,5,1.5577276718623423]
[10,1E+40,10,3.8943191796558555E-3,10,1E+40,10,0.77886383593117114,null,null,10,1E+40,10,3.8943191796558555E-3,10,1E+40,10,0.77886383593117114]
[15,1E+40,15,2.596212786437237E-3,15,1E+40,15,0.51924255728744739,null,null,15,1E+40,15,2.596212786437237E-3,15,1E+40,15,0.51924255728744739]
[20,1E+40,20,1.9471595898279278E-3,20,1E+40,20,0.38943191796558557,null,null,20,1E+40,20,1.9471595898279278E-3,20,1E+40,20,0.38943191796558557]
[30,1E+40,30,1.2981063932186185E-3,30,1E+40,30,0.2596212786437237,null,null,30,1E+40,30,1.2981063932186185E-3,30,1E+40,30,0.2596212786437237]
[40,1E+40,40,9.7357979491396389E-4,40,1E+40,40,0.19471595898279279,null,null,40,1E+40,40,9.7357979491396389E-4,40,1E+40,40,0.19471595898279279]
[50,1E+40,50,7.7886383593117115E-4,50,1E+40,50,0.15577276718623423,null,null,50,1E+40,50,7.7886383593117115E-4,50,1E+40,50,0.15577276718623423]
[60,1E+40,60,6.4905319660930926E-4,60,1E+40,60,0.12981063932186185,null,null,60,1E+40,60,6.4905319660930926E-4,60,1E+40,60,0.12981063932186185]
[70,1E+40,70,5.563313113794079E-4,70,1E+40,70,0.11126626227588159,null,null,70,1E+40,70,5.563313113794079E-4,70,1E+40,70,0.11126626227588159]
[80,1E+40,80,4.8678989745698194E-4,80,1E+40,80,9.7357979491396393E-2,null,null,80,1E+40,80,4.8678989745698194E-4,80,1E+40,80,9.7357979491396393E-2]
[90,1E+40,90,4.327021310728728E-4,90,1.181877035086111E+34,90,8.6540426214574556E-2,null,null,90,1E+40,90,4.327021310728728E-4,90,1E+40,90,8.6540426214574556E-2]
[100,1E+40,100,3.8943191796558558E-4,100,6.4516470028948433E+31,100,7.7886383593117114E-2,null,null,100,1E+40,100,3.8943191796558558E-4,100,1E+40,100,7.7886383593117114E-2]
[120,4.1387065042369996E+34,120,3.2452659830465463E-4,120,1E+40,120,6.4905319660930924E-2,null,null,120,1E+40,120,3.2452659830465463E-4,120,8.7191073648713715E+36,120,6.4905319660930924E-2]
[140,2.2781917592274609E+31,140,2.7816565568970395E-4,140,9.0160898058880316E+26,140,5.5633131137940793E-2,null,null,140,1E+40,140,2.7816565568970395E-4,140,6.7142944867041887E+33,140,5.5633131137940793E-2]
[160,1E+40,160,2.4339494872849097E-4,160,1E+40,160,4.8678989745698197E-2,null,null,160,1E+40,160,2.4339494872849097E-4,160,1.1051927693467477E+31,160,4.8678989745698197E-2]
[180,1E+40,180,2.163510655364364E-4,180,1.9249095909296981E+24,180,4.3270213107287278E-2,null,null,180,1E+40,180,2.163510655364364E-4,180,2.3900172476161841E+29,180,4.3270213107287278E-2]
[200,1.6133470909296147E+26,200,1.9471595898279279E-4,200,1E+40,200,3.8943191796558557E-2,null,null,200,1E+40,200,1.9471595898279279E-4,200,1E+40,200,3.8943191796558557E-2]
[250,1.0328191528944468E+24,250,1.5577276718623423E-4,250,5.386048777146632E+21,250,3.1154553437246844E-2,null,null,250,1.8695498653651291E+30,250,1.5577276718623423E-4,250,1E+40,250,3.1154553437246844E-2]
[]
[]
["Saved  21/07/2022: 13:42:13  Level Number: 5"]
[]
["BREAKTHROUGH RESULTS"]
[]
["Advanced"]
["Pollutant Linkage: Infill, Geo Barrier, Sst Unsaturated, Sst Saturated, Principal Aquifer",null,null,null,null,null,null,null,null,null,"Pollutant Linkage: Infill, Geo Barrier, Sst Unsaturated, Sst Saturated, Principal Aquifer at Site Boundary"]
["Concentrations in mg/L in Principal Aquifer",null,null,null,null,null,null,null,null,null,"Concentrations in mg/L in Principal Aquifer at Site Boundary"]
[]
["Compared with MRV target concentration in mg/L",null,null,null,null,null,null,null,null,null,"Compared with MRV target concentration in mg/L"]
[null,1.0000000000000001E-5,null,2.0000000000000001E-4,null,1E-3,null,4.9999999999999998E-8,null,null,null,1.0000000000000001E-5,null,2.0000000000000001E-4,null,1E-3,null,4.9999999999999998E-8]
[]
[null,"Species1",null,"Species2",null,"Species3",null,"Species4",null,null,null,"Species1",null,"Species2",null,"Species3",null,"Species4"]
["Time(years)","Hg","Time(years)","Pb","Time(years)","Benzene","Time(years)","BaP",null,null,"Time(years)","Hg","Time(years)","Pb","Time(years)","Benzene","Time(years)","BaP"]
[1,0,1,0,1,1.0488840180360715E-9,1,0,null,null,1,0,1,0,1,6.2932016521140079E-13,1,0]
[2,0,2,0,2,1.2895634918030533E-5,2,0,null,null,2,0,2,0,2,1.0052146508841244E-6,2,0]
[5,0,5,0,5,4.1379205755007718E-4,5,0,null,null,5,0,5,0,5,2.15720524059459E-4,5,0]
[10,0,10,0,10,3.0279905903066493E-4,10,0,null,null,10,0,10,0,10,1.7532125680534683E-4,10,0]
[15,0,15,0,15,1.8915153213412328E-4,15,0,null,null,15,0,15,0,15,1.095437567306659E-4,15,0]
[20,0,20,0,20,1.1812906114217706E-4,20,0,null,null,20,0,20,0,20,6.8412365210776356E-5,20,0]
[30,0,30,9.626199954567267E-33,30,4.6073409402048413E-5,30,0,null,null,30,0,30,0,30,2.6682603555489857E-5,30,0]
[40,0,40,0,40,1.796982942015167E-5,40,0,null,null,40,0,40,0,40,1.0406910146819869E-5,40,0]
[50,1.5970804815810474E-36,50,0,50,7.0087016066839508E-6,50,0,null,null,50,0,50,0,50,4.0589660609900466E-6,50,0]
[60,4.9768962621631922E-33,60,8.847860036787282E-24,60,2.7335763091826376E-6,60,0,null,null,60,0,60,8.9652914245153482E-35,60,1.5831026003329077E-6,60,0]
[70,0,70,0,70,1.0661660053844952E-6,70,0,null,null,70,0,70,3.46427555570989E-31,70,6.174513418956717E-7,70,0]
[80,7.048721811866963E-29,80,1.1022419705944325E-21,80,4.1583242575398971E-7,80,0,null,null,80,0,80,2.4666511031482864E-29,80,2.4082213707159343E-7,80,0]
[90,0,90,0,90,1.6218525940876191E-7,90,0,null,null,90,0,90,0,90,9.3926867798921038E-8,90,0]
[100,9.8826833099101988E-27,100,4.4672333781687618E-20,100,6.3256135163239628E-8,100,0,null,null,100,1.1471014968418347E-38,100,7.179569885326088E-26,100,3.6633816391971547E-8,100,0]
[120,0,120,3.2784349410052953E-19,120,9.6218279019607802E-9,120,0,null,null,120,1.8998881328475774E-35,120,0,120,5.5724509886533601E-9,120,0]
[140,9.9923129729933394E-24,140,1.8968516067280575E-16,140,1.4627495448325843E-9,140,0,null,null,140,3.7680506337466318E-32,140,2.7818307832648952E-22,140,8.4725166923224119E-10,140,0]
[160,0,160,1.3746040881486535E-14,160,2.2144498682798027E-10,160,0,null,null,160,0,160,0,160,1.2835638327122683E-10,160,0]
[180,4.1907285638979898E-22,180,3.7864422728781926E-13,180,3.2523568208316803E-11,180,0,null,null,180,1.8402697334430353E-29,180,3.6859113138182589E-20,180,1.8931242030346257E-11,180,0]
[200,0,200,5.2755201754208756E-12,200,3.7277041767595181E-12,200,0,null,null,200,3.1068467949469728E-27,200,0,200,2.2414232316330771E-12,200,0]
[250,1.5288619304181332E-18,250,5.6808704499709837E-10,250,0,250,0,null,null,250,1.2242306137162923E-24,250,0,250,0,250,0]
[]
[]
["Pollutant Linkage: Infill, Geo Barrier, Sst Unsaturated, Sst Saturated, Principal Aquifer",null,null,null,null,null,null,null,null,null,"Pollutant Linkage: Infill, Geo Barrier, Sst Unsaturated, Sst Saturated, Principal Aquifer at Site Boundary"]
["Remedial Target Concentrations in mg/L in Infill",null,null,null,null,null,null,null,null,null,"Remedial Target Concentrations in mg/L in Infill"]
[]
[null,"Species1",null,"Species2",null,"Species3",null,"Species4",null,null,null,"Species1",null,"Species2",null,"Species3",null,"Species4"]
["Time(years)","Hg","Time(years)","Pb","Time(years)","Benzene","Time(years)","BaP",null,null,"Time(years)","Hg","Time(years)","Pb","Time(years)","Benzene","Time(years)","BaP"]
[1,1E+40,1,1E+40,1,5720365.5474076048,1,1E+40,null,null,1,1E+40,1,1E+40,1,9534097795.8087273,1,1E+40]
[2,1E+40,2,1E+40,2,465.27371766789605,2,1E+40,null,null,2,1E+40,2,1E+40,2,5968.8744038129289,2,1E+40]
[5,1E+40,5,1E+40,5,14.500036650108681,5,1E+40,null,null,5,1E+40,5,1E+40,5,27.813765176772062,5,1E+40]
[10,1E+40,10,1E+40,10,19.815121021866752,10,1E+40,null,null,10,1E+40,10,1E+40,10,34.222889507697253,10,1E+40]
[15,1E+40,15,1E+40,15,31.720599523061377,15,1E+40,null,null,15,1E+40,15,1E+40,15,54.772633138300506,15,1E+40]
[20,1E+40,20,1E+40,20,50.791904565960756,20,1E+40,null,null,20,1E+40,20,1E+40,20,87.703443398195461,20,1E+40]
[30,1E+40,30,1.0388315272066813E+28,30,130.22695906097286,30,1E+40,null,null,30,1E+40,30,1E+40,30,224.86561281481545,30,1E+40]
[40,1E+40,40,1E+40,40,333.89298583277025,40,1E+40,null,null,40,1E+40,40,1E+40,40,576.54000230159318,40,1E+40]
[50,6.261425216405119E+28,50,1E+40,50,856.07867715155862,50,1E+40,null,null,50,1E+40,50,1E+40,50,1478.208960076031,50,1E+40]
[60,2.0092843959848848E+25,60,1.1302167934870575E+19,60,2194.9268362638286,60,1E+40,null,null,60,1E+40,60,1.1154127095807805E+30,60,3790.0259899379048,60,1E+40]
[70,1E+40,70,1E+40,70,5627.641445795487,70,1E+40,null,null,70,1E+40,70,2.8866064027492834E+26,70,9717.3649045430302,70,1E+40]
[80,1.4186969307207411E+21,80,9.0724180958261456E+16,80,14428.889207282877,80,1E+40,null,null,80,1E+40,80,4.05407963340928E+24,80,24914.653083641868,80,1E+40]
[90,1E+40,90,1E+40,90,36994.73072875238,90,1E+40,null,null,90,1E+40,90,1E+40,90,63879.48561049455,90,1E+40]
[100,1.0118709348879124E+19,100,2238521956088013.3,100,94852.459520587523,100,1E+40,null,null,100,8.7176244016172061E+30,100,1.3928410976872623E+21,100,163783.09963127197,100,1E+40]
[120,1E+40,120,305023591437614.81,120,623582.13648544811,120,1E+40,null,null,120,5.2634677942915878E+27,120,1E+40,120,1076725.4861850229,120,1E+40]
[140,1.000769294059087E+16,140,527189368136.67432,140,4101864.2058006702,140,1E+40,null,null,140,2.6538921506096758E+24,140,3.5947549578351789E+17,140,7081721.0728390226,140,1E+40]
[160,1E+40,160,7274821955.0752363,160,27094765.548523501,160,1E+40,null,null,160,1E+40,160,1E+40,160,46744850.914983653,160,1E+40]
[180,238621992513362.41,180,264100157.33314452,180,184481603.05072871,180,1E+40,null,null,180,5.4339860175228743E+21,180,2713033263310108.5,180,316936416.02501124,180,1E+40]
[200,1E+40,200,18955476.744437266,200,1609569782.2287447,200,1E+40,null,null,200,3.2186974962087498E+19,200,1E+40,200,2676870621.8987765,200,1E+40]
[250,65408130067.474899,250,176029.36183927723,250,1E+40,250,1E+40,null,null,250,8.1683956339270544E+16,250,1E+40,250,1E+40,250,1E+40]
[]
["Compared with source concentrations in mg/L",null,null,null,null,null,null,null,null,null,"Compared with source concentrations in mg/L"]
[null,0.01,null,0.5,null,6,null,100,null,null,null,0.01,null,0.5,null,6,null,100]
[]
[]
["Pollutant Linkage: Infill, Geo Barrier, Sst Unsaturated, Sst Saturated, Principal Aquifer",null,null,null,null,null,null,null,null,null,"Pollutant Linkage: Infill, Geo Barrier, Sst Unsaturated, Sst Saturated, Principal Aquifer at Site Boundary"]
["Dilution Factor",null,null,null,null,null,null,null,null,null,"Dilution Factor"]
[]
[null,12.83921468512464,"for all species and timeslices",null,null,null,null,null,null,null,null,12.83921468512464,"for all species and timeslices"]
[]
[]
["Pollutant Linkage: Infill, Geo Barrier, Sst Unsaturated, Sst Saturated, Principal Aquifer",null,null,null,null,null,null,null,null,null,"Pollutant Linkage: Infill, Geo Barrier, Sst Unsaturated, Sst Saturated, Principal Aquifer at Site Boundary"]
["Attenuation Factor",null,null,null,null,null,null,null,null,null,"Attenuation Factor"]
[]
[null,"Species1",null,"Species2",null,"Species3",null,"Species4",null,null,null,"Species1",null,"Species2",null,"Species3",null,"Species4"]
["Time(years)","Hg","Time(years)","Pb","Time(years)","Benzene","Time(years)","BaP",null,null,"Time(years)","Hg","Time(years)","Pb","Time(years)","Benzene","Time(years)","BaP"]
[1,1E+40,1,3.8943191796558557E-2,1,1E+40,1,7.7886383593117108,null,null,1,1E+40,1,3.8943191796558557E-2,1,1E+40,1,7.7886383593117108]
[2,1E+40,2,1.9471595898279279E-2,2,1E+40,2,3.8943191796558554,null,null,2,1E+40,2,1.9471595898279279E-2,2,1E+40,2,3.8943191796558554]
[5,1E+40,5,7.7886383593117111E-3,5,1E+40,5,1.5577276718623423,null,null,5,1E+40,5,7.7886383593117111E-3,5,1E+40,5,1.5577276718623423]
[10,1E+40,10,3.8943191796558555E-3,10,1E+40,10,0.77886383593117114,null,null,10,1E+40,10,3.8943191796558555E-3,10,1E+40,10,0.77886383593117114]
[15,1E+40,15,2.596212786437237E-3,15,1E+40,15,0.51924255728744739,null,null,15,1E+40,15,2.596212786437237E-3,15,1E+40,15,0.51924255728744739]
[20,1E+40,20,1.9471595898279278E-3,20,1E+40,20,0.38943191796558557,null,null,20,1E+40,20,1.9471595898279278E-3,20,1E+40,20,0.38943191796558557]
[30,1E+40,30,1.2981063932186185E-3,30,4.8546498489985953E+31,30,0.2596212786437237,null,null,30,1E+40,30,1.2981063932186185E-3,30,1E+40,30,0.2596212786437237]
[40,1E+40,40,9.7357979491396389E-4,40,1E+40,40,0.19471595898279279,null,null,40,1E+40,40,9.7357979491396389E-4,40,1E+40,40,0.19471595898279279]
[50,4.876797662445453E+32,50,7.7886383593117115E-4,50,1E+40,50,0.15577276718623423,null,null,50,1E+40,50,7.7886383593117115E-4,50,1E+40,50,0.15577276718623423]
[60,1.5649589521334333E+29,60,6.4905319660930926E-4,60,5.2817099232549471E+22,60,0.12981063932186185,null,null,60,1E+40,60,6.4905319660930926E-4,60,5.2125277297828081E+33,60,0.12981063932186185]
[70,1E+40,70,5.563313113794079E-4,70,1E+40,70,0.11126626227588159,null,null,70,1E+40,70,5.563313113794079E-4,70,1.3489640014012714E+30,70,0.11126626227588159]
[80,1.1049717334849352E+25,80,4.8678989745698194E-4,80,4.2397070155719141E+20,80,9.7357979491396393E-2,null,null,80,1E+40,80,4.8678989745698194E-4,80,1.8945456086685523E+28,80,9.7357979491396393E-2]
[90,1E+40,90,4.327021310728728E-4,90,1E+40,90,8.6540426214574556E-2,null,null,90,1E+40,90,4.327021310728728E-4,90,1E+40,90,8.6540426214574556E-2]
[100,7.8810967781405966E+22,100,3.8943191796558558E-4,100,1.0461022785209151E+19,100,7.7886383593117114E-2,null,null,100,6.7898423816507568E+34,100,3.8943191796558558E-4,100,6.509001361123704E+24,100,7.7886383593117114E-2]
[120,1E+40,120,3.2452659830465463E-4,120,1.4254310668596178E+18,120,6.4905319660930924E-2,null,null,120,4.0995247165621259E+31,120,3.2452659830465463E-4,120,1E+40,120,6.4905319660930924E-2]
[140,7.7946301125299061E+19,140,2.7816565568970395E-4,140,2463652401174362.5,140,5.5633131137940793E-2,null,null,140,2.0670206205714773E+28,140,2.7816565568970395E-4,140,1.6798947814152612E+21,140,5.5633131137940793E-2]
[160,1E+40,160,2.4339494872849097E-4,160,33996574401877.203,160,4.8678989745698197E-2,null,null,160,1E+40,160,2.4339494872849097E-4,160,1E+40,160,4.8678989745698197E-2]
[180,1.8585404042649661E+18,180,2.163510655364364E-4,180,1234188369663.1125,180,4.3270213107287278E-2,null,null,180,4.2323351940042134E+25,180,2.163510655364364E-4,180,1.2678500966823444E+19,180,4.3270213107287278E-2]
[200,1E+40,200,1.9471595898279279E-4,200,88582411974.459091,200,3.8943191796558557E-2,null,null,200,2.5069270785992029E+23,200,1.9471595898279279E-4,200,1E+40,200,3.8943191796558557E-2]
[250,509440270854384.69,250,1.5577276718623423E-4,250,822617423.99193347,250,3.1154553437246844E-2,null,null,250,6.3620679568438552E+20,250,1.5577276718623423E-4,250,1E+40,250,3.1154553437246844E-2]
[]
[]
["Saved  21/07/2022: 13:44:17  Level Number: 5"]
[]
["BREAKTHROUGH RESULTS"]
[]
["Advanced"]
["Pollutant Linkage: Infill, Geo Barrier, Sst Unsaturated, Sst Saturated, Principal Aquifer",null,null,null,null,null,null,null,null,null,"Pollutant Linkage: Infill, Geo Barrier, Sst Unsaturated, Sst Saturated, Principal Aquifer at Site Boundary"]
["Concentrations in mg/L in Principal Aquifer",null,null,null,null,null,null,null,null,null,"Concentrations in mg/L in Principal Aquifer at Site Boundary"]
[]
["Compared with MRV target concentration in mg/L",null,null,null,null,null,null,null,null,null,"Compared with MRV target concentration in mg/L"]
[null,1.0000000000000001E-5,null,2.0000000000000001E-4,null,1E-3,null,4.9999999999999998E-8,null,null,null,1.0000000000000001E-5,null,2.0000000000000001E-4,null,1E-3,null,4.9999999999999998E-8]
[]
[null,"Species1",null,"Species2",null,"Species3",null,"Species4",null,null,null,"Species1",null,"Species2",null,"Species3",null,"Species4"]
["Time(years)","Hg","Time(years)","Pb","Time(years)","Benzene","Time(years)","BaP",null,null,"Time(years)","Hg","Time(years)","Pb","Time(years)","Benzene","Time(years)","BaP"]
[1,0,1,0,1,2.9294573049280291E-5,1,0,null,null,1,0,1,0,1,2.1811397224293442E-7,1,0]
[2,0,2,0,2,2.3362054099879477E-3,2,0,null,null,2,0,2,0,2,4.9824854588528637E-4,2,0]
[5,0,5,0,5,5.9461517757013454E-3,5,0,null,null,5,0,5,0,5,3.3926279908875531E-3,5,0]
[10,0,10,0,10,3.7633336021408743E-3,10,0,null,null,10,0,10,0,10,2.1794609859786419E-3,10,0]
[15,0,15,2.2156346995723199E-34,15,2.350285746701257E-3,15,0,null,null,15,0,15,0,15,1.3611265951109775E-3,15,0]
[20,0,20,0,20,1.4678019705694934E-3,20,0,null,null,20,0,20,0,20,8.500516589667245E-4,20,0]
[30,5.3647716598688425E-35,30,4.5686083180112379E-25,30,5.7248098726632034E-4,30,0,null,null,30,0,30,0,30,3.3154227992707983E-4,30,0]
[40,0,40,4.8532473795992992E-22,40,2.2328249254515179E-4,40,0,null,null,40,0,40,0,40,1.2931012347106187E-4,40,0]
[50,0,50,0,50,8.70859849509792E-5,50,0,null,null,50,0,50,3.4631013316863366E-30,50,5.0434316217224699E-5,50,0]
[60,1.2513928965520281E-25,60,0,60,3.3965798025518989E-5,60,0,null,null,60,0,60,0,60,1.9670696264684193E-5,60,0]
[70,0,70,2.084245478128227E-17,70,1.3247539634719985E-5,70,0,null,null,70,3.7970734498077121E-40,70,2.8225004600290184E-25,70,7.6720820719991487E-6,70,0]
[80,2.5711656554896475E-23,80,2.1663966368010263E-15,80,5.1668774633564532E-6,80,0,null,null,80,5.820158369946481E-37,80,0,80,2.992308865512045E-6,80,0]
[90,0,90,8.0403770550677223E-14,90,2.0152072841639686E-6,90,0,null,null,90,5.9190916180298463E-34,90,1.4115963576424214E-22,90,1.1670744445981432E-6,90,0]
[100,5.2906437616717399E-22,100,1.4297713199573885E-12,100,7.8597265209931078E-7,100,0,null,null,100,8.0429115125820085E-32,100,0,100,4.5518464655785409E-7,100,0]
[120,0,120,1.0364691532869003E-10,120,1.195456058626886E-7,120,0,null,null,120,0,120,5.9321784293760631E-20,120,6.923473605444244E-8,120,0]
[140,1.6144556674785536E-18,140,2.1250487633871033E-9,140,1.8167114369570298E-8,140,0,null,null,140,5.5685299879039413E-27,140,0,140,1.0522783194555224E-8,140,0]
[160,1.3067273458529965E-16,160,1.9785769104925917E-8,160,2.7446979514432068E-9,160,0,null,null,160,0,160,3.6237317313838138E-18,160,1.5908499316862201E-9,160,0]
[180,3.9465488434188281E-15,180,1.0888911633067685E-7,180,3.9837446402312733E-10,180,0,null,null,180,3.2767559311454114E-24,180,0,180,2.3177777010725949E-10,180,0]
[200,5.9113074777153441E-14,200,4.1503961505162133E-7,200,4.1488191025072064E-11,200,0,null,null,200,0,200,2.1573083350420022E-16,200,2.4899888873992659E-11,200,0]
[250,7.2350259593340185E-12,250,4.2301854123120086E-6,250,0,250,0,null,null,250,0,250,3.8233084105625244E-13,250,0,250,0]
[]
[]
["Pollutant Linkage: Infill, Geo Barrier, Sst Unsaturated, Sst Saturated, Principal Aquifer",null,null,null,null,null,null,null,null,null,"Pollutant Linkage: Infill, Geo Barrier, Sst Unsaturated, Sst Saturated, Principal Aquifer at Site Boundary"]
["Remedial Target Concentrations in mg/L in Infill",null,null,null,null,null,null,null,null,null,"Remedial Target Concentrations in mg/L in Infill"]
[]
[null,"Species1",null,"Species2",null,"Species3",null,"Species4",null,null,null,"Species1",null,"Species2",null,"Species3",null,"Species4"]
["Time(years)","Hg","Time(years)","Pb","Time(years)","Benzene","Time(years)","BaP",null,null,"Time(years)","Hg","Time(years)","Pb","Time(years)","Benzene","Time(years)","BaP"]
[1,1E+40,1,1E+40,1,204.816093066337,1,1E+40,null,null,1,1E+40,1,1E+40,1,27508.554075193428,1,1E+40]
[2,1E+40,2,1E+40,2,2.5682673168841577,2,1E+40,null,null,2,1E+40,2,1E+40,2,12.042182660742581,2,1E+40]
[5,1E+40,5,1E+40,5,1.0090559787792002,5,1E+40,null,null,5,1E+40,5,1E+40,5,1.768540499021918,5,1E+40]
[10,1E+40,10,1E+40,10,1.5943311527276609,10,1E+40,null,null,10,1E+40,10,1E+40,10,2.7529742622604569,10,1E+40]
[15,1E+40,15,4.5133793950466125E+29,15,2.5528810734700231,15,1E+40,null,null,15,1E+40,15,1E+40,15,4.408113118611718,15,1E+40]
[20,1E+40,20,1E+40,20,4.0877448867792818,20,1E+40,null,null,20,1E+40,20,1E+40,20,7.0583945536830859,20,1E+40]
[30,1.8640122327675135E+27,30,2.1888503684100247E+20,30,10.480697409098021,30,1E+40,null,null,30,1E+40,30,1E+40,30,18.097239366634184,30,1E+40]
[40,1E+40,40,2.0604760519801971E+17,40,26.871788878775128,40,1E+40,null,null,40,1E+40,40,1E+40,40,46.400079428759739,40,1E+40]
[50,1E+40,50,1E+40,50,68.897423659816297,50,1E+40,null,null,50,1E+40,50,2.8875851562595082E+25,50,118.96661737531073,50,1E+40]
[60,7.9910953846334541E+17,60,1E+40,60,176.64828588723617,60,1E+40,null,null,60,1E+40,60,1E+40,60,305.02224828574612,60,1E+40]
[70,1E+40,70,4797899338124.3076,70,452.91428940320532,70,1E+40,null,null,70,2.633607206230475E+32,70,3.5429577927853336E+20,70,782.0562845512618,70,1E+40]
[80,3889286549331891,80,46159598986.297981,80,1161.2429446124977,80,1E+40,null,null,80,1.7181663048271924E+29,80,1E+40,80,2005.1406020124457,80,1E+40]
[90,1E+40,90,1243722767.1676366,90,2977.361211002752,90,1E+40,null,null,90,1.6894484230552379E+26,90,7.0841780979808614E+17,90,5141.0602192270353,90,1E+40]
[100,189012915071798.31,100,69941254.663704053,100,7633.8533967742633,100,1E+40,null,null,100,1.2433308490782723E+24,100,1E+40,100,13181.46392979755,100,1E+40]
[120,1E+40,120,964814.04856936878,120,50190.05053930352,120,1E+40,null,null,120,1E+40,120,1685721378588368.8,120,86661.701075626625,120,1E+40]
[140,61940381525.730812,140,47057.743672954857,140,330267.09019072005,140,1E+40,null,null,140,1.7958060783945093E+19,140,1E+40,140,570191.35423264862,140,1E+40]
[160,765270584.69663155,160,5054.1376213221729,160,2186032.8918324518,160,1E+40,null,null,160,1E+40,160,27595861783568.75,160,3771568.8202219708,160,1E+40]
[180,25338594.292772446,180,918.36542870196342,180,15061206.331868889,180,1E+40,null,null,180,3.0517988553710912E+16,180,1E+40,180,25886865.669746447,180,1E+40]
[200,1691673.1260720838,200,240.94085570015363,200,144619465.24431714,200,1E+40,null,null,200,1E+40,200,463540599995.19275,200,240964930.82211533,200,1E+40]
[250,13821.650476732357,250,23.639625749960921,250,1E+40,250,1E+40,null,null,250,1E+40,250,261553579.41758871,250,1E+40,250,1E+40]
[]
["Compared with source concentrations in mg/L",null,null,null,null,null,null,null,null,null,"Compared with source concentrations in mg/L"]
[null,0.01,null,0.5,null,6,null,100,null,null,null,0.01,null,0.5,null,6,null,100]
[]
[]
["Pollutant Linkage: Infill, Geo Barrier, Sst Unsaturated, Sst Saturated, Principal Aquifer",null,null,null,null,null,null,null,null,null,"Pollutant Linkage: Infill, Geo Barrier, Sst Unsaturated, Sst Saturated, Principal Aquifer at Site Boundary"]
["Dilution Factor",null,null,null,null,null,null,null,null,null,"Dilution Factor"]
[]
[null,12.83921468512464,"for all species and timeslices",null,null,null,null,null,null,null,null,12.83921468512464,"for all species and timeslices"]
[]
[]
["Pollutant Linkage: Infill, Geo Barrier, Sst Unsaturated, Sst Saturated, Principal Aquifer",null,null,null,null,null,null,null,null,null,"Pollutant Linkage: Infill, Geo Barrier, Sst Unsaturated, Sst Saturated, Principal Aquifer at Site Boundary"]
["Attenuation Factor",null,null,null,null,null,null,null,null,null,"Attenuation Factor"]
[]
[null,"Species1",null,"Species2",null,"Species3",null,"Species4",null,null,null,"Species1",null,"Species2",null,"Species3",null,"Species4"]
["Time(years)","Hg","Time(years)","Pb","Time(years)","Benzene","Time(years)","BaP",null,null,"Time(years)","Hg","Time(years)","Pb","Time(years)","Benzene","Time(years)","BaP"]
[1,1E+40,1,3.8943191796558557E-2,1,1E+40,1,7.7886383593117108,null,null,1,1E+40,1,3.8943191796558557E-2,1,1E+40,1,7.7886383593117108]
[2,1E+40,2,1.9471595898279279E-2,2,1E+40,2,3.8943191796558554,null,null,2,1E+40,2,1.9471595898279279E-2,2,1E+40,2,3.8943191796558554]
[5,1E+40,5,7.7886383593117111E-3,5,1E+40,5,1.5577276718623423,null,null,5,1E+40,5,7.7886383593117111E-3,5,1E+40,5,1.5577276718623423]
[10,1E+40,10,3.8943191796558555E-3,10,1E+40,10,0.77886383593117114,null,null,10,1E+40,10,3.8943191796558555E-3,10,1E+40,10,0.77886383593117114]
[15,1E+40,15,2.596212786437237E-3,15,2.1091847931832279E+33,15,0.51924255728744739,null,null,15,1E+40,15,2.596212786437237E-3,15,1E+40,15,0.51924255728744739]
[20,1E+40,20,1.9471595898279278E-3,20,1E+40,20,0.38943191796558557,null,null,20,1E+40,20,1.9471595898279278E-3,20,1E+40,20,0.38943191796558557]
[30,1.4518117178359324E+31,30,1.2981063932186185E-3,30,1.0228898365315133E+24,30,0.2596212786437237,null,null,30,1E+40,30,1.2981063932186185E-3,30,1E+40,30,0.2596212786437237]
[40,1E+40,40,9.7357979491396389E-4,40,9.6289816901376685E+20,40,0.19471595898279279,null,null,40,1E+40,40,9.7357979491396389E-4,40,1E+40,40,0.19471595898279279]
[50,1E+40,50,7.7886383593117115E-4,50,1E+40,50,0.15577276718623423,null,null,50,1E+40,50,7.7886383593117115E-4,50,1.3494213908293142E+29,50,0.15577276718623423]
[60,6.2239752045674889E+21,60,6.4905319660930926E-4,60,1E+40,60,0.12981063932186185,null,null,60,1E+40,60,6.4905319660930926E-4,60,1E+40,60,0.12981063932186185]
[70,1E+40,70,5.563313113794079E-4,70,2.2421461697418748E+16,70,0.11126626227588159,null,null,70,2.0512214109806427E+36,70,5.563313113794079E-4,70,1.6556890182186124E+24,70,0.11126626227588159]
[80,3.0292246408481444E+19,80,4.8678989745698194E-4,80,215712253989075.84,80,9.7357979491396393E-2,null,null,80,1.3382175989453928E+33,80,4.8678989745698194E-4,80,1E+40,80,9.7357979491396393E-2]
[90,1E+40,90,4.327021310728728E-4,90,5812144111626.6963,90,8.6540426214574556E-2,null,null,90,1.3158502793886706E+30,90,4.327021310728728E-4,90,3.3105660766877762E+21,90,8.6540426214574556E-2]
[100,1.472153240733535E+18,100,3.8943191796558558E-4,100,326848283383.26868,100,7.7886383593117114E-2,null,null,100,9.6838543444466308E+27,100,3.8943191796558558E-4,100,1E+40,100,7.7886383593117114E-2]
[120,1E+40,120,3.2452659830465463E-4,120,4508752624.9741306,120,6.4905319660930924E-2,null,null,120,1E+40,120,3.2452659830465463E-4,120,7.8776845154311117E+18,120,6.4905319660930924E-2]
[140,482431231541709.38,140,2.7816565568970395E-4,140,219909448.48430049,140,5.5633131137940793E-2,null,null,140,1.3986884108068608E+23,140,2.7816565568970395E-4,140,1E+40,140,5.5633131137940793E-2]
[160,5960415831221.085,160,2.4339494872849097E-4,160,23618910.09040219,160,4.8678989745698197E-2,null,null,160,1E+40,160,2.4339494872849097E-4,160,1.2896051258746059E+17,160,4.8678989745698197E-2]
[180,197353147479.72424,180,2.163510655364364E-4,180,4291689.7235123133,180,4.3270213107287278E-2,null,null,180,2.3769357629846851E+20,180,2.163510655364364E-4,180,1E+40,180,4.3270213107287278E-2]
[200,13175830201.141787,200,1.9471595898279279E-4,200,1125960.7146189625,200,3.8943191796558557E-2,null,null,200,1E+40,200,1.9471595898279279E-4,200,2166210058932554.5,200,3.8943191796558557E-2]
[250,107651837.09207663,250,1.5577276718623423E-4,250,110472.29754955108,250,3.1154553437246844E-2,null,null,250,1E+40,250,1.5577276718623423E-4,250,1222287745000.2678,250,3.1154553437246844E-2]
[]
[]
["Saved  21/07/2022: 13:45:28  Level Number: 5"]
[]
["BREAKTHROUGH RESULTS"]
[]
["Advanced"]
["Pollutant Linkage: Infill, Geo Barrier, Sst Unsaturated, Sst Saturated, Principal Aquifer",null,null,null,null,null,null,null,null,null,"Pollutant Linkage: Infill, Geo Barrier, Sst Unsaturated, Sst Saturated, Principal Aquifer at Site Boundary"]
["Concentrations in mg/L in Principal Aquifer",null,null,null,null,null,null,null,null,null,"Concentrations in mg/L in Principal Aquifer at Site Boundary"]
[]
["Compared with MRV target concentration in mg/L",null,null,null,null,null,null,null,null,null,"Compared with MRV target concentration in mg/L"]
[null,1.0000000000000001E-5,null,2.0000000000000001E-4,null,1E-3,null,4.9999999999999998E-8,null,null,null,1.0000000000000001E-5,null,2.0000000000000001E-4,null,1E-3,null,4.9999999999999998E-8]
[]
[null,"Species1",null,"Species2",null,"Species3",null,"Species4",null,null,null,"Species1",null,"Species2",null,"Species3",null,"Species4"]
["Time(years)","Hg","Time(years)","Pb","Time(years)","Benzene","Time(years)","BaP",null,null,"Time(years)","Hg","Time(years)","Pb","Time(years)","Benzene","Time(years)","BaP"]
[1,0,1,0,1,8.6891415990970424E-7,1,0,null,null,1,0,1,0,1,2.49783253066696E-9,1,0]
[2,0,2,0,2,3.9637779079060027E-4,2,0,null,null,2,0,2,0,2,5.8435694710996167E-5,2,0]
[5,0,5,0,5,2.2795007064712099E-3,5,0,null,null,5,0,5,0,5,1.271226873657452E-3,5,0]
[10,0,10,0,10,1.4850674999444351E-3,10,0,null,null,10,0,10,0,10,8.6003043345000117E-4,10,0]
[15,0,15,0,15,9.2747526503775919E-4,15,0,null,null,15,0,15,0,15,5.371309601071338E-4,15,0]
[20,0,20,9.2394272079287442E-34,20,5.7922745451860784E-4,20,0,null,null,20,0,20,0,20,3.3544937861424183E-4,20,0]
[30,6.3063247942957292E-40,30,1.7287263037636632E-27,30,2.2591378864960971E-4,30,0,null,null,30,0,30,0,30,1.3083399138161573E-4,30,0]
[40,3.9452673820197606E-34,40,3.3741842732815537E-24,40,8.8112260807076686E-5,40,0,null,null,40,0,40,0,40,5.1028663780330804E-5,40,0]
[50,0,50,0,50,3.436607661430106E-5,50,0,null,null,50,0,50,1.5800525711945172E-33,50,1.9902508264348693E-5,50,0]
[60,2.056353044235923E-28,60,0,60,1.3403664487764675E-5,60,0,null,null,60,0,60,8.0049556781976372E-30,60,7.762496837701312E-6,60,0]
[70,0,70,5.5453648674599899E-20,70,5.2277770532043694E-6,70,0,null,null,70,0,70,0,70,3.0275758279599709E-6,70,0]
[80,1.1747288220573E-25,80,0,80,2.0389672544486093E-6,80,0,null,null,80,0,80,9.7502388246438774E-26,80,1.1808328740445777E-6,80,0]
[90,0,90,1.2065747659176957E-17,90,7.9524771796716796E-7,90,0,null,null,90,0,90,0,90,4.6055462080588108E-7,90,0]
[100,1.5826713106766512E-23,100,5.0867752407881179E-16,100,3.1016415764422272E-7,100,0,null,null,100,5.3478168242374116E-35,100,0,100,1.7962698875051707E-7,100,0]
[120,0,120,1.3970659717399375E-13,120,4.7176867898856468E-8,120,0,null,null,120,2.2006596304546022E-31,120,0,120,2.7322426363590919E-8,120,0]
[140,4.276880347124667E-23,140,7.4820554835243009E-12,140,7.1703940596929203E-9,140,0,null,null,140,0,140,4.816765575197881E-20,140,4.1532588712345252E-9,140,0]
[160,2.0934613050096197E-20,160,1.4392520478727461E-10,160,1.0841337733782094E-9,160,0,null,null,160,3.5580476640400771E-27,160,0,160,6.2839975013119006E-10,160,0]
[180,1.7607980925608165E-18,180,1.398986448325858E-9,180,1.5803791294131922E-10,180,0,null,null,180,0,180,1.9503964978858457E-18,180,9.1978052388924015E-11,180,0]
[200,5.6682180583951357E-17,200,8.4359170384064527E-9,200,1.706159828085861E-11,200,0,null,null,200,7.5341729688108612E-25,200,0,200,1.025927744121916E-11,200,0]
[250,2.8155973485638042E-14,250,1.9849353459032001E-7,250,0,250,0,null,null,250,0,250,1.9396002264044368E-15,250,0,250,0]
[]
[]
["Pollutant Linkage: Infill, Geo Barrier, Sst Unsaturated, Sst Saturated, Principal Aquifer",null,null,null,null,null,null,null,null,null,"Pollutant Linkage: Infill, Geo Barrier, Sst Unsaturated, Sst Saturated, Principal Aquifer at Site Boundary"]
["Remedial Target Concentrations in mg/L in Infill",null,null,null,null,null,null,null,null,null,"Remedial Target Concentrations in mg/L in Infill"]
[]
[null,"Species1",null,"Species2",null,"Species3",null,"Species4",null,null,null,"Species1",null,"Species2",null,"Species3",null,"Species4"]
["Time(years)","Hg","Time(years)","Pb","Time(years)","Benzene","Time(years)","BaP",null,null,"Time(years)","Hg","Time(years)","Pb","Time(years)","Benzene","Time(years)","BaP"]
[1,1E+40,1,1E+40,1,6905.1700119877296,1,1E+40,null,null,1,1E+40,1,1E+40,1,2402082.5761276744,1,1E+40]
[2,1E+40,2,1E+40,2,15.137074123231338,2,1E+40,null,null,2,1E+40,2,1E+40,2,102.67696875469758,2,1E+40]
[5,1E+40,5,1E+40,5,2.6321553588322084,5,1E+40,null,null,5,1E+40,5,1E+40,5,4.719849874426723,5,1E+40]
[10,1E+40,10,1E+40,10,4.0402203941736623,10,1E+40,null,null,10,1E+40,10,1E+40,10,6.9764973036257292,10,1E+40]
[15,1E+40,15,1E+40,15,6.4691752181183286,15,1E+40,null,null,15,1E+40,15,1E+40,15,11.170460177538949,15,1E+40]
[20,1E+40,20,1.0823181756785287E+29,20,10.358625015429492,20,1E+40,null,null,20,1E+40,20,1E+40,20,17.886454357990765,20,1E+40]
[30,1.5857096369418394E+32,30,5.7846056823620335E+22,30,26.558803851082978,30,1E+40,null,null,30,1E+40,30,1E+40,30,45.85964195267298,30,1E+40]
[40,2.5346824515808987E+26,40,2.9636792747761009E+19,40,68.094950067585984,40,1E+40,null,null,40,1E+40,40,1E+40,40,117.58097421145335,40,1E+40]
[50,1E+40,50,1E+40,50,174.59077646073706,50,1E+40,null,null,50,1E+40,50,6.3289033430324515E+28,50,301.46953943226259,50,1E+40]
[60,4.8629781875396261E+20,60,1E+40,60,447.63877859498842,60,1E+40,null,null,60,1E+40,60,1.2492261546476868E+25,60,772.94717478774066,60,1E+40]
[70,1E+40,70,1803307850612257.5,70,1147.715355673459,70,1E+40,null,null,70,1E+40,70,1E+40,70,1981.7835591727842,70,1E+40]
[80,8.5126029192737626E+17,80,1E+40,80,2942.6661889293355,80,1E+40,null,null,80,1E+40,80,1.0256159033484234E+21,80,5081.1593510679086,80,1E+40]
[90,1E+40,90,8287924032949.7598,90,7544.8188840294315,90,1E+40,null,null,90,1E+40,90,1E+40,90,13027.770711541589,90,1E+40]
[100,6318431333493135,100,196588202282.17227,100,19344.594957623594,100,1E+40,null,null,100,1.8699219379912066E+27,100,1E+40,100,33402.552933364408,100,1E+40]
[120,1E+40,120,715785811.28461492,120,127180.97379553753,120,1E+40,null,null,120,4.5440920811248976E+23,120,1E+40,120,219599.82324247118,120,1E+40]
[140,2338152856374148.5,140,13365311.206285873,140,836774.09498704132,140,1E+40,null,null,140,1E+40,140,2076081935872327.3,140,1444648.6929952779,140,1E+40]
[160,4776778045082.6387,160,694805.33411644434,160,5534372.3692914126,160,1E+40,null,null,160,2.8105300839745475E+19,160,1E+40,160,9548062.3579932824,160,1E+40]
[180,56792428627.955307,180,71480.320713376612,180,37965573.502782524,180,1E+40,null,null,180,1E+40,180,51271626106997.289,180,65232953.342274934,180,1E+40]
[200,1764222882.2141221,200,11854.075798129237,200,351666936.54552835,200,1E+40,null,null,200,1.3272856943153414E+17,200,1E+40,200,584836508.65055382,200,1E+40]
[250,3551644.2026417083,250,503.79474679814956,250,1E+40,250,1E+40,null,null,250,1E+40,250,51557016048.289764,250,1E+40,250,1E+40]
[]
["Compared with source concentrations in mg/L",null,null,null,null,null,null,null,null,null,"Compared with source concentrations in mg/L"]
[null,0.01,null,0.5,null,6,null,100,null,null,null,0.01,null,0.5,null,6,null,100]
[]
[]
["Pollutant Linkage: Infill, Geo Barrier, Sst Unsaturated, Sst Saturated, Principal Aquifer",null,null,null,null,null,null,null,null,null,"Pollutant Linkage: Infill, Geo Barrier, Sst Unsaturated, Sst Saturated, Principal Aquifer at Site Boundary"]
["Dilution Factor",null,null,null,null,null,null,null,null,null,"Dilution Factor"]
[]
[null,12.83921468512464,"for all species and timeslices",null,null,null,null,null,null,null,null,12.83921468512464,"for all species and timeslices"]
[]
[]
["Pollutant Linkage: Infill, Geo Barrier, Sst Unsaturated, Sst Saturated, Principal Aquifer",null,null,null,null,null,null,null,null,null,"Pollutant Linkage: Infill, Geo Barrier, Sst Unsaturated, Sst Saturated, Principal Aquifer at Site Boundary"]
["Attenuation Factor",null,null,null,null,null,null,null,null,null,"Attenuation Factor"]
[]
[null,"Species1",null,"Species2",null,"Species3",null,"Species4",null,null,null,"Species1",null,"Species2",null,"Species3",null,"Species4"]
["Time(years)","Hg","Time(years)","Pb","Time(years)","Benzene","Time(years)","BaP",null,null,"Time(years)","Hg","Time(years)","Pb","Time(years)","Benzene","Time(years)","BaP"]
[1,1E+40,1,3.8943191796558557E-2,1,1E+40,1,7.7886383593117108,null,null,1,1E+40,1,3.8943191796558557E-2,1,1E+40,1,7.7886383593117108]
[2,1E+40,2,1.9471595898279279E-2,2,1E+40,2,3.8943191796558554,null,null,2,1E+40,2,1.9471595898279279E-2,2,1E+40,2,3.8943191796558554]
[5,1E+40,5,7.7886383593117111E-3,5,1E+40,5,1.5577276718623423,null,null,5,1E+40,5,7.7886383593117111E-3,5,1E+40,5,1.5577276718623423]
[10,1E+40,10,3.8943191796558555E-3,10,1E+40,10,0.77886383593117114,null,null,10,1E+40,10,3.8943191796558555E-3,10,1E+40,10,0.77886383593117114]
[15,1E+40,15,2.596212786437237E-3,15,1E+40,15,0.51924255728744739,null,null,15,1E+40,15,2.596212786437237E-3,15,1E+40,15,0.51924255728744739]
[20,1E+40,20,1.9471595898279278E-3,20,5.0578709160420356E+32,20,0.38943191796558557,null,null,20,1E+40,20,1.9471595898279278E-3,20,1E+40,20,0.38943191796558557]
[30,1.2350518905015456E+36,30,1.2981063932186185E-3,30,2.7032521026682456E+26,30,0.2596212786437237,null,null,30,1E+40,30,1.2981063932186185E-3,30,1E+40,30,0.2596212786437237]
[40,1.9741724971057234E+30,40,9.7357979491396389E-4,40,1.3849815650530952E+23,40,0.19471595898279279,null,null,40,1E+40,40,9.7357979491396389E-4,40,1E+40,40,0.19471595898279279]
[50,1E+40,50,7.7886383593117115E-4,50,1E+40,50,0.15577276718623423,null,null,50,1E+40,50,7.7886383593117115E-4,50,2.9576123609951203E+32,50,0.15577276718623423]
[60,3.7875978451967271E+24,60,6.4905319660930926E-4,60,1E+40,60,0.12981063932186185,null,null,60,1E+40,60,6.4905319660930926E-4,60,5.8378624485266617E+28,60,0.12981063932186185]
[70,1E+40,70,5.563313113794079E-4,70,8.427187619355948E+18,70,0.11126626227588159,null,null,70,1E+40,70,5.563313113794079E-4,70,1E+40,70,0.11126626227588159]
[80,6.630158563464448E+21,80,4.8678989745698194E-4,80,1E+40,80,9.7357979491396393E-2,null,null,80,1E+40,80,4.8678989745698194E-4,80,4.7928908200437974E+24,80,9.7357979491396393E-2]
[90,1E+40,90,4.327021310728728E-4,90,3.8730985825256344E+16,90,8.6540426214574556E-2,null,null,90,1E+40,90,4.327021310728728E-4,90,1E+40,90,8.6540426214574556E-2]
[100,4.9211976654721671E+19,100,3.8943191796558558E-4,100,918692647969834.13,100,7.7886383593117114E-2,null,null,100,1.4564145735156805E+31,100,3.8943191796558558E-4,100,1E+40,100,7.7886383593117114E-2]
[120,1E+40,120,3.2452659830465463E-4,120,3344998096093.4429,120,6.4905319660930924E-2,null,null,120,3.5392289891293957E+27,120,3.2452659830465463E-4,120,1E+40,120,6.4905319660930924E-2]
[140,1.821102702708994E+19,140,2.7816565568970395E-4,140,62458545327.250099,140,5.5633131137940793E-2,null,null,140,1E+40,140,2.7816565568970395E-4,140,9.7019108416855941E+18,140,5.5633131137940793E-2]
[160,3.720459671584864E+16,160,2.4339494872849097E-4,160,3246952486.5322366,160,4.8678989745698197E-2,null,null,160,2.1890202422043726E+23,160,2.4339494872849097E-4,160,1E+40,160,4.8678989745698197E-2]
[180,442335688130165.25,180,2.163510655364364E-4,180,334040620.70646513,180,4.3270213107287278E-2,null,null,180,1E+40,180,2.163510655364364E-4,180,2.396016923047481E+17,180,4.3270213107287278E-2]
[200,13740894014788.377,200,1.9471595898279279E-4,200,55396265.685298771,200,3.8943191796558557E-2,null,null,200,1.0337748272510146E+21,200,1.9471595898279279E-4,200,1E+40,200,3.8943191796558557E-2]
[250,27662472275.322262,250,1.5577276718623423E-4,250,2354325.0540790786,250,3.1154553437246844E-2,null,null,250,1E+40,250,1.5577276718623423E-4,250,240935371731215.47,250,3.1154553437246844E-2]
[]
[]
["Saved  21/07/2022: 13:54:12  Level Number: 5"]
[]
["BREAKTHROUGH RESULTS"]
[]
["Advanced"]
["Pollutant Linkage: Infill, Geo Barrier, Sst Unsaturated, Sst Saturated, Principal Aquifer",null,null,null,null,null,null,null,null,null,"Pollutant Linkage: Infill, Geo Barrier, Sst Unsaturated, Sst Saturated, Principal Aquifer at Site Boundary"]
["Concentrations in mg/L in Principal Aquifer",null,null,null,null,null,null,null,null,null,"Concentrations in mg/L in Principal Aquifer at Site Boundary"]
[]
["Compared with MRV target concentration in mg/L",null,null,null,null,null,null,null,null,null,"Compared with MRV target concentration in mg/L"]
[null,1.0000000000000001E-5,null,2.0000000000000001E-4,null,1E-3,null,4.9999999999999998E-8,null,null,null,1.0000000000000001E-5,null,2.0000000000000001E-4,null,1E-3,null,4.9999999999999998E-8]
[]
[null,"Species1",null,"Species2",null,"Species3",null,"Species4",null,null,null,"Species1",null,"Species2",null,"Species3",null,"Species4"]
["Time(years)","Hg","Time(years)","Pb","Time(years)","Benzene","Time(years)","BaP",null,null,"Time(years)","Hg","Time(years)","Pb","Time(years)","Benzene","Time(years)","BaP"]
[1,0,1,0,1,1.0488840180360715E-9,1,0,null,null,1,0,1,0,1,6.2932016521140079E-13,1,0]
[2,0,2,0,2,1.2895634918030533E-5,2,0,null,null,2,0,2,0,2,1.0052146508841244E-6,2,0]
[5,0,5,0,5,4.1379205755007718E-4,5,0,null,null,5,0,5,0,5,2.15720524059459E-4,5,0]
[10,0,10,0,10,3.0279905903066493E-4,10,0,null,null,10,0,10,0,10,1.7532125680534683E-4,10,0]
[15,0,15,0,15,1.8915153213412328E-4,15,0,null,null,15,0,15,0,15,1.095437567306659E-4,15,0]
[20,0,20,0,20,1.1812906114217706E-4,20,0,null,null,20,0,20,0,20,6.8412365210776356E-5,20,0]
[30,0,30,9.626199954567267E-33,30,4.6073409402048413E-5,30,0,null,null,30,0,30,0,30,2.6682603555489857E-5,30,0]
[40,0,40,0,40,1.796982942015167E-5,40,0,null,null,40,0,40,0,40,1.0406910146819869E-5,40,0]
[50,1.5970804815810474E-36,50,0,50,7.0087016066839508E-6,50,0,null,null,50,0,50,0,50,4.0589660609900466E-6,50,0]
[60,4.9768962621631922E-33,60,8.847860036787282E-24,60,2.7335763091826376E-6,60,0,null,null,60,0,60,8.9652914245153482E-35,60,1.5831026003329077E-6,60,0]
[70,0,70,0,70,1.0661660053844952E-6,70,0,null,null,70,0,70,3.46427555570989E-31,70,6.174513418956717E-7,70,0]
[80,7.048721811866963E-29,80,1.1022419705944325E-21,80,4.1583242575398971E-7,80,0,null,null,80,0,80,2.4666511031482864E-29,80,2.4082213707159343E-7,80,0]
[90,0,90,0,90,1.6218525940876191E-7,90,0,null,null,90,0,90,0,90,9.3926867798921038E-8,90,0]
[100,9.8826833099101988E-27,100,4.4672333781687618E-20,100,6.3256135163239628E-8,100,0,null,null,100,1.1471014968418347E-38,100,7.179569885326088E-26,100,3.6633816391971547E-8,100,0]
[120,0,120,3.2784349410052953E-19,120,9.6218279019607802E-9,120,0,null,null,120,1.8998881328475774E-35,120,0,120,5.5724509886533601E-9,120,0]
[140,9.9923129729933394E-24,140,1.8968516067280575E-16,140,1.4627495448325843E-9,140,0,null,null,140,3.7680506337466318E-32,140,2.7818307832648952E-22,140,8.4725166923224119E-10,140,0]
[160,0,160,1.3746040881486535E-14,160,2.2144498682798027E-10,160,0,null,null,160,0,160,0,160,1.2835638327122683E-10,160,0]
[180,4.1907285638979898E-22,180,3.7864422728781926E-13,180,3.2523568208316803E-11,180,0,null,null,180,1.8402697334430353E-29,180,3.6859113138182589E-20,180,1.8931242030346257E-11,180,0]
[200,0,200,5.2755201754208756E-12,200,3.7277041767595181E-12,200,0,null,null,200,3.1068467949469728E-27,200,0,200,2.2414232316330771E-12,200,0]
[250,1.5288619304181332E-18,250,5.6808704499709837E-10,250,0,250,0,null,null,250,1.2242306137162923E-24,250,0,250,0,250,0]
[]
[]
["Pollutant Linkage: Infill, Geo Barrier, Sst Unsaturated, Sst Saturated, Principal Aquifer",null,null,null,null,null,null,null,null,null,"Pollutant Linkage: Infill, Geo Barrier, Sst Unsaturated, Sst Saturated, Principal Aquifer at Site Boundary"]
["Remedial Target Concentrations in mg/L in Infill",null,null,null,null,null,null,null,null,null,"Remedial Target Concentrations in mg/L in Infill"]
[]
[null,"Species1",null,"Species2",null,"Species3",null,"Species4",null,null,null,"Species1",null,"Species2",null,"Species3",null,"Species4"]
["Time(years)","Hg","Time(years)","Pb","Time(years)","Benzene","Time(years)","BaP",null,null,"Time(years)","Hg","Time(years)","Pb","Time(years)","Benzene","Time(years)","BaP"]
[1,1E+40,1,1E+40,1,5720365.5474076048,1,1E+40,null,null,1,1E+40,1,1E+40,1,9534097795.8087273,1,1E+40]
[2,1E+40,2,1E+40,2,465.27371766789605,2,1E+40,null,null,2,1E+40,2,1E+40,2,5968.8744038129289,2,1E+40]
[5,1E+40,5,1E+40,5,14.500036650108681,5,1E+40,null,null,5,1E+40,5,1E+40,5,27.813765176772062,5,1E+40]
[10,1E+40,10,1E+40,10,19.815121021866752,10,1E+40,null,null,10,1E+40,10,1E+40,10,34.222889507697253,10,1E+40]
[15,1E+40,15,1E+40,15,31.720599523061377,15,1E+40,null,null,15,1E+40,15,1E+40,15,54.772633138300506,15,1E+40]
[20,1E+40,20,1E+40,20,50.791904565960756,20,1E+40,null,null,20,1E+40,20,1E+40,20,87.703443398195461,20,1E+40]
[30,1E+40,30,1.0388315272066813E+28,30,130.22695906097286,30,1E+40,null,null,30,1E+40,30,1E+40,30,224.86561281481545,30,1E+40]
[40,1E+40,40,1E+40,40,333.89298583277025,40,1E+40,null,null,40,1E+40,40,1E+40,40,576.54000230159318,40,1E+40]
[50,6.261425216405119E+28,50,1E+40,50,856.07867715155862,50,1E+40,null,null,50,1E+40,50,1E+40,50,1478.208960076031,50,1E+40]
[60,2.0092843959848848E+25,60,1.1302167934870575E+19,60,2194.9268362638286,60,1E+40,null,null,60,1E+40,60,1.1154127095807805E+30,60,3790.0259899379048,60,1E+40]
[70,1E+40,70,1E+40,70,5627.641445795487,70,1E+40,null,null,70,1E+40,70,2.8866064027492834E+26,70,9717.3649045430302,70,1E+40]
[80,1.4186969307207411E+21,80,9.0724180958261456E+16,80,14428.889207282877,80,1E+40,null,null,80,1E+40,80,4.05407963340928E+24,80,24914.653083641868,80,1E+40]
[90,1E+40,90,1E+40,90,36994.73072875238,90,1E+40,null,null,90,1E+40,90,1E+40,90,63879.48561049455,90,1E+40]
[100,1.0118709348879124E+19,100,2238521956088013.3,100,94852.459520587523,100,1E+40,null,null,100,8.7176244016172061E+30,100,1.3928410976872623E+21,100,163783.09963127197,100,1E+40]
[120,1E+40,120,305023591437614.81,120,623582.13648544811,120,1E+40,null,null,120,5.2634677942915878E+27,120,1E+40,120,1076725.4861850229,120,1E+40]
[140,1.000769294059087E+16,140,527189368136.67432,140,4101864.2058006702,140,1E+40,null,null,140,2.6538921506096758E+24,140,3.5947549578351789E+17,140,7081721.0728390226,140,1E+40]
[160,1E+40,160,7274821955.0752363,160,27094765.548523501,160,1E+40,null,null,160,1E+40,160,1E+40,160,46744850.914983653,160,1E+40]
[180,238621992513362.41,180,264100157.33314452,180,184481603.05072871,180,1E+40,null,null,180,5.4339860175228743E+21,180,2713033263310108.5,180,316936416.02501124,180,1E+40]
[200,1E+40,200,18955476.744437266,200,1609569782.2287447,200,1E+40,null,null,200,3.2186974962087498E+19,200,1E+40,200,2676870621.8987765,200,1E+40]
[250,65408130067.474899,250,176029.36183927723,250,1E+40,250,1E+40,null,null,250,8.1683956339270544E+16,250,1E+40,250,1E+40,250,1E+40]
[]
["Compared with source concentrations in mg/L",null,null,null,null,null,null,null,null,null,"Compared with source concentrations in mg/L"]
[null,0.01,null,0.5,null,6,null,100,null,null,null,0.01,null,0.5,null,6,null,100]
[]
[]
["Pollutant Linkage: Infill, Geo Barrier, Sst Unsaturated, Sst Saturated, Principal Aquifer",null,null,null,null,null,null,null,null,null,"Pollutant Linkage: Infill, Geo Barrier, Sst Unsaturated, Sst Saturated, Principal Aquifer at Site Boundary"]
["Dilution Factor",null,null,null,null,null,null,null,null,null,"Dilution Factor"]
[]
[null,12.83921468512464,"for all species and timeslices",null,null,null,null,null,null,null,null,12.83921468512464,"for all species and timeslices"]
[]
[]
["Pollutant Linkage: Infill, Geo Barrier, Sst Unsaturated, Sst Saturated, Principal Aquifer",null,null,null,null,null,null,null,null,null,"Pollutant Linkage: Infill, Geo Barrier, Sst Unsaturated, Sst Saturated, Principal Aquifer at Site Boundary"]
["Attenuation Factor",null,null,null,null,null,null,null,null,null,"Attenuation Factor"]
[]
[null,"Species1",null,"Species2",null,"Species3",null,"Species4",null,null,null,"Species1",null,"Species2",null,"Species3",null,"Species4"]
["Time(years)","Hg","Time(years)","Pb","Time(years)","Benzene","Time(years)","BaP",null,null,"Time(years)","Hg","Time(years)","Pb","Time(years)","Benzene","Time(years)","BaP"]
[1,1E+40,1,3.8943191796558557E-2,1,1E+40,1,7.7886383593117108,null,null,1,1E+40,1,3.8943191796558557E-2,1,1E+40,1,7.7886383593117108]
[2,1E+40,2,1.9471595898279279E-2,2,1E+40,2,3.8943191796558554,null,null,2,1E+40,2,1.9471595898279279E-2,2,1E+40,2,3.8943191796558554]
[5,1E+40,5,7.7886383593117111E-3,5,1E+40,5,1.5577276718623423,null,null,5,1E+40,5,7.7886383593117111E-3,5,1E+40,5,1.5577276718623423]
[10,1E+40,10,3.8943191796558555E-3,10,1E+40,10,0.77886383593117114,null,null,10,1E+40,10,3.8943191796558555E-3,10,1E+40,10,0.77886383593117114]
[15,1E+40,15,2.596212786437237E-3,15,1E+40,15,0.51924255728744739,null,null,15,1E+40,15,2.596212786437237E-3,15,1E+40,15,0.51924255728744739]
[20,1E+40,20,1.9471595898279278E-3,20,1E+40,20,0.38943191796558557,null,null,20,1E+40,20,1.9471595898279278E-3,20,1E+40,20,0.38943191796558557]
[30,1E+40,30,1.2981063932186185E-3,30,4.8546498489985953E+31,30,0.2596212786437237,null,null,30,1E+40,30,1.2981063932186185E-3,30,1E+40,30,0.2596212786437237]
[40,1E+40,40,9.7357979491396389E-4,40,1E+40,40,0.19471595898279279,null,null,40,1E+40,40,9.7357979491396389E-4,40,1E+40,40,0.19471595898279279]
[50,4.876797662445453E+32,50,7.7886383593117115E-4,50,1E+40,50,0.15577276718623423,null,null,50,1E+40,50,7.7886383593117115E-4,50,1E+40,50,0.15577276718623423]
[60,1.5649589521334333E+29,60,6.4905319660930926E-4,60,5.2817099232549471E+22,60,0.12981063932186185,null,null,60,1E+40,60,6.4905319660930926E-4,60,5.2125277297828081E+33,60,0.12981063932186185]
[70,1E+40,70,5.563313113794079E-4,70,1E+40,70,0.11126626227588159,null,null,70,1E+40,70,5.563313113794079E-4,70,1.3489640014012714E+30,70,0.11126626227588159]
[80,1.1049717334849352E+25,80,4.8678989745698194E-4,80,4.2397070155719141E+20,80,9.7357979491396393E-2,null,null,80,1E+40,80,4.8678989745698194E-4,80,1.8945456086685523E+28,80,9.7357979491396393E-2]
[90,1E+40,90,4.327021310728728E-4,90,1E+40,90,8.6540426214574556E-2,null,null,90,1E+40,90,4.327021310728728E-4,90,1E+40,90,8.6540426214574556E-2]
[100,7.8810967781405966E+22,100,3.8943191796558558E-4,100,1.0461022785209151E+19,100,7.7886383593117114E-2,null,null,100,6.7898423816507568E+34,100,3.8943191796558558E-4,100,6.509001361123704E+24,100,7.7886383593117114E-2]
[120,1E+40,120,3.2452659830465463E-4,120,1.4254310668596178E+18,120,6.4905319660930924E-2,null,null,120,4.0995247165621259E+31,120,3.2452659830465463E-4,120,1E+40,120,6.4905319660930924E-2]
[140,7.7946301125299061E+19,140,2.7816565568970395E-4,140,2463652401174362.5,140,5.5633131137940793E-2,null,null,140,2.0670206205714773E+28,140,2.7816565568970395E-4,140,1.6798947814152612E+21,140,5.5633131137940793E-2]
[160,1E+40,160,2.4339494872849097E-4,160,33996574401877.203,160,4.8678989745698197E-2,null,null,160,1E+40,160,2.4339494872849097E-4,160,1E+40,160,4.8678989745698197E-2]
[180,1.8585404042649661E+18,180,2.163510655364364E-4,180,1234188369663.1125,180,4.3270213107287278E-2,null,null,180,4.2323351940042134E+25,180,2.163510655364364E-4,180,1.2678500966823444E+19,180,4.3270213107287278E-2]
[200,1E+40,200,1.9471595898279279E-4,200,88582411974.459091,200,3.8943191796558557E-2,null,null,200,2.5069270785992029E+23,200,1.9471595898279279E-4,200,1E+40,200,3.8943191796558557E-2]
[250,509440270854384.69,250,1.5577276718623423E-4,250,822617423.99193347,250,3.1154553437246844E-2,null,null,250,6.3620679568438552E+20,250,1.5577276718623423E-4,250,1E+40,250,3.1154553437246844E-2]
[]
[]
["Saved  21/07/2022: 14:46:22  Level Number: 5"]
[]
["BREAKTHROUGH RESULTS"]
[]
["Advanced"]
["Pollutant Linkage: Infill, Geo Barrier, Sst Unsaturated, Sst Saturated, Principal Aquifer",null,null,null,null,null,null,null,null,null,"Pollutant Linkage: Infill, Geo Barrier, Sst Unsaturated, Sst Saturated, Principal Aquifer at Site Boundary"]
["Concentrations in mg/L in Principal Aquifer",null,null,null,null,null,null,null,null,null,"Concentrations in mg/L in Principal Aquifer at Site Boundary"]
[]
["Compared with MRV target concentration in mg/L",null,null,null,null,null,null,null,null,null,"Compared with MRV target concentration in mg/L"]
[null,1.0000000000000001E-5,null,2.0000000000000001E-4,null,1E-3,null,4.9999999999999998E-8,null,null,null,1.0000000000000001E-5,null,2.0000000000000001E-4,null,1E-3,null,4.9999999999999998E-8]
[]
[null,"Species1",null,"Species2",null,"Species3",null,"Species4",null,null,null,"Species1",null,"Species2",null,"Species3",null,"Species4"]
["Time(years)","Hg","Time(years)","Pb","Time(years)","Benzene","Time(years)","BaP",null,null,"Time(years)","Hg","Time(years)","Pb","Time(years)","Benzene","Time(years)","BaP"]
[1,0,1,0,1,0.12528228697050464,1,0,null,null,1,0,1,0,1,5.479097208711433E-2,1,0]
[2,0,2,1.6092657620787457E-30,2,0.11509718911936191,2,0,null,null,2,0,2,0,2,6.6587057856692639E-2,2,0]
[5,0,5,3.3284870222449424E-21,5,8.677534082663782E-2,5,0,null,null,5,0,5,0,5,5.0254410267659824E-2,5,0]
[10,1.270420743759581E-22,10,1.5623641557804619E-13,10,5.4192991683643124E-2,10,0,null,null,10,0,10,0,10,3.138491673138602E-2,10,0]
[15,4.9699590723092962E-20,15,2.9127414689215349E-9,15,3.3844641900917981E-2,15,0,null,null,15,0,15,0,15,1.9600528445602117E-2,15,0]
[20,1.9101823001759615E-15,20,3.5709699412991065E-7,20,2.1136677379415748E-2,20,0,null,null,20,0,20,4.1503080157599102E-29,20,1.2240934620044422E-2,20,0]
[30,4.0136072925730753E-11,30,3.7057141792533404E-5,30,8.2438541759488528E-3,30,0,null,null,30,0,30,0,30,4.7742830835513887E-3,30,0]
[40,5.1000476086822958E-9,40,3.2176595713185154E-4,40,3.2153174606503873E-3,40,0,null,null,40,3.6215455150794416E-31,40,0,40,1.8620945647782518E-3,40,0]
[50,8.5413476127952511E-8,50,1.0325585829203798E-3,50,1.254057223721125E-3,50,0,null,null,50,0,50,0,50,7.2626521242371742E-4,50,0]
[60,5.2112588619615903E-7,60,2.0097026382421834E-3,60,4.8911467249738061E-4,60,0,null,null,60,0,60,6.1462495532366566E-18,60,2.8326218819336535E-4,60,0]
[70,1.7870321856713356E-6,70,2.9375368282116504E-3,70,1.9076716538566504E-4,70,0,null,null,70,5.7410823315825862E-24,70,0,70,1.1047947233101922E-4,70,0]
[80,4.277053354777678E-6,80,3.5916485601926334E-3,80,7.4403874073303657E-5,80,0,null,null,80,0,80,2.586490910410325E-15,80,4.3089713365606793E-5,80,0]
[90,8.0592727804916018E-6,90,3.9024204002592877E-3,90,2.9019165714674385E-5,90,0,null,null,90,7.6318608456652944E-22,90,1.4013919222152468E-13,90,1.680595331830398E-5,90,0]
[100,1.2854504696747654E-5,100,3.9084445769111929E-3,100,1.1317953113622984E-5,100,0,null,null,100,0,100,3.5015732307386344E-12,100,6.5546037008814405E-6,100,0]
[120,2.3500030737917005E-5,120,3.3463773202112215E-3,120,1.7213174649556509E-6,120,0,null,null,120,8.2491400283878751E-20,120,4.0730076182217979E-10,120,9.9687621587527466E-7,120,0]
[140,3.2514895972245432E-5,140,2.5178257109880232E-3,140,2.6148881055068695E-7,140,0,null,null,140,0,140,1.1260638456868917E-8,140,1.514391151587956E-7,140,0]
[160,3.7980176973298909E-5,160,1.7582648387241995E-3,160,3.9433314662186543E-8,160,0,null,null,160,2.1540650873158318E-17,160,1.2684693596655163E-7,160,2.2837718587561677E-8,160,0]
[180,3.9781574008728398E-5,180,1.1736205598372941E-3,180,5.6682233173930009E-9,180,0,null,null,180,1.1858665234827275E-15,180,7.858279572211632E-7,180,3.28215607570635E-9,180,0]
[200,3.8721641824022183E-5,200,7.6148706206248268E-4,200,5.4558709103626441E-10,200,0,null,null,200,3.087701829559206E-14,200,3.206502234634766E-6,200,3.1472358527369765E-10,200,0]
[250,2.9834993157150635E-5,250,2.4152765449591689E-4,250,0,250,0,null,null,250,9.6742016213983573E-12,250,3.3732951449498379E-5,250,0,250,0]
[]
[]
["Pollutant Linkage: Infill, Geo Barrier, Sst Unsaturated, Sst Saturated, Principal Aquifer",null,null,null,null,null,null,null,null,null,"Pollutant Linkage: Infill, Geo Barrier, Sst Unsaturated, Sst Saturated, Principal Aquifer at Site Boundary"]
["Remedial Target Concentrations in mg/L in Infill",null,null,null,null,null,null,null,null,null,"Remedial Target Concentrations in mg/L in Infill"]
[]
[null,"Species1",null,"Species2",null,"Species3",null,"Species4",null,null,null,"Species1",null,"Species2",null,"Species3",null,"Species4"]
["Time(years)","Hg","Time(years)","Pb","Time(years)","Benzene","Time(years)","BaP",null,null,"Time(years)","Hg","Time(years)","Pb","Time(years)","Benzene","Time(years)","BaP"]
[1,1E+40,1,1E+40,1,2.394592302347014E-2,1,1E+40,null,null,1,1E+40,1,1E+40,1,5.4753545807330842E-2,1,1E+40]
[2,1E+40,2,6.2140140153622887E+25,2,2.6064928457017664E-2,2,1E+40,null,null,2,1E+40,2,1E+40,2,4.5053800191270518E-2,2,1E+40]
[5,1E+40,5,3.0043680306301352E+16,5,3.4572033614866271E-2,5,1E+40,null,null,5,1E+40,5,1E+40,5,5.9696253204877175E-2,5,1E+40]
[10,787140799543842.88,10,640055646.63025761,10,5.5357711519467181E-2,10,1E+40,null,null,10,1E+40,10,1E+40,10,9.5587317489993356E-2,10,1E+40]
[15,2012089004055.6191,15,34331.917565284566,15,8.8640323297928883E-2,15,1E+40,null,null,15,1E+40,15,1E+40,15,0.15305709783927418,15,1E+40]
[20,52351024.292701408,20,280.03596122016182,20,0.14193337704636549,20,1E+40,null,null,20,1E+40,20,2.409459722513879E+24,20,0.24507932548610517,20,1E+40]
[30,2491.5242750590883,30,2.69853515848189,30,0.3639074559024093,30,1E+40,null,null,30,1E+40,30,1E+40,30,0.62836659399937089,30,1E+40]
[40,19.607660099047017,40,0.31078489748069443,40,0.93303384089270203,40,1E+40,null,null,40,2.7612520561627245E+23,40,1E+40,40,1.6110889622607625,40,1E+40]
[50,1.1707754388803513,50,9.6846805260356814E-2,50,2.3922353328488417,50,1E+40,null,null,50,1E+40,50,1E+40,50,4.130722425748985,50,1E+40]
[60,0.19189221385628619,60,4.975860512750608E-2,60,6.1335309870837422,60,1E+40,null,null,60,1E+40,60,16270084566829.756,60,10.590894673001989,60,1E+40]
[70,5.5958701136898069E-2,70,3.4042126396379248E-2,70,15.725976710588746,70,1E+40,null,null,70,1.7418318397888926E+16,70,1E+40,70,27.15436575413198,70,1E+40]
[80,2.3380582776292728E-2,80,2.7842367738406076E-2,80,40.320481122318462,80,1E+40,null,null,80,1E+40,80,38662420810.184036,80,69.622185103568825,80,1E+40]
[90,1.2408067417951347E-2,90,2.5625122294193555E-2,90,103.37995342446949,90,1E+40,null,null,90,131029642733590.33,90,713576255.25574064,90,178.50817166870206,90,1E+40]
[100,7.7793740295027652E-3,100,2.5585625696406589E-2,100,265.06559709891496,100,1E+40,null,null,100,1E+40,100,28558591.641650643,100,457.69357491385335,100,1E+40]
[120,4.2553135830010322E-3,120,2.988306172051395E-2,120,1742.8510783612446,120,1E+40,null,null,120,1212247575575.9834,120,245518.81403958242,120,3009.400718188414,120,1E+40]
[140,3.0755134534448318E-3,140,3.9716807864655125E-2,140,11472.766248322816,140,1E+40,null,null,140,1E+40,140,8880.4911358290392,140,19809.941420050352,140,1E+40]
[160,2.6329524496503192E-3,160,5.6874253410288407E-2,160,76077.80440726594,160,1E+40,null,null,160,4642385255.1553783,160,788.35171884931526,160,131361.63266474078,160,1E+40]
[180,2.5137265805033056E-3,180,8.5206414596097041E-2,180,529266.37360854668,180,1E+40,null,null,180,84326522.437207952,180,127.25431703094273,180,914033.31554072199,180,1E+40]
[200,2.582535122205533E-3,200,0.13132199479417372,200,5498663.8234088905,200,1E+40,null,null,200,3238654.6862355489,200,31.186630378690637,200,9532174.0739292428,200,1E+40]
[250,3.3517688264001742E-3,250,0.41403126366090942,250,1E+40,250,1E+40,null,null,250,10336.770300384282,250,2.9644604371399303,250,1E+40,250,1E+40]
[]
["Compared with source concentrations in mg/L",null,null,null,null,null,null,null,null,null,"Compared with source concentrations in mg/L"]
[null,0.01,null,0.5,null,3,null,100,null,null,null,0.01,null,0.5,null,3,null,100]
[]
[]
["Pollutant Linkage: Infill, Geo Barrier, Sst Unsaturated, Sst Saturated, Principal Aquifer",null,null,null,null,null,null,null,null,null,"Pollutant Linkage: Infill, Geo Barrier, Sst Unsaturated, Sst Saturated, Principal Aquifer at Site Boundary"]
["Dilution Factor",null,null,null,null,null,null,null,null,null,"Dilution Factor"]
[]
[null,12.83921468512464,"for all species and timeslices",null,null,null,null,null,null,null,null,12.83921468512464,"for all species and timeslices"]
[]
[]
["Pollutant Linkage: Infill, Geo Barrier, Sst Unsaturated, Sst Saturated, Principal Aquifer",null,null,null,null,null,null,null,null,null,"Pollutant Linkage: Infill, Geo Barrier, Sst Unsaturated, Sst Saturated, Principal Aquifer at Site Boundary"]
["Attenuation Factor",null,null,null,null,null,null,null,null,null,"Attenuation Factor"]
[]
[null,"Species1",null,"Species2",null,"Species3",null,"Species4",null,null,null,"Species1",null,"Species2",null,"Species3",null,"Species4"]
["Time(years)","Hg","Time(years)","Pb","Time(years)","Benzene","Time(years)","BaP",null,null,"Time(years)","Hg","Time(years)","Pb","Time(years)","Benzene","Time(years)","BaP"]
[1,1E+40,1,3.8943191796558557E-2,1,1E+40,1,7.7886383593117108,null,null,1,1E+40,1,3.8943191796558557E-2,1,1E+40,1,7.7886383593117108]
[2,1E+40,2,1.9471595898279279E-2,2,1.4519612377605395E+29,2,3.8943191796558554,null,null,2,1E+40,2,1.9471595898279279E-2,2,1E+40,2,3.8943191796558554]
[5,1E+40,5,7.7886383593117111E-3,5,7.0199808266566951E+19,5,1.5577276718623423,null,null,5,1E+40,5,7.7886383593117111E-3,5,1E+40,5,1.5577276718623423]
[10,6.1307550255064648E+18,10,3.8943191796558555E-3,10,1495548588431.5457,10,0.77886383593117114,null,null,10,1E+40,10,3.8943191796558555E-3,10,1E+40,10,0.77886383593117114]
[15,1.5671433599336892E+16,15,2.596212786437237E-3,15,80219667.029310852,15,0.51924255728744739,null,null,15,1E+40,15,2.596212786437237E-3,15,1E+40,15,0.51924255728744739]
[20,407743195955.39331,20,1.9471595898279278E-3,20,654329.64886382362,20,0.38943191796558557,null,null,20,1E+40,20,1.9471595898279278E-3,20,5.6299231259964443E+27,20,0.38943191796558557]
[30,19405581.541881513,30,1.2981063932186185E-3,30,6305.3743347910067,30,0.2596212786437237,null,null,30,1E+40,30,1.2981063932186185E-3,30,1E+40,30,0.2596212786437237]
[40,152716.97358378326,40,9.7357979491396389E-4,40,726.17735220386828,40,0.19471595898279279,null,null,40,2.1506393684357328E+27,40,9.7357979491396389E-4,40,1E+40,40,0.19471595898279279]
[50,9118.746493403507,50,7.7886383593117115E-4,50,226.29142272828184,50,0.15577276718623423,null,null,50,1E+40,50,7.7886383593117115E-4,50,1E+40,50,0.15577276718623423]
[60,1494.5790576943166,60,6.4905319660930926E-4,60,116.26553418058147,60,0.12981063932186185,null,null,60,1E+40,60,6.4905319660930926E-4,60,3.8016541429936704E+16,60,0.12981063932186185]
[70,435.84208621210411,70,5.563313113794079E-4,70,79.542543445013152,70,0.11126626227588159,null,null,70,1.3566498282850258E+20,70,5.563313113794079E-4,70,1E+40,70,0.11126626227588159]
[80,182.10290387449621,80,4.8678989745698194E-4,80,65.056240014423707,80,9.7357979491396393E-2,null,null,80,1E+40,80,4.8678989745698194E-4,80,90338284135815.219,80,9.7357979491396393E-2]
[90,96.641949856381672,90,4.327021310728728E-4,90,59.875443138782884,90,8.6540426214574556E-2,null,null,90,1.0205425016017505E+18,90,4.327021310728728E-4,90,1667336218193.6599,90,8.6540426214574556E-2]
[100,60.590730977618549,100,3.8943191796558558E-4,100,59.783155723807134,100,7.7886383593117114E-2,null,null,100,1E+40,100,3.8943191796558558E-4,100,66729762704.423706,100,7.7886383593117114E-2]
[120,33.143098603462001,120,3.2452659830465463E-4,120,69.824508243022308,120,6.4905319660930924E-2,null,null,120,9441757968113726,120,3.2452659830465463E-4,120,573677175.88842297,120,6.4905319660930924E-2]
[140,23.95406205807965,140,2.7816565568970395E-4,140,92.801955973219791,140,5.5633131137940793E-2,null,null,140,1E+40,140,2.7816565568970395E-4,140,20750080.173013702,140,5.5633131137940793E-2]
[160,20.507114447590212,160,2.4339494872849097E-4,160,132.89189753057616,160,4.8678989745698197E-2,null,null,160,36157859877006.266,160,2.4339494872849097E-4,160,1842055.9314177295,160,4.8678989745698197E-2]
[180,19.578507269729503,180,2.163510655364364E-4,180,199.09258475477358,180,4.3270213107287278E-2,null,null,180,656788787361.79749,180,2.163510655364364E-4,180,297341.35650456423,180,4.3270213107287278E-2]
[200,20.114432117079772,200,1.9471595898279279E-4,200,306.84585782257028,200,3.8943191796558557E-2,null,null,200,25224710121.778828,200,1.9471595898279279E-4,200,72870.415699543737,200,3.8943191796558557E-2]
[250,26.105715252845588,250,1.5577276718623423E-4,250,967.421934631098,250,3.1154553437246844E-2,null,null,250,80509365.672967061,250,1.5577276718623423E-4,250,6926.7330826110065,250,3.1154553437246844E-2]
[]
[]
["Saved  21/07/2022: 14:47:58  Level Number: 5"]
[]
["BREAKTHROUGH RESULTS"]
[]
["Advanced"]
["Pollutant Linkage: Infill, Geo Barrier, Sst Unsaturated, Sst Saturated, Principal Aquifer",null,null,null,null,null,null,null,null,null,"Pollutant Linkage: Infill, Geo Barrier, Sst Unsaturated, Sst Saturated, Principal Aquifer at Site Boundary"]
["Concentrations in mg/L in Principal Aquifer",null,null,null,null,null,null,null,null,null,"Concentrations in mg/L in Principal Aquifer at Site Boundary"]
[]
["Compared with MRV target concentration in mg/L",null,null,null,null,null,null,null,null,null,"Compared with MRV target concentration in mg/L"]
[null,1.0000000000000001E-5,null,2.0000000000000001E-4,null,1E-3,null,4.9999999999999998E-8,null,null,null,1.0000000000000001E-5,null,2.0000000000000001E-4,null,1E-3,null,4.9999999999999998E-8]
[]
[null,"Species1",null,"Species2",null,"Species3",null,"Species4",null,null,null,"Species1",null,"Species2",null,"Species3",null,"Species4"]
["Time(years)","Hg","Time(years)","Pb","Time(years)","Benzene","Time(years)","BaP",null,null,"Time(years)","Hg","Time(years)","Pb","Time(years)","Benzene","Time(years)","BaP"]
[1,0,1,0,1,1.4647286524640145E-5,1,0,null,null,1,0,1,0,1,1.0905698612146721E-7,1,0]
[2,0,2,0,2,1.1681027049939739E-3,2,0,null,null,2,0,2,0,2,2.4912427294264319E-4,2,0]
[5,0,5,0,5,2.9730758878506727E-3,5,0,null,null,5,0,5,0,5,1.6963139954437765E-3,5,0]
[10,0,10,0,10,1.8816668010704371E-3,10,0,null,null,10,0,10,0,10,1.0897304929893209E-3,10,0]
[15,0,15,2.2156346995723199E-34,15,1.1751428733506285E-3,15,0,null,null,15,0,15,0,15,6.8056329755548874E-4,15,0]
[20,0,20,0,20,7.339009852847467E-4,20,0,null,null,20,0,20,0,20,4.2502582948336225E-4,20,0]
[30,5.3647716598688425E-35,30,4.5686083180112379E-25,30,2.8624049363316017E-4,30,0,null,null,30,0,30,0,30,1.6577113996353991E-4,30,0]
[40,0,40,4.8532473795992992E-22,40,1.116412462725759E-4,40,0,null,null,40,0,40,0,40,6.4655061735530937E-5,40,0]
[50,0,50,0,50,4.35429924754896E-5,50,0,null,null,50,0,50,3.4631013316863366E-30,50,2.521715810861235E-5,50,0]
[60,1.2513928965520281E-25,60,0,60,1.6982899012759495E-5,60,0,null,null,60,0,60,0,60,9.8353481323420965E-6,60,0]
[70,0,70,2.084245478128227E-17,70,6.6237698173599925E-6,70,0,null,null,70,3.7970734498077121E-40,70,2.8225004600290184E-25,70,3.8360410359995743E-6,70,0]
[80,2.5711656554896475E-23,80,2.1663966368010263E-15,80,2.5834387316782266E-6,80,0,null,null,80,5.820158369946481E-37,80,0,80,1.4961544327560225E-6,80,0]
[90,0,90,8.0403770550677223E-14,90,1.0076036420819843E-6,90,0,null,null,90,5.9190916180298463E-34,90,1.4115963576424214E-22,90,5.8353722229907159E-7,90,0]
[100,5.2906437616717399E-22,100,1.4297713199573885E-12,100,3.9298632604965539E-7,100,0,null,null,100,8.0429115125820085E-32,100,0,100,2.2759232327892705E-7,100,0]
[120,0,120,1.0364691532869003E-10,120,5.9772802931344302E-8,120,0,null,null,120,0,120,5.9321784293760631E-20,120,3.461736802722122E-8,120,0]
[140,1.6144556674785536E-18,140,2.1250487633871033E-9,140,9.0835571847851491E-9,140,0,null,null,140,5.5685299879039413E-27,140,0,140,5.261391597277612E-9,140,0]
[160,1.3067273458529965E-16,160,1.9785769104925917E-8,160,1.3723489757216034E-9,160,0,null,null,160,0,160,3.6237317313838138E-18,160,7.9542496584311006E-10,160,0]
[180,3.9465488434188281E-15,180,1.0888911633067685E-7,180,1.9918723201156367E-10,180,0,null,null,180,3.2767559311454114E-24,180,0,180,1.1588888505362975E-10,180,0]
[200,5.9113074777153441E-14,200,4.1503961505162133E-7,200,2.0744095512536032E-11,200,0,null,null,200,0,200,2.1573083350420022E-16,200,1.244994443699633E-11,200,0]
[250,7.2350259593340185E-12,250,4.2301854123120086E-6,250,0,250,0,null,null,250,0,250,3.8233084105625244E-13,250,0,250,0]
[]
[]
["Pollutant Linkage: Infill, Geo Barrier, Sst Unsaturated, Sst Saturated, Principal Aquifer",null,null,null,null,null,null,null,null,null,"Pollutant Linkage: Infill, Geo Barrier, Sst Unsaturated, Sst Saturated, Principal Aquifer at Site Boundary"]
["Remedial Target Concentrations in mg/L in Infill",null,null,null,null,null,null,null,null,null,"Remedial Target Concentrations in mg/L in Infill"]
[]
[null,"Species1",null,"Species2",null,"Species3",null,"Species4",null,null,null,"Species1",null,"Species2",null,"Species3",null,"Species4"]
["Time(years)","Hg","Time(years)","Pb","Time(years)","Benzene","Time(years)","BaP",null,null,"Time(years)","Hg","Time(years)","Pb","Time(years)","Benzene","Time(years)","BaP"]
[1,1E+40,1,1E+40,1,204.816093066337,1,1E+40,null,null,1,1E+40,1,1E+40,1,27508.554075193428,1,1E+40]
[2,1E+40,2,1E+40,2,2.5682673168841577,2,1E+40,null,null,2,1E+40,2,1E+40,2,12.042182660742581,2,1E+40]
[5,1E+40,5,1E+40,5,1.0090559787792002,5,1E+40,null,null,5,1E+40,5,1E+40,5,1.768540499021918,5,1E+40]
[10,1E+40,10,1E+40,10,1.5943311527276609,10,1E+40,null,null,10,1E+40,10,1E+40,10,2.7529742622604569,10,1E+40]
[15,1E+40,15,4.5133793950466125E+29,15,2.5528810734700231,15,1E+40,null,null,15,1E+40,15,1E+40,15,4.408113118611718,15,1E+40]
[20,1E+40,20,1E+40,20,4.0877448867792818,20,1E+40,null,null,20,1E+40,20,1E+40,20,7.0583945536830859,20,1E+40]
[30,1.8640122327675135E+27,30,2.1888503684100247E+20,30,10.480697409098021,30,1E+40,null,null,30,1E+40,30,1E+40,30,18.097239366634184,30,1E+40]
[40,1E+40,40,2.0604760519801971E+17,40,26.871788878775128,40,1E+40,null,null,40,1E+40,40,1E+40,40,46.400079428759739,40,1E+40]
[50,1E+40,50,1E+40,50,68.897423659816297,50,1E+40,null,null,50,1E+40,50,2.8875851562595082E+25,50,118.96661737531073,50,1E+40]
[60,7.9910953846334541E+17,60,1E+40,60,176.64828588723617,60,1E+40,null,null,60,1E+40,60,1E+40,60,305.02224828574612,60,1E+40]
[70,1E+40,70,4797899338124.3076,70,452.91428940320532,70,1E+40,null,null,70,2.633607206230475E+32,70,3.5429577927853336E+20,70,782.0562845512618,70,1E+40]
[80,3889286549331891,80,46159598986.297981,80,1161.2429446124977,80,1E+40,null,null,80,1.7181663048271924E+29,80,1E+40,80,2005.1406020124457,80,1E+40]
[90,1E+40,90,1243722767.1676366,90,2977.361211002752,90,1E+40,null,null,90,1.6894484230552379E+26,90,7.0841780979808614E+17,90,5141.0602192270353,90,1E+40]
[100,189012915071798.31,100,69941254.663704053,100,7633.8533967742633,100,1E+40,null,null,100,1.2433308490782723E+24,100,1E+40,100,13181.46392979755,100,1E+40]
[120,1E+40,120,964814.04856936878,120,50190.05053930352,120,1E+40,null,null,120,1E+40,120,1685721378588368.8,120,86661.701075626625,120,1E+40]
[140,61940381525.730812,140,47057.743672954857,140,330267.09019072005,140,1E+40,null,null,140,1.7958060783945093E+19,140,1E+40,140,570191.35423264862,140,1E+40]
[160,765270584.69663155,160,5054.1376213221729,160,2186032.8918324518,160,1E+40,null,null,160,1E+40,160,27595861783568.75,160,3771568.8202219708,160,1E+40]
[180,25338594.292772446,180,918.36542870196342,180,15061206.331868889,180,1E+40,null,null,180,3.0517988553710912E+16,180,1E+40,180,25886865.669746447,180,1E+40]
[200,1691673.1260720838,200,240.94085570015363,200,144619465.24431714,200,1E+40,null,null,200,1E+40,200,463540599995.19275,200,240964930.82211533,200,1E+40]
[250,13821.650476732357,250,23.639625749960921,250,1E+40,250,1E+40,null,null,250,1E+40,250,261553579.41758871,250,1E+40,250,1E+40]
[]
["Compared with source concentrations in mg/L",null,null,null,null,null,null,null,null,null,"Compared with source concentrations in mg/L"]
[null,0.01,null,0.5,null,3,null,100,null,null,null,0.01,null,0.5,null,3,null,100]
[]
[]
["Pollutant Linkage: Infill, Geo Barrier, Sst Unsaturated, Sst Saturated, Principal Aquifer",null,null,null,null,null,null,null,null,null,"Pollutant Linkage: Infill, Geo Barrier, Sst Unsaturated, Sst Saturated, Principal Aquifer at Site Boundary"]
["Dilution Factor",null,null,null,null,null,null,null,null,null,"Dilution Factor"]
[]
[null,12.83921468512464,"for all species and timeslices",null,null,null,null,null,null,null,null,12.83921468512464,"for all species and timeslices"]
[]
[]
["Pollutant Linkage: Infill, Geo Barrier, Sst Unsaturated, Sst Saturated, Principal Aquifer",null,null,null,null,null,null,null,null,null,"Pollutant Linkage: Infill, Geo Barrier, Sst Unsaturated, Sst Saturated, Principal Aquifer at Site Boundary"]
["Attenuation Factor",null,null,null,null,null,null,null,null,null,"Attenuation Factor"]
[]
[null,"Species1",null,"Species2",null,"Species3",null,"Species4",null,null,null,"Species1",null,"Species2",null,"Species3",null,"Species4"]
["Time(years)","Hg","Time(years)","Pb","Time(years)","Benzene","Time(years)","BaP",null,null,"Time(years)","Hg","Time(years)","Pb","Time(years)","Benzene","Time(years)","BaP"]
[1,1E+40,1,3.8943191796558557E-2,1,1E+40,1,7.7886383593117108,null,null,1,1E+40,1,3.8943191796558557E-2,1,1E+40,1,7.7886383593117108]
[2,1E+40,2,1.9471595898279279E-2,2,1E+40,2,3.8943191796558554,null,null,2,1E+40,2,1.9471595898279279E-2,2,1E+40,2,3.8943191796558554]
[5,1E+40,5,7.7886383593117111E-3,5,1E+40,5,1.5577276718623423,null,null,5,1E+40,5,7.7886383593117111E-3,5,1E+40,5,1.5577276718623423]
[10,1E+40,10,3.8943191796558555E-3,10,1E+40,10,0.77886383593117114,null,null,10,1E+40,10,3.8943191796558555E-3,10,1E+40,10,0.77886383593117114]
[15,1E+40,15,2.596212786437237E-3,15,1.0545923965916139E+33,15,0.51924255728744739,null,null,15,1E+40,15,2.596212786437237E-3,15,1E+40,15,0.51924255728744739]
[20,1E+40,20,1.9471595898279278E-3,20,1E+40,20,0.38943191796558557,null,null,20,1E+40,20,1.9471595898279278E-3,20,1E+40,20,0.38943191796558557]
[30,1.4518117178359324E+31,30,1.2981063932186185E-3,30,5.1144491826575663E+23,30,0.2596212786437237,null,null,30,1E+40,30,1.2981063932186185E-3,30,1E+40,30,0.2596212786437237]
[40,1E+40,40,9.7357979491396389E-4,40,4.8144908450688342E+20,40,0.19471595898279279,null,null,40,1E+40,40,9.7357979491396389E-4,40,1E+40,40,0.19471595898279279]
[50,1E+40,50,7.7886383593117115E-4,50,1E+40,50,0.15577276718623423,null,null,50,1E+40,50,7.7886383593117115E-4,50,6.7471069541465708E+28,50,0.15577276718623423]
[60,6.2239752045674889E+21,60,6.4905319660930926E-4,60,1E+40,60,0.12981063932186185,null,null,60,1E+40,60,6.4905319660930926E-4,60,1E+40,60,0.12981063932186185]
[70,1E+40,70,5.563313113794079E-4,70,1.1210730848709374E+16,70,0.11126626227588159,null,null,70,2.0512214109806427E+36,70,5.563313113794079E-4,70,8.2784450910930619E+23,70,0.11126626227588159]
[80,3.0292246408481444E+19,80,4.8678989745698194E-4,80,107856126994537.92,80,9.7357979491396393E-2,null,null,80,1.3382175989453928E+33,80,4.8678989745698194E-4,80,1E+40,80,9.7357979491396393E-2]
[90,1E+40,90,4.327021310728728E-4,90,2906072055813.3481,90,8.6540426214574556E-2,null,null,90,1.3158502793886706E+30,90,4.327021310728728E-4,90,1.6552830383438881E+21,90,8.6540426214574556E-2]
[100,1.472153240733535E+18,100,3.8943191796558558E-4,100,163424141691.63434,100,7.7886383593117114E-2,null,null,100,9.6838543444466308E+27,100,3.8943191796558558E-4,100,1E+40,100,7.7886383593117114E-2]
[120,1E+40,120,3.2452659830465463E-4,120,2254376312.4870653,120,6.4905319660930924E-2,null,null,120,1E+40,120,3.2452659830465463E-4,120,3.9388422577155558E+18,120,6.4905319660930924E-2]
[140,482431231541709.38,140,2.7816565568970395E-4,140,109954724.24215025,140,5.5633131137940793E-2,null,null,140,1.3986884108068608E+23,140,2.7816565568970395E-4,140,1E+40,140,5.5633131137940793E-2]
[160,5960415831221.085,160,2.4339494872849097E-4,160,11809455.045201095,160,4.8678989745698197E-2,null,null,160,1E+40,160,2.4339494872849097E-4,160,6.4480256293730296E+16,160,4.8678989745698197E-2]
[180,197353147479.72424,180,2.163510655364364E-4,180,2145844.8617561567,180,4.3270213107287278E-2,null,null,180,2.3769357629846851E+20,180,2.163510655364364E-4,180,1E+40,180,4.3270213107287278E-2]
[200,13175830201.141787,200,1.9471595898279279E-4,200,562980.35730948125,200,3.8943191796558557E-2,null,null,200,1E+40,200,1.9471595898279279E-4,200,1083105029466277.3,200,3.8943191796558557E-2]
[250,107651837.09207663,250,1.5577276718623423E-4,250,55236.148774775538,250,3.1154553437246844E-2,null,null,250,1E+40,250,1.5577276718623423E-4,250,611143872500.13391,250,3.1154553437246844E-2]
[]
[]
["Saved  21/07/2022: 14:49:20  Level Number: 5"]
[]
["BREAKTHROUGH RESULTS"]
[]
["Advanced"]
["Pollutant Linkage: Infill, Geo Barrier, Sst Unsaturated, Sst Saturated, Principal Aquifer",null,null,null,null,null,null,null,null,null,"Pollutant Linkage: Infill, Geo Barrier, Sst Unsaturated, Sst Saturated, Principal Aquifer at Site Boundary"]
["Concentrations in mg/L in Principal Aquifer",null,null,null,null,null,null,null,null,null,"Concentrations in mg/L in Principal Aquifer at Site Boundary"]
[]
["Compared with MRV target concentration in mg/L",null,null,null,null,null,null,null,null,null,"Compared with MRV target concentration in mg/L"]
[null,1.0000000000000001E-5,null,2.0000000000000001E-4,null,1E-3,null,4.9999999999999998E-8,null,null,null,1.0000000000000001E-5,null,2.0000000000000001E-4,null,1E-3,null,4.9999999999999998E-8]
[]
[null,"Species1",null,"Species2",null,"Species3",null,"Species4",null,null,null,"Species1",null,"Species2",null,"Species3",null,"Species4"]
["Time(years)","Hg","Time(years)","Pb","Time(years)","Benzene","Time(years)","BaP",null,null,"Time(years)","Hg","Time(years)","Pb","Time(years)","Benzene","Time(years)","BaP"]
[1,0,1,0,1,4.1760762323502273E-2,1,0,null,null,1,0,1,0,1,1.8263657362371431E-2,1,0]
[2,0,2,1.6092657620787457E-30,2,3.8365729706453536E-2,2,0,null,null,2,0,2,0,2,2.2195685952230558E-2,2,0]
[5,0,5,3.3284870222449424E-21,5,2.8925113608894295E-2,5,0,null,null,5,0,5,0,5,1.6751470089219768E-2,5,0]
[10,1.270420743759581E-22,10,1.5623641557804619E-13,10,1.8064330561207192E-2,10,0,null,null,10,0,10,0,10,1.0461638910466357E-2,10,0]
[15,4.9699590723092962E-20,15,2.9127414689215349E-9,15,1.1281547300302591E-2,15,0,null,null,15,0,15,0,15,6.5335094818736511E-3,15,0]
[20,1.9101823001759615E-15,20,3.5709699412991065E-7,20,7.0455591264810963E-3,20,0,null,null,20,0,20,4.1503080157599102E-29,20,4.0803115400199546E-3,20,0]
[30,4.0136072925730753E-11,30,3.7057141792533404E-5,30,2.747951391987042E-3,30,0,null,null,30,0,30,0,30,1.5914276945018673E-3,30,0]
[40,5.1000476086822958E-9,40,3.2176595713185154E-4,40,1.0717724868760088E-3,40,0,null,null,40,3.6215455150794416E-31,40,0,40,6.2069818825680569E-4,40,0]
[50,8.5413476127952511E-8,50,1.0325585829203798E-3,50,4.1801907459933886E-4,50,0,null,null,50,0,50,0,50,2.4208840414307841E-4,50,0]
[60,5.2112588619615903E-7,60,2.0097026382421834E-3,60,1.6303822417590213E-4,60,0,null,null,60,0,60,6.1462495532366566E-18,60,9.4420729403538986E-5,60,0]
[70,1.7870321856713356E-6,70,2.9375368282116504E-3,70,6.3589055104399617E-5,70,0,null,null,70,5.7410823315825862E-24,70,0,70,3.6826490770734777E-5,70,0]
[80,4.277053354777678E-6,80,3.5916485601926334E-3,80,2.4801291337316453E-5,80,0,null,null,80,0,80,2.586490910410325E-15,80,1.4363237780333207E-5,80,0]
[90,8.0592727804916018E-6,90,3.9024204002592877E-3,90,9.6730552576664713E-6,90,0,null,null,90,7.6318608456652944E-22,90,1.4013919222152468E-13,90,5.601984451722273E-6,90,0]
[100,1.2854504696747654E-5,100,3.9084445769111929E-3,100,3.7726510413373119E-6,100,0,null,null,100,0,100,3.5015732307386344E-12,100,2.1848678922474095E-6,100,0]
[120,2.3500030737917005E-5,120,3.3463773202112215E-3,120,5.7377248062127244E-7,120,0,null,null,120,8.2491400283878751E-20,120,4.0730076182217979E-10,120,3.3229208246094993E-7,120,0]
[140,3.2514895972245432E-5,140,2.5178257109880232E-3,140,8.7162950738297291E-8,140,0,null,null,140,0,140,1.1260638456868917E-8,140,5.0479711064718681E-8,140,0]
[160,3.7980176973298909E-5,160,1.7582648387241995E-3,160,1.3144429736841738E-8,160,0,null,null,160,2.1540650873158318E-17,160,1.2684693596655163E-7,160,7.6125767611720552E-9,160,0]
[180,3.9781574008728398E-5,180,1.1736205598372941E-3,180,1.8894064588299608E-9,180,0,null,null,180,1.1858665234827275E-15,180,7.858279572211632E-7,180,1.0940565023111207E-9,180,0]
[200,3.8721641824022183E-5,200,7.6148706206248268E-4,200,1.8185962821134149E-10,200,0,null,null,200,3.087701829559206E-14,200,3.206502234634766E-6,200,1.0490620391022128E-10,200,0]
[250,2.9834993157150635E-5,250,2.4152765449591689E-4,250,0,250,0,null,null,250,9.6742016213983573E-12,250,3.3732951449498379E-5,250,0,250,0]
[]
[]
["Pollutant Linkage: Infill, Geo Barrier, Sst Unsaturated, Sst Saturated, Principal Aquifer",null,null,null,null,null,null,null,null,null,"Pollutant Linkage: Infill, Geo Barrier, Sst Unsaturated, Sst Saturated, Principal Aquifer at Site Boundary"]
["Remedial Target Concentrations in mg/L in Infill",null,null,null,null,null,null,null,null,null,"Remedial Target Concentrations in mg/L in Infill"]
[]
[null,"Species1",null,"Species2",null,"Species3",null,"Species4",null,null,null,"Species1",null,"Species2",null,"Species3",null,"Species4"]
["Time(years)","Hg","Time(years)","Pb","Time(years)","Benzene","Time(years)","BaP",null,null,"Time(years)","Hg","Time(years)","Pb","Time(years)","Benzene","Time(years)","BaP"]
[1,1E+40,1,1E+40,1,2.3945923023469724E-2,1,1E+40,null,null,1,1E+40,1,1E+40,1,5.4753545807330883E-2,1,1E+40]
[2,1E+40,2,6.2140140153622887E+25,2,2.6064928457017959E-2,2,1E+40,null,null,2,1E+40,2,1E+40,2,4.5053800191271171E-2,2,1E+40]
[5,1E+40,5,3.0043680306301352E+16,5,3.4572033614848313E-2,5,1E+40,null,null,5,1E+40,5,1E+40,5,5.9696253204877793E-2,5,1E+40]
[10,787140799543842.88,10,640055646.63025761,10,5.5357711519489192E-2,10,1E+40,null,null,10,1E+40,10,1E+40,10,9.558731748995361E-2,10,1E+40]
[15,2012089004055.6191,15,34331.917565284566,15,8.8640323297955612E-2,15,1E+40,null,null,15,1E+40,15,1E+40,15,0.1530570978391271,15,1E+40]
[20,52351024.292701408,20,280.03596122016182,20,0.14193337704618056,20,1E+40,null,null,20,1E+40,20,2.409459722513879E+24,20,0.245079325485796,20,1E+40]
[30,2491.5242750590883,30,2.69853515848189,30,0.36390745590186757,30,1E+40,null,null,30,1E+40,30,1E+40,30,0.62836659400539707,30,1E+40]
[40,19.607660099047017,40,0.31078489748069443,40,0.93303384089919073,40,1E+40,null,null,40,2.7612520561627245E+23,40,1E+40,40,1.6110889622675413,40,1E+40]
[50,1.1707754388803513,50,9.6846805260356814E-2,50,2.3922353327021639,50,1E+40,null,null,50,1E+40,50,1E+40,50,4.1307224257176021,50,1E+40]
[60,0.19189221385628619,60,4.975860512750608E-2,60,6.1335309867034544,60,1E+40,null,null,60,1E+40,60,16270084566829.756,60,10.590894672356969,60,1E+40]
[70,5.5958701136898069E-2,70,3.4042126396379248E-2,70,15.725976716562529,70,1E+40,null,null,70,1.7418318397888926E+16,70,1E+40,70,27.154365758756427,70,1E+40]
[80,2.3380582776292728E-2,80,2.7842367738406076E-2,80,40.320481155567201,80,1E+40,null,null,80,1E+40,80,38662420810.184036,80,69.622185143327854,80,1E+40]
[90,1.2408067417951347E-2,90,2.5625122294193555E-2,90,103.37995321668824,90,1E+40,null,null,90,131029642733590.33,90,713576255.25574064,90,178.50817127715521,90,1E+40]
[100,7.7793740295027652E-3,100,2.5585625696406589E-2,100,265.06559685560654,100,1E+40,null,null,100,1E+40,100,28558591.641650643,100,457.69357659944149,100,1E+40]
[120,4.2553135830010322E-3,120,2.988306172051395E-2,120,1742.8511017419564,120,1E+40,null,null,120,1212247575575.9834,120,245518.81403958242,120,3009.4006230723758,120,1E+40]
[140,3.0755134534448318E-3,140,3.9716807864655125E-2,140,11472.764420314928,140,1E+40,null,null,140,1E+40,140,8880.4911358290392,140,19809.939060822413,140,1E+40]
[160,2.6329524496503192E-3,160,5.6874253410288407E-2,160,76077.853510613684,160,1E+40,null,null,160,4642385255.1553783,160,788.35171884931526,160,131361.56539011857,160,1E+40]
[180,2.5137265805033056E-3,180,8.5206414596097041E-2,180,529266.74158786505,180,1E+40,null,null,180,84326522.437207952,180,127.25431703094273,180,914029.57515225897,180,1E+40]
[200,2.582535122205533E-3,200,0.13132199479417372,200,5498746.5323413434,200,1E+40,null,null,200,3238654.6862355489,200,31.186630378690637,200,9532324.7122334149,200,1E+40]
[250,3.3517688264001742E-3,250,0.41403126366090942,250,1E+40,250,1E+40,null,null,250,10336.770300384282,250,2.9644604371399303,250,1E+40,250,1E+40]
[]
["Compared with source concentrations in mg/L",null,null,null,null,null,null,null,null,null,"Compared with source concentrations in mg/L"]
[null,0.01,null,0.5,null,1,null,100,null,null,null,0.01,null,0.5,null,1,null,100]
[]
[]
["Pollutant Linkage: Infill, Geo Barrier, Sst Unsaturated, Sst Saturated, Principal Aquifer",null,null,null,null,null,null,null,null,null,"Pollutant Linkage: Infill, Geo Barrier, Sst Unsaturated, Sst Saturated, Principal Aquifer at Site Boundary"]
["Dilution Factor",null,null,null,null,null,null,null,null,null,"Dilution Factor"]
[]
[null,12.83921468512464,"for all species and timeslices",null,null,null,null,null,null,null,null,12.83921468512464,"for all species and timeslices"]
[]
[]
["Pollutant Linkage: Infill, Geo Barrier, Sst Unsaturated, Sst Saturated, Principal Aquifer",null,null,null,null,null,null,null,null,null,"Pollutant Linkage: Infill, Geo Barrier, Sst Unsaturated, Sst Saturated, Principal Aquifer at Site Boundary"]
["Attenuation Factor",null,null,null,null,null,null,null,null,null,"Attenuation Factor"]
[]
[null,"Species1",null,"Species2",null,"Species3",null,"Species4",null,null,null,"Species1",null,"Species2",null,"Species3",null,"Species4"]
["Time(years)","Hg","Time(years)","Pb","Time(years)","Benzene","Time(years)","BaP",null,null,"Time(years)","Hg","Time(years)","Pb","Time(years)","Benzene","Time(years)","BaP"]
[1,1E+40,1,3.8943191796558557E-2,1,1E+40,1,7.7886383593117108,null,null,1,1E+40,1,3.8943191796558557E-2,1,1E+40,1,7.7886383593117108]
[2,1E+40,2,1.9471595898279279E-2,2,4.839870792535131E+28,2,3.8943191796558554,null,null,2,1E+40,2,1.9471595898279279E-2,2,1E+40,2,3.8943191796558554]
[5,1E+40,5,7.7886383593117111E-3,5,2.339993608885565E+19,5,1.5577276718623423,null,null,5,1E+40,5,7.7886383593117111E-3,5,1E+40,5,1.5577276718623423]
[10,6.1307550255064648E+18,10,3.8943191796558555E-3,10,498516196143.84857,10,0.77886383593117114,null,null,10,1E+40,10,3.8943191796558555E-3,10,1E+40,10,0.77886383593117114]
[15,1.5671433599336892E+16,15,2.596212786437237E-3,15,26739889.009770285,15,0.51924255728744739,null,null,15,1E+40,15,2.596212786437237E-3,15,1E+40,15,0.51924255728744739]
[20,407743195955.39331,20,1.9471595898279278E-3,20,218109.88295460789,20,0.38943191796558557,null,null,20,1E+40,20,1.9471595898279278E-3,20,1.876641041998815E+27,20,0.38943191796558557]
[30,19405581.541881513,30,1.2981063932186185E-3,30,2101.7914449303357,30,0.2596212786437237,null,null,30,1E+40,30,1.2981063932186185E-3,30,1E+40,30,0.2596212786437237]
[40,152716.97358378326,40,9.7357979491396389E-4,40,242.05911740128943,40,0.19471595898279279,null,null,40,2.1506393684357328E+27,40,9.7357979491396389E-4,40,1E+40,40,0.19471595898279279]
[50,9118.746493403507,50,7.7886383593117115E-4,50,75.43047424276061,50,0.15577276718623423,null,null,50,1E+40,50,7.7886383593117115E-4,50,1E+40,50,0.15577276718623423]
[60,1494.5790576943166,60,6.4905319660930926E-4,60,38.75517806019382,60,0.12981063932186185,null,null,60,1E+40,60,6.4905319660930926E-4,60,1.2672180476645568E+16,60,0.12981063932186185]
[70,435.84208621210411,70,5.563313113794079E-4,70,26.51418114833772,70,0.11126626227588159,null,null,70,1.3566498282850258E+20,70,5.563313113794079E-4,70,1E+40,70,0.11126626227588159]
[80,182.10290387449621,80,4.8678989745698194E-4,80,21.685413338141238,80,9.7357979491396393E-2,null,null,80,1E+40,80,4.8678989745698194E-4,80,30112761378605.07,80,9.7357979491396393E-2]
[90,96.641949856381672,90,4.327021310728728E-4,90,19.95848104626096,90,8.6540426214574556E-2,null,null,90,1.0205425016017505E+18,90,4.327021310728728E-4,90,555778739397.88672,90,8.6540426214574556E-2]
[100,60.590730977618549,100,3.8943191796558558E-4,100,19.927718574602377,100,7.7886383593117114E-2,null,null,100,1E+40,100,3.8943191796558558E-4,100,22243254234.807899,100,7.7886383593117114E-2]
[120,33.143098603462001,120,3.2452659830465463E-4,120,23.274836081007436,120,6.4905319660930924E-2,null,null,120,9441757968113726,120,3.2452659830465463E-4,120,191225725.296141,120,6.4905319660930924E-2]
[140,23.95406205807965,140,2.7816565568970395E-4,140,30.933985324406596,140,5.5633131137940793E-2,null,null,140,1E+40,140,2.7816565568970395E-4,140,6916693.391004568,140,5.5633131137940793E-2]
[160,20.507114447590212,160,2.4339494872849097E-4,160,44.297299176858722,160,4.8678989745698197E-2,null,null,160,36157859877006.266,160,2.4339494872849097E-4,160,614018.64380590979,160,4.8678989745698197E-2]
[180,19.578507269729503,180,2.163510655364364E-4,180,66.364194918257866,180,4.3270213107287278E-2,null,null,180,656788787361.79749,180,2.163510655364364E-4,180,99113.785501521401,180,4.3270213107287278E-2]
[200,20.114432117079772,200,1.9471595898279279E-4,200,102.28195260752344,200,3.8943191796558557E-2,null,null,200,25224710121.778828,200,1.9471595898279279E-4,200,24290.138566514579,200,3.8943191796558557E-2]
[250,26.105715252845588,250,1.5577276718623423E-4,250,322.473978210366,250,3.1154553437246844E-2,null,null,250,80509365.672967061,250,1.5577276718623423E-4,250,2308.9110275370022,250,3.1154553437246844E-2]

{"sheet":"Principal Aquif","index":9,"n_rows":7,"n_cols":6,"rows_kept":7,"cut":false,"hidden":true,"merged":[]}
["RECEPTOR: Principal Aquif"]
[]
["Receptor Options"]
[]
[null,null,null,null,null,"No further dilution along pathway"]
[]
[null,null,null,null,null,"No data requirement"]